{"text_format":"1","workbook":"xlsx","n_sheets":3,"sheets":["Instructions","Calculator","Sheet1"],"not_rendered":{"charts":0,"images":4,"macros":1,"external_links":0,"defined_names":4,"comments":1,"pivot_tables":0},"unopened":[],"bounds":{"document_bytes":16777216,"sheet_cells":100000,"rows_first":2000,"rows_last":500,"rows_between":2000,"halvings":0,"cell_chars":16384,"cell_head_chars":4096},"cells_cut":0,"cells_raw":0,"read":"whole","date_system":"1900"}

{"sheet":"Instructions","index":0,"n_rows":2,"n_cols":50,"rows_kept":2,"cut":false,"hidden":false,"merged":[[1,1,1,11],[1,13,1,23],[1,25,1,35],[1,37,1,47],[1,49,1,59]]}
[]
[null,"Instructions for Using the CT Calculator Spreadsheet",null,null,null,null,null,null,null,null,null,null,null,"Instructions for Using the CT Calculator Spreadsheet",null,null,null,null,null,null,null,null,null,null,null,"Instructions for Using the CT Calculator Spreadsheet",null,null,null,null,null,null,null,null,null,null,null,"Instructions for Using the CT Calculator Spreadsheet",null,null,null,null,null,null,null,null,null,null,null,"Instructions for Using the CT Calculator Spreadsheet"]

{"sheet":"Calculator","index":1,"n_rows":113,"n_cols":102,"rows_kept":113,"cut":false,"hidden":false,"merged":[[85,100,85,101],[101,100,101,101],[37,100,37,101],[21,100,21,101],[53,100,53,101],[69,100,69,101],[13,97,14,98],[13,2,13,11],[11,67,12,69],[13,84,14,87],[13,88,14,91],[13,92,14,94],[13,95,14,96],[14,14,14,15],[0,1,0,14],[1,1,1,14],[2,1,2,14],[3,1,3,14],[11,65,12,66],[11,12,12,15],[10,5,10,10],[6,11,6,14],[8,11,8,14],[6,3,6,8],[8,3,8,8],[13,0,14,1],[11,0,12,11],[15,0,15,1],[14,12,14,13],[15,12,16,13],[13,12,13,15],[16,0,16,1],[15,14,16,15],[18,5,18,9],[34,5,34,9],[36,1,36,11],[36,12,36,14],[50,5,50,9],[20,12,20,14],[20,1,20,11],[19,2,19,4],[19,7,19,8],[19,12,19,14],[52,1,52,11],[52,12,52,14],[53,1,53,2],[37,1,37,2],[21,1,21,2],[35,2,35,4],[35,7,35,8],[35,12,35,14],[51,2,51,4],[51,7,51,8],[51,12,51,14],[66,5,66,9],[68,1,68,11],[68,12,68,14],[69,1,69,2],[82,5,82,9],[67,2,67,4],[67,7,67,8],[67,12,67,14],[101,1,101,2],[84,1,84,11],[84,12,84,14],[85,1,85,2],[98,5,98,9],[100,1,100,11],[100,12,100,14],[83,2,83,4],[83,7,83,8],[83,12,83,14],[99,2,99,4],[99,7,99,8],[99,12,99,14]]}
[null,"CT Calculator Worksheet"]
[null,"FOR PUBLIC WATER SYSTEMS THAT ARE USING SURFACE WATER SOURCES",null,null,null,null,null,null,null,null,null,null,null,null,null,null,null,null,null,null,null,null,null,null,null,null,null,null,null,null,null,null,null,null,null,null,null,null,null,null,null,null,null,null,null,null,null,null,null,null,null,null,null,null,null,null,null,"NUMBER OF TREATMENT TRAINS"]
[null,"OR GROUND WATER SOURCES UNDER THE INFLUENCE OF SURFACE WATER",null,null,null,null,null,null,null,null,null,null,null,null,null,null,null,null,null,null,null,null,null,null,null,null,null,null,null,null,null,null,null,null,null,null,null,null,null,null,null,null,null,null,null,null,null,null,null,"BLANK FORM",null,{"$f":"IF(COUNTA(D24:G33,D40:G49,D56:G65,D72:G81,D88:G97,D104:G113)=0,1,0)","v":1},null,null,null,"D1","D2","D3","D4","D5","D6","D7","D8","D9","D10","TOTAL"]
[null,null,null,null,null,null,null,null,null,null,null,null,null,null,null,null,null,null,null,null,null,null,null,null,null,null,null,null,null,null,null,null,null,null,null,null,null,null,null,null,null,null,null,null,null,null,null,null,null,"DISINFECTION ZONES",null,3,null,null,null,1,1,1,null,null,null,null,null,null,null,{"$f":"IF(AZ4=\"\",\"missing\",SUM(BD4:BM4))","v":3}]
[]
[null,"PUBLIC WATER",null,null,null,null,null,null,null,"PLANT NAME",null,null,null,null,null,null,null,null,null,null,null,null,null,null,null,null,null,null,null,null,null,null,null,null,null,null,null,null,null,null,null,null,null,null,null,null,null,null,null,null,null,null,null,null,"Disinfection Zone Labels",{"$f":"IF(AZ4=\"missing\",VALUE(RIGHT(BD3,LEN(BD3)-1)),IF(BD4=1,1,\"1A\"))","v":1},{"$f":"IF(AZ4=\"missing\",VALUE(RIGHT(BE3,LEN(BE3)-1)),IF(ISNUMBER(BD6),IF(OFFSET(BD4,0,BD6,1,1)>1,BD6+1&\"A\",BD6+1),IF(SUM(OFFSET(BD4,0,0,1,LEFT(BD6,LEN(BD6)-1)))>=VALUE(RIGHT(BE3,LEN(BE3)-1)),LEFT(BD6,LEN(BD6)-1)&CHAR(CODE(RIGHT(BD6,1))+1),IF(OFFSET(BD4,0,LEFT(BD6,LEN(BD6)-1),1,1)>1,LEFT(BD6,LEN(BD6)-1)+1&\"A\",LEFT(BD6,LEN(BD6)-1)+1))))","v":2},{"$f":"IF(AZ4=\"missing\",VALUE(RIGHT(BF3,LEN(BF3)-1)),IF(ISNUMBER(BE6),IF(OFFSET(BD4,0,BE6,1,1)>1,BE6+1&\"A\",BE6+1),IF(SUM(OFFSET(BD4,0,0,1,LEFT(BE6,LEN(BE6)-1)))>=VALUE(RIGHT(BF3,LEN(BF3)-1)),LEFT(BE6,LEN(BE6)-1)&CHAR(CODE(RIGHT(BE6,1))+1),IF(OFFSET(BD4,0,LEFT(BE6,LEN(BE6)-1),1,1)>1,LEFT(BE6,LEN(BE6)-1)+1&\"A\",LEFT(BE6,LEN(BE6)-1)+1))))","v":3},{"$f":"IF(AZ4=\"missing\",VALUE(RIGHT(BG3,LEN(BG3)-1)),IF(ISNUMBER(BF6),IF(OFFSET(BD4,0,BF6,1,1)>1,BF6+1&\"A\",BF6+1),IF(SUM(OFFSET(BD4,0,0,1,LEFT(BF6,LEN(BF6)-1)))>=VALUE(RIGHT(BG3,LEN(BG3)-1)),LEFT(BF6,LEN(BF6)-1)&CHAR(CODE(RIGHT(BF6,1))+1),IF(OFFSET(BD4,0,LEFT(BF6,LEN(BF6)-1),1,1)>1,LEFT(BF6,LEN(BF6)-1)+1&\"A\",LEFT(BF6,LEN(BF6)-1)+1))))","v":4},{"$f":"IF(AZ4=\"missing\",VALUE(RIGHT(BH3,LEN(BH3)-1)),IF(ISNUMBER(BG6),IF(OFFSET(BD4,0,BG6,1,1)>1,BG6+1&\"A\",BG6+1),IF(SUM(OFFSET(BD4,0,0,1,LEFT(BG6,LEN(BG6)-1)))>=VALUE(RIGHT(BH3,LEN(BH3)-1)),LEFT(BG6,LEN(BG6)-1)&CHAR(CODE(RIGHT(BG6,1))+1),IF(OFFSET(BD4,0,LEFT(BG6,LEN(BG6)-1),1,1)>1,LEFT(BG6,LEN(BG6)-1)+1&\"A\",LEFT(BG6,LEN(BG6)-1)+1))))","v":5},{"$f":"IF(AZ4=\"missing\",VALUE(RIGHT(BI3,LEN(BI3)-1)),IF(ISNUMBER(BH6),IF(OFFSET(BD4,0,BH6,1,1)>1,BH6+1&\"A\",BH6+1),IF(SUM(OFFSET(BD4,0,0,1,LEFT(BH6,LEN(BH6)-1)))>=VALUE(RIGHT(BI3,LEN(BI3)-1)),LEFT(BH6,LEN(BH6)-1)&CHAR(CODE(RIGHT(BH6,1))+1),IF(OFFSET(BD4,0,LEFT(BH6,LEN(BH6)-1),1,1)>1,LEFT(BH6,LEN(BH6)-1)+1&\"A\",LEFT(BH6,LEN(BH6)-1)+1))))","v":6},{"$f":"IF(AZ4=\"missing\",VALUE(RIGHT(BJ3,LEN(BJ3)-1)),IF(ISNUMBER(BI6),IF(OFFSET(BD4,0,BI6,1,1)>1,BI6+1&\"A\",BI6+1),IF(SUM(OFFSET(BD4,0,0,1,LEFT(BI6,LEN(BI6)-1)))>=VALUE(RIGHT(BJ3,LEN(BJ3)-1)),LEFT(BI6,LEN(BI6)-1)&CHAR(CODE(RIGHT(BI6,1))+1),IF(OFFSET(BD4,0,LEFT(BI6,LEN(BI6)-1),1,1)>1,LEFT(BI6,LEN(BI6)-1)+1&\"A\",LEFT(BI6,LEN(BI6)-1)+1))))","v":7},{"$f":"IF(AZ4=\"missing\",VALUE(RIGHT(BK3,LEN(BK3)-1)),IF(ISNUMBER(BJ6),IF(OFFSET(BD4,0,BJ6,1,1)>1,BJ6+1&\"A\",BJ6+1),IF(SUM(OFFSET(BD4,0,0,1,LEFT(BJ6,LEN(BJ6)-1)))>=VALUE(RIGHT(BK3,LEN(BK3)-1)),LEFT(BJ6,LEN(BJ6)-1)&CHAR(CODE(RIGHT(BJ6,1))+1),IF(OFFSET(BD4,0,LEFT(BJ6,LEN(BJ6)-1),1,1)>1,LEFT(BJ6,LEN(BJ6)-1)+1&\"A\",LEFT(BJ6,LEN(BJ6)-1)+1))))","v":8},{"$f":"IF(AZ4=\"missing\",VALUE(RIGHT(BL3,LEN(BL3)-1)),IF(ISNUMBER(BK6),IF(OFFSET(BD4,0,BK6,1,1)>1,BK6+1&\"A\",BK6+1),IF(SUM(OFFSET(BD4,0,0,1,LEFT(BK6,LEN(BK6)-1)))>=VALUE(RIGHT(BL3,LEN(BL3)-1)),LEFT(BK6,LEN(BK6)-1)&CHAR(CODE(RIGHT(BK6,1))+1),IF(OFFSET(BD4,0,LEFT(BK6,LEN(BK6)-1),1,1)>1,LEFT(BK6,LEN(BK6)-1)+1&\"A\",LEFT(BK6,LEN(BK6)-1)+1))))","v":9},{"$f":"IF(AZ4=\"missing\",VALUE(RIGHT(BM3,LEN(BM3)-1)),IF(ISNUMBER(BL6),IF(OFFSET(BD4,0,BL6,1,1)>1,BL6+1&\"A\",BL6+1),IF(SUM(OFFSET(BD4,0,0,1,LEFT(BL6,LEN(BL6)-1)))>=VALUE(RIGHT(BM3,LEN(BM3)-1)),LEFT(BL6,LEN(BL6)-1)&CHAR(CODE(RIGHT(BL6,1))+1),IF(OFFSET(BD4,0,LEFT(BL6,LEN(BL6)-1),1,1)>1,LEFT(BL6,LEN(BL6)-1)+1&\"A\",LEFT(BL6,LEN(BL6)-1)+1))))","v":10}]
[null,"SYSTEM NAME:",null,null,null,null,null,null,null,"OR NUMBER:"]
[]
[null,"PWS ID No.:",null,null,null,null,null,null,null,"Plant ID No."]
[]
[null,null,null,null,null,"DISINFECTION PROCESS PARAMETERS",null,null,null,null,null,null,null,null,null,null,null,null,null,"Disinfectant List",null,null,null,null,null,null,null,null,null,null,null,null,null,null,null,null,null,null,null,null,null,null,null,null,null,null,null,null,null,null,null,null,null,null,null,{"$f":"IF($AZ$4=\"missing\",VALUE(RIGHT(BD3,LEN(BD3)-1)),IF(BD4=1,1,\"1A\"))","v":1},{"$f":"IF($AZ$4=\"missing\",VALUE(RIGHT(BE3,LEN(BE3)-1)),IF(ISNUMBER(BD11),IF(OFFSET($BD$4,0,BD11,1,1)>1,BD11+1&\"A\",BD11+1),IF(SUM(OFFSET($BD$4,0,0,1,LEFT(BD11,LEN(BD11)-1)))>=VALUE(RIGHT(BE3,LEN(BE3)-1)),LEFT(BD11,LEN(BD11)-1)&CHAR(CODE(RIGHT(BD11,1))+1),IF(OFFSET($BD$4,0,LEFT(BD11,LEN(BD11)-1),1,1)>1,LEFT(BD11,LEN(BD11)-1)+1&\"A\",LEFT(BD11,LEN(BD11)-1)+1))))","v":2},3,4,5,6,7,8,9,10,"GIARDIA LOG",null,"VIRUS LOG"]
["APPROVED CT STUDY PARAMETERS",null,null,null,null,null,null,null,null,null,null,null,"PERFORMANCE STANDARDS",null,null,null,null,null,null,"FCL","Free chlorine",null,null,null,null,null,null,null,null,null,null,null,null,null,null,null,null,null,null,null,null,null,null,null,null,null,null,null,null,"FLOW RATE",null,null,null,null,null,{"$f":"IF(IF(ISNUMBER(BD$11),BD$11,VALUE(LEFT(BD$11,LEN(BD$11)-1)))<=IF($AZ$4=\"missing\",10,$AZ$4),IF(C16=\"\",\"missing\",IF(IF(COUNTIF($AY$24:$AY$28,0)+COUNTIF($AY$24:$AY$28,\"\")=5,C16=\"na\",AND(ISNUMBER(C16),C16>0)),C16,\"!error\")),\"\")","v":"missing"},"missing","missing","","","","","","","",{"$f":"IF(ISBLANK(M16),\"missing\",IF(IF(COUNTIF($AY$24:$AY$28,0)+COUNTIF($AY$24:$AY$28,\"\")=5,M16=\"na\",AND(ISNUMBER(M16),M16>=0,M16<=10)),M16,\"!error\"))","v":"missing"},null,{"$f":"IF(ISBLANK(O16),\"missing\",IF(IF(COUNTIF($AY$24:$AY$28,0)+COUNTIF($AY$24:$AY$28,\"\")=5,O16=\"na\",AND(ISNUMBER(O16),O16>=0,O16<=10)),O16,\"!error\"))","v":"missing"}]
[null,null,null,null,null,null,null,null,null,null,null,null,null,null,null,null,null,null,null,"ClO2","Chlorine dioxide",null,null,null,null,null,null,null,null,null,null,null,null,null,null,null,null,null,null,null,null,null,null,null,null,null,null,null,null,"T10",null,null,null,null,null,"missing","missing","missing","","","","","","","",null,null,null,null,null,null,null,null,null,null,null,null,null,null,null,null,null,null,null,"DISINFECTION DATA STATISTICS"]
["Parameters",null,"Disinfection Zones",null,null,null,null,null,null,null,null,null,"Log Inactivations",null,null,null,null,null,null,"CLA","Monochloramine (measured as total chlorine)",null,null,null,null,null,null,null,null,null,null,null,null,null,null,null,null,null,null,null,null,null,null,null,null,null,null,null,null,"NUMBER OF TREATMENT TRAINS IN ALL PRECEDING ZONES",null,null,null,null,null,{"$f":"IF($AZ$4=\"missing\",BD11-1,IF(OR(BD11=1,COUNTIF(BD11,\"=1?\")),0,SUM(OFFSET($BD$4,0,0,1,IF(ISNUMBER(BD11),BD11,VALUE(LEFT(BD11,LEN(BD11)-1)))-1))))","v":0},1,2,3,3,3,3,3,3,3,null,null,null,null,null,null,null,null,null,null,null,null,null,null,null,null,null,null,null,null,null,null,null,"MAXIMUM",null,null,null,"MINIMUM",null,null,"AVERAGE",null,"STANDARD DEVIATION"]
[null,null,{"$f":"BD11","v":1},2,3,4,5,6,7,8,9,10,"Giardia lamblia Cysts",null,"Viruses",null,null,null,null,"O3","Ozone (any cell)",null,null,null,null,null,null,null,null,null,null,null,null,null,null,null,null,null,null,null,null,null,null,null,null,null,null,null,null,"NUMBER OF TREATMENT TRAINS",null,null,null,null,null,{"$f":"IF($AZ$4=\"missing\",1,OFFSET($BD$4,0,IF(ISNUMBER(BD11),BD11,LEFT(BD11,LEN(BD11)-1))-1,1,1))","v":1},1,1,0,0,0,0,0,0,0]
["   Flow Rate (MGD)",null,null,null,null,null,null,null,null,null,null,null,null,null,null,null,null,null,null,"O3 cell 1","Ozone (cell 1)",null,null,null,null,null,null,null,null,null,null,null,null,null,null,null,null,null,null,null,null,null,null,null,null,null,null,null,null,null,null,null,null,null,null,null,null,null,null,null,null,null,null,null,null,null,null,null,null,null,null,null,null,null,null,null,null,null,null,null,null,null,null,null," GIARDIA LOG",null,null,null,{"$f":"IF(COUNTIF(CG24:CG28,\"!error\")>0,\"!error\",IF(OR(COUNT(CG24:CG28)=0,COUNT(CG24:CG28)=COUNTIF(CH24:CH28,\"~*\")),\"NA \",DMAX(CG23:CH28,CG23,CM29:CM30)))","v":"NA "},null,null,null,{"$f":"IF(COUNTIF(CG24:CG28,\"!error\")>0,\"!error\",IF(OR(COUNT(CG24:CG28)=0,COUNT(CG24:CG28)=COUNTIF(CH24:CH28,\"~*\")),\"NA \",DMIN(CG23:CH28,CG23,CM29:CM30)))","v":"NA "},null,null,{"$f":"IF(COUNTIF(CG24:CG28,\"!error\")>0,\"!error\",IF(OR(COUNT(CG24:CG28)=0,COUNT(CG24:CG28)=COUNTIF(CH24:CH28,\"~*\")),\"NA \",DAVERAGE(CG23:CH28,CG23,CM29:CM30)))","v":"NA "},null,{"$f":"IF(COUNTIF(CG24:CG28,\"!error\")>0,\"!error\",IF(OR(COUNT(CG24:CG28)=0,COUNT(CG24:CG28)=COUNTIF(CH24:CH28,\"~*\")),\"NA \",DSTDEVP(CG23:CH28,CG23,CM29:CM30)))","v":"NA "}]
["   T10 (minutes)",null,null,null,null,null,null,null,null,null,null,null,null,null,null,null,null,null,null,"NA","No disinfectant applied at or upstream of this zone or train",null,null,null,null,null,null,null,null,null,null,null,null,null,null,null,null,null,null,null,null,null,null,null,null,null,null,null,null,"DROP-DOWN LIST",null,null,null,null,null,null,null,null,null,null,null,null,null,null,null,null,null,null,null,null,null,null,null,null,null,null,null,null,null,null,null,null,null,null," VIRUS LOG",null,null,null,{"$f":"IF(COUNTIF(CK24:CK28,\"!error\")>0,\"!error\",IF(OR(COUNT(CK24:CK28)=0,COUNT(CK24:CK28)=COUNTIF(CL24:CL28,\"~*\")),\"NA \",DMAX(CK23:CL28,CK23,CQ29:CQ30)))","v":"NA "},null,null,null,{"$f":"IF(COUNTIF(CK24:CK28,\"!error\")>0,\"!error\",IF(OR(COUNT(CK24:CK28)=0,COUNT(CK24:CK28)=COUNTIF(CL24:CL28,\"~*\")),\"NA \",DMIN(CK23:CL28,CK23,CQ29:CQ30)))","v":"NA "},null,null,{"$f":"IF(COUNTIF(CK24:CK28,\"!error\")>0,\"!error\",IF(OR(COUNT(CK24:CK28)=0,COUNT(CK24:CK28)=COUNTIF(CL24:CL28,\"~*\")),\"NA \",DAVERAGE(CK23:CL28,CK23,CQ29:CQ30)))","v":"NA "},null,{"$f":"IF(COUNTIF(CK24:CK28,\"!error\")>0,\"!error\",IF(OR(COUNT(CK24:CK28)=0,COUNT(CK24:CK28)=COUNTIF(CL24:CL28,\"~*\")),\"NA \",DSTDEVP(CK23:CL28,CK23,CQ29:CQ30)))","v":"NA "}]
[null,null,null,null,null,null,null,null,null,null,null,null,null,null,null,null,null,null,null,null,null,null,null,null,null,null,null,null,null,null,null,null,null,null,null,null,null,null,null,null,null,null,null,null,null,null,null,null,null,"DISINFECTANT",null,null,null,null," ","FCL","CLO2","CLA","O3","O3 Cell 1","NA"]
[null,null,null,null,null,"DISINFECTION PROCESS DATA ",null,null,null,null,null,null,null,null,null,null,null,null,null,null,null,null,null,null,null,null,null,null,null,null,null,null,null,null,null,null,null,null,null,null,null,null,null,null,null,null,null,null,null,"DISINFECTANT LIST 5B",null,null,null,null," ","FCL","CLO2","CLA","O3","NA"]
[null,"DATE:",null,null,null,{"$f":"OR(AND(COUNTA(D24:G33)=0,C20=\"\"),IsDate(C20))","v":true},"TIME:",null,null,null,null,"Operator Initials:"]
{"$rows_left_out":94}
{"sheet":"Sheet1","index":2,"n_rows":0,"n_cols":0,"rows_kept":0,"cut":false,"hidden":false,"merged":[]}