{"text_format":"1","workbook":"xlsx","n_sheets":3,"sheets":["Instructions","Calculator","Sheet1"],"not_rendered":{"charts":0,"images":4,"macros":1,"external_links":0,"defined_names":4,"comments":1,"pivot_tables":0},"unopened":[],"bounds":{"document_bytes":16777216,"sheet_cells":100000,"rows_first":2000,"rows_last":500,"rows_between":2000,"halvings":0,"cell_chars":16384,"cell_head_chars":4096},"cells_cut":0,"cells_raw":0,"read":"whole","date_system":"1900"}

{"sheet":"Instructions","index":0,"n_rows":2,"n_cols":50,"rows_kept":2,"cut":false,"hidden":false,"merged":[[1,1,1,11],[1,13,1,23],[1,25,1,35],[1,37,1,47],[1,49,1,59]]}
[]
[null,"Instructions for Using the CT Calculator Spreadsheet",null,null,null,null,null,null,null,null,null,null,null,"Instructions for Using the CT Calculator Spreadsheet",null,null,null,null,null,null,null,null,null,null,null,"Instructions for Using the CT Calculator Spreadsheet",null,null,null,null,null,null,null,null,null,null,null,"Instructions for Using the CT Calculator Spreadsheet",null,null,null,null,null,null,null,null,null,null,null,"Instructions for Using the CT Calculator Spreadsheet"]

{"sheet":"Calculator","index":1,"n_rows":113,"n_cols":102,"rows_kept":113,"cut":false,"hidden":false,"merged":[[85,100,85,101],[101,100,101,101],[37,100,37,101],[21,100,21,101],[53,100,53,101],[69,100,69,101],[13,97,14,98],[13,2,13,11],[11,67,12,69],[13,84,14,87],[13,88,14,91],[13,92,14,94],[13,95,14,96],[14,14,14,15],[0,1,0,14],[1,1,1,14],[2,1,2,14],[3,1,3,14],[11,65,12,66],[11,12,12,15],[10,5,10,10],[6,11,6,14],[8,11,8,14],[6,3,6,8],[8,3,8,8],[13,0,14,1],[11,0,12,11],[15,0,15,1],[14,12,14,13],[15,12,16,13],[13,12,13,15],[16,0,16,1],[15,14,16,15],[18,5,18,9],[34,5,34,9],[36,1,36,11],[36,12,36,14],[50,5,50,9],[20,12,20,14],[20,1,20,11],[19,2,19,4],[19,7,19,8],[19,12,19,14],[52,1,52,11],[52,12,52,14],[53,1,53,2],[37,1,37,2],[21,1,21,2],[35,2,35,4],[35,7,35,8],[35,12,35,14],[51,2,51,4],[51,7,51,8],[51,12,51,14],[66,5,66,9],[68,1,68,11],[68,12,68,14],[69,1,69,2],[82,5,82,9],[67,2,67,4],[67,7,67,8],[67,12,67,14],[101,1,101,2],[84,1,84,11],[84,12,84,14],[85,1,85,2],[98,5,98,9],[100,1,100,11],[100,12,100,14],[83,2,83,4],[83,7,83,8],[83,12,83,14],[99,2,99,4],[99,7,99,8],[99,12,99,14]]}
[null,"CT Calculator Worksheet"]
[null,"FOR PUBLIC WATER SYSTEMS THAT ARE USING SURFACE WATER SOURCES",null,null,null,null,null,null,null,null,null,null,null,null,null,null,null,null,null,null,null,null,null,null,null,null,null,null,null,null,null,null,null,null,null,null,null,null,null,null,null,null,null,null,null,null,null,null,null,null,null,null,null,null,null,null,null,"NUMBER OF TREATMENT TRAINS"]
[null,"OR GROUND WATER SOURCES UNDER THE INFLUENCE OF SURFACE WATER",null,null,null,null,null,null,null,null,null,null,null,null,null,null,null,null,null,null,null,null,null,null,null,null,null,null,null,null,null,null,null,null,null,null,null,null,null,null,null,null,null,null,null,null,null,null,null,"BLANK FORM",null,{"$f":"IF(COUNTA(D24:G33,D40:G49,D56:G65,D72:G81,D88:G97,D104:G113)=0,1,0)","v":1},null,null,null,"D1","D2","D3","D4","D5","D6","D7","D8","D9","D10","TOTAL"]
[null,null,null,null,null,null,null,null,null,null,null,null,null,null,null,null,null,null,null,null,null,null,null,null,null,null,null,null,null,null,null,null,null,null,null,null,null,null,null,null,null,null,null,null,null,null,null,null,null,"DISINFECTION ZONES",null,3,null,null,null,1,1,1,null,null,null,null,null,null,null,{"$f":"IF(AZ4=\"\",\"missing\",SUM(BD4:BM4))","v":3}]
[]
[null,"PUBLIC WATER",null,null,null,null,null,null,null,"PLANT NAME",null,null,null,null,null,null,null,null,null,null,null,null,null,null,null,null,null,null,null,null,null,null,null,null,null,null,null,null,null,null,null,null,null,null,null,null,null,null,null,null,null,null,null,null,"Disinfection Zone Labels",{"$f":"IF(AZ4=\"missing\",VALUE(RIGHT(BD3,LEN(BD3)-1)),IF(BD4=1,1,\"1A\"))","v":1},{"$f":"IF(AZ4=\"missing\",VALUE(RIGHT(BE3,LEN(BE3)-1)),IF(ISNUMBER(BD6),IF(OFFSET(BD4,0,BD6,1,1)>1,BD6+1&\"A\",BD6+1),IF(SUM(OFFSET(BD4,0,0,1,LEFT(BD6,LEN(BD6)-1)))>=VALUE(RIGHT(BE3,LEN(BE3)-1)),LEFT(BD6,LEN(BD6)-1)&CHAR(CODE(RIGHT(BD6,1))+1),IF(OFFSET(BD4,0,LEFT(BD6,LEN(BD6)-1),1,1)>1,LEFT(BD6,LEN(BD6)-1)+1&\"A\",LEFT(BD6,LEN(BD6)-1)+1))))","v":2},{"$f":"IF(AZ4=\"missing\",VALUE(RIGHT(BF3,LEN(BF3)-1)),IF(ISNUMBER(BE6),IF(OFFSET(BD4,0,BE6,1,1)>1,BE6+1&\"A\",BE6+1),IF(SUM(OFFSET(BD4,0,0,1,LEFT(BE6,LEN(BE6)-1)))>=VALUE(RIGHT(BF3,LEN(BF3)-1)),LEFT(BE6,LEN(BE6)-1)&CHAR(CODE(RIGHT(BE6,1))+1),IF(OFFSET(BD4,0,LEFT(BE6,LEN(BE6)-1),1,1)>1,LEFT(BE6,LEN(BE6)-1)+1&\"A\",LEFT(BE6,LEN(BE6)-1)+1))))","v":3},{"$f":"IF(AZ4=\"missing\",VALUE(RIGHT(BG3,LEN(BG3)-1)),IF(ISNUMBER(BF6),IF(OFFSET(BD4,0,BF6,1,1)>1,BF6+1&\"A\",BF6+1),IF(SUM(OFFSET(BD4,0,0,1,LEFT(BF6,LEN(BF6)-1)))>=VALUE(RIGHT(BG3,LEN(BG3)-1)),LEFT(BF6,LEN(BF6)-1)&CHAR(CODE(RIGHT(BF6,1))+1),IF(OFFSET(BD4,0,LEFT(BF6,LEN(BF6)-1),1,1)>1,LEFT(BF6,LEN(BF6)-1)+1&\"A\",LEFT(BF6,LEN(BF6)-1)+1))))","v":4},{"$f":"IF(AZ4=\"missing\",VALUE(RIGHT(BH3,LEN(BH3)-1)),IF(ISNUMBER(BG6),IF(OFFSET(BD4,0,BG6,1,1)>1,BG6+1&\"A\",BG6+1),IF(SUM(OFFSET(BD4,0,0,1,LEFT(BG6,LEN(BG6)-1)))>=VALUE(RIGHT(BH3,LEN(BH3)-1)),LEFT(BG6,LEN(BG6)-1)&CHAR(CODE(RIGHT(BG6,1))+1),IF(OFFSET(BD4,0,LEFT(BG6,LEN(BG6)-1),1,1)>1,LEFT(BG6,LEN(BG6)-1)+1&\"A\",LEFT(BG6,LEN(BG6)-1)+1))))","v":5},{"$f":"IF(AZ4=\"missing\",VALUE(RIGHT(BI3,LEN(BI3)-1)),IF(ISNUMBER(BH6),IF(OFFSET(BD4,0,BH6,1,1)>1,BH6+1&\"A\",BH6+1),IF(SUM(OFFSET(BD4,0,0,1,LEFT(BH6,LEN(BH6)-1)))>=VALUE(RIGHT(BI3,LEN(BI3)-1)),LEFT(BH6,LEN(BH6)-1)&CHAR(CODE(RIGHT(BH6,1))+1),IF(OFFSET(BD4,0,LEFT(BH6,LEN(BH6)-1),1,1)>1,LEFT(BH6,LEN(BH6)-1)+1&\"A\",LEFT(BH6,LEN(BH6)-1)+1))))","v":6},{"$f":"IF(AZ4=\"missing\",VALUE(RIGHT(BJ3,LEN(BJ3)-1)),IF(ISNUMBER(BI6),IF(OFFSET(BD4,0,BI6,1,1)>1,BI6+1&\"A\",BI6+1),IF(SUM(OFFSET(BD4,0,0,1,LEFT(BI6,LEN(BI6)-1)))>=VALUE(RIGHT(BJ3,LEN(BJ3)-1)),LEFT(BI6,LEN(BI6)-1)&CHAR(CODE(RIGHT(BI6,1))+1),IF(OFFSET(BD4,0,LEFT(BI6,LEN(BI6)-1),1,1)>1,LEFT(BI6,LEN(BI6)-1)+1&\"A\",LEFT(BI6,LEN(BI6)-1)+1))))","v":7},{"$f":"IF(AZ4=\"missing\",VALUE(RIGHT(BK3,LEN(BK3)-1)),IF(ISNUMBER(BJ6),IF(OFFSET(BD4,0,BJ6,1,1)>1,BJ6+1&\"A\",BJ6+1),IF(SUM(OFFSET(BD4,0,0,1,LEFT(BJ6,LEN(BJ6)-1)))>=VALUE(RIGHT(BK3,LEN(BK3)-1)),LEFT(BJ6,LEN(BJ6)-1)&CHAR(CODE(RIGHT(BJ6,1))+1),IF(OFFSET(BD4,0,LEFT(BJ6,LEN(BJ6)-1),1,1)>1,LEFT(BJ6,LEN(BJ6)-1)+1&\"A\",LEFT(BJ6,LEN(BJ6)-1)+1))))","v":8},{"$f":"IF(AZ4=\"missing\",VALUE(RIGHT(BL3,LEN(BL3)-1)),IF(ISNUMBER(BK6),IF(OFFSET(BD4,0,BK6,1,1)>1,BK6+1&\"A\",BK6+1),IF(SUM(OFFSET(BD4,0,0,1,LEFT(BK6,LEN(BK6)-1)))>=VALUE(RIGHT(BL3,LEN(BL3)-1)),LEFT(BK6,LEN(BK6)-1)&CHAR(CODE(RIGHT(BK6,1))+1),IF(OFFSET(BD4,0,LEFT(BK6,LEN(BK6)-1),1,1)>1,LEFT(BK6,LEN(BK6)-1)+1&\"A\",LEFT(BK6,LEN(BK6)-1)+1))))","v":9},{"$f":"IF(AZ4=\"missing\",VALUE(RIGHT(BM3,LEN(BM3)-1)),IF(ISNUMBER(BL6),IF(OFFSET(BD4,0,BL6,1,1)>1,BL6+1&\"A\",BL6+1),IF(SUM(OFFSET(BD4,0,0,1,LEFT(BL6,LEN(BL6)-1)))>=VALUE(RIGHT(BM3,LEN(BM3)-1)),LEFT(BL6,LEN(BL6)-1)&CHAR(CODE(RIGHT(BL6,1))+1),IF(OFFSET(BD4,0,LEFT(BL6,LEN(BL6)-1),1,1)>1,LEFT(BL6,LEN(BL6)-1)+1&\"A\",LEFT(BL6,LEN(BL6)-1)+1))))","v":10}]
[null,"SYSTEM NAME:",null,null,null,null,null,null,null,"OR NUMBER:"]
[]
[null,"PWS ID No.:",null,null,null,null,null,null,null,"Plant ID No."]
[]
[null,null,null,null,null,"DISINFECTION PROCESS PARAMETERS",null,null,null,null,null,null,null,null,null,null,null,null,null,"Disinfectant List",null,null,null,null,null,null,null,null,null,null,null,null,null,null,null,null,null,null,null,null,null,null,null,null,null,null,null,null,null,null,null,null,null,null,null,{"$f":"IF($AZ$4=\"missing\",VALUE(RIGHT(BD3,LEN(BD3)-1)),IF(BD4=1,1,\"1A\"))","v":1},{"$f":"IF($AZ$4=\"missing\",VALUE(RIGHT(BE3,LEN(BE3)-1)),IF(ISNUMBER(BD11),IF(OFFSET($BD$4,0,BD11,1,1)>1,BD11+1&\"A\",BD11+1),IF(SUM(OFFSET($BD$4,0,0,1,LEFT(BD11,LEN(BD11)-1)))>=VALUE(RIGHT(BE3,LEN(BE3)-1)),LEFT(BD11,LEN(BD11)-1)&CHAR(CODE(RIGHT(BD11,1))+1),IF(OFFSET($BD$4,0,LEFT(BD11,LEN(BD11)-1),1,1)>1,LEFT(BD11,LEN(BD11)-1)+1&\"A\",LEFT(BD11,LEN(BD11)-1)+1))))","v":2},3,4,5,6,7,8,9,10,"GIARDIA LOG",null,"VIRUS LOG"]
["APPROVED CT STUDY PARAMETERS",null,null,null,null,null,null,null,null,null,null,null,"PERFORMANCE STANDARDS",null,null,null,null,null,null,"FCL","Free chlorine",null,null,null,null,null,null,null,null,null,null,null,null,null,null,null,null,null,null,null,null,null,null,null,null,null,null,null,null,"FLOW RATE",null,null,null,null,null,{"$f":"IF(IF(ISNUMBER(BD$11),BD$11,VALUE(LEFT(BD$11,LEN(BD$11)-1)))<=IF($AZ$4=\"missing\",10,$AZ$4),IF(C16=\"\",\"missing\",IF(IF(COUNTIF($AY$24:$AY$28,0)+COUNTIF($AY$24:$AY$28,\"\")=5,C16=\"na\",AND(ISNUMBER(C16),C16>0)),C16,\"!error\")),\"\")","v":"missing"},"missing","missing","","","","","","","",{"$f":"IF(ISBLANK(M16),\"missing\",IF(IF(COUNTIF($AY$24:$AY$28,0)+COUNTIF($AY$24:$AY$28,\"\")=5,M16=\"na\",AND(ISNUMBER(M16),M16>=0,M16<=10)),M16,\"!error\"))","v":"missing"},null,{"$f":"IF(ISBLANK(O16),\"missing\",IF(IF(COUNTIF($AY$24:$AY$28,0)+COUNTIF($AY$24:$AY$28,\"\")=5,O16=\"na\",AND(ISNUMBER(O16),O16>=0,O16<=10)),O16,\"!error\"))","v":"missing"}]
[null,null,null,null,null,null,null,null,null,null,null,null,null,null,null,null,null,null,null,"ClO2","Chlorine dioxide",null,null,null,null,null,null,null,null,null,null,null,null,null,null,null,null,null,null,null,null,null,null,null,null,null,null,null,null,"T10",null,null,null,null,null,"missing","missing","missing","","","","","","","",null,null,null,null,null,null,null,null,null,null,null,null,null,null,null,null,null,null,null,"DISINFECTION DATA STATISTICS"]
["Parameters",null,"Disinfection Zones",null,null,null,null,null,null,null,null,null,"Log Inactivations",null,null,null,null,null,null,"CLA","Monochloramine (measured as total chlorine)",null,null,null,null,null,null,null,null,null,null,null,null,null,null,null,null,null,null,null,null,null,null,null,null,null,null,null,null,"NUMBER OF TREATMENT TRAINS IN ALL PRECEDING ZONES",null,null,null,null,null,{"$f":"IF($AZ$4=\"missing\",BD11-1,IF(OR(BD11=1,COUNTIF(BD11,\"=1?\")),0,SUM(OFFSET($BD$4,0,0,1,IF(ISNUMBER(BD11),BD11,VALUE(LEFT(BD11,LEN(BD11)-1)))-1))))","v":0},1,2,3,3,3,3,3,3,3,null,null,null,null,null,null,null,null,null,null,null,null,null,null,null,null,null,null,null,null,null,null,null,"MAXIMUM",null,null,null,"MINIMUM",null,null,"AVERAGE",null,"STANDARD DEVIATION"]
[null,null,{"$f":"BD11","v":1},2,3,4,5,6,7,8,9,10,"Giardia lamblia Cysts",null,"Viruses",null,null,null,null,"O3","Ozone (any cell)",null,null,null,null,null,null,null,null,null,null,null,null,null,null,null,null,null,null,null,null,null,null,null,null,null,null,null,null,"NUMBER OF TREATMENT TRAINS",null,null,null,null,null,{"$f":"IF($AZ$4=\"missing\",1,OFFSET($BD$4,0,IF(ISNUMBER(BD11),BD11,LEFT(BD11,LEN(BD11)-1))-1,1,1))","v":1},1,1,0,0,0,0,0,0,0]
["   Flow Rate (MGD)",null,null,null,null,null,null,null,null,null,null,null,null,null,null,null,null,null,null,"O3 cell 1","Ozone (cell 1)",null,null,null,null,null,null,null,null,null,null,null,null,null,null,null,null,null,null,null,null,null,null,null,null,null,null,null,null,null,null,null,null,null,null,null,null,null,null,null,null,null,null,null,null,null,null,null,null,null,null,null,null,null,null,null,null,null,null,null,null,null,null,null," GIARDIA LOG",null,null,null,{"$f":"IF(COUNTIF(CG24:CG28,\"!error\")>0,\"!error\",IF(OR(COUNT(CG24:CG28)=0,COUNT(CG24:CG28)=COUNTIF(CH24:CH28,\"~*\")),\"NA \",DMAX(CG23:CH28,CG23,CM29:CM30)))","v":"NA "},null,null,null,{"$f":"IF(COUNTIF(CG24:CG28,\"!error\")>0,\"!error\",IF(OR(COUNT(CG24:CG28)=0,COUNT(CG24:CG28)=COUNTIF(CH24:CH28,\"~*\")),\"NA \",DMIN(CG23:CH28,CG23,CM29:CM30)))","v":"NA "},null,null,{"$f":"IF(COUNTIF(CG24:CG28,\"!error\")>0,\"!error\",IF(OR(COUNT(CG24:CG28)=0,COUNT(CG24:CG28)=COUNTIF(CH24:CH28,\"~*\")),\"NA \",DAVERAGE(CG23:CH28,CG23,CM29:CM30)))","v":"NA "},null,{"$f":"IF(COUNTIF(CG24:CG28,\"!error\")>0,\"!error\",IF(OR(COUNT(CG24:CG28)=0,COUNT(CG24:CG28)=COUNTIF(CH24:CH28,\"~*\")),\"NA \",DSTDEVP(CG23:CH28,CG23,CM29:CM30)))","v":"NA "}]
["   T10 (minutes)",null,null,null,null,null,null,null,null,null,null,null,null,null,null,null,null,null,null,"NA","No disinfectant applied at or upstream of this zone or train",null,null,null,null,null,null,null,null,null,null,null,null,null,null,null,null,null,null,null,null,null,null,null,null,null,null,null,null,"DROP-DOWN LIST",null,null,null,null,null,null,null,null,null,null,null,null,null,null,null,null,null,null,null,null,null,null,null,null,null,null,null,null,null,null,null,null,null,null," VIRUS LOG",null,null,null,{"$f":"IF(COUNTIF(CK24:CK28,\"!error\")>0,\"!error\",IF(OR(COUNT(CK24:CK28)=0,COUNT(CK24:CK28)=COUNTIF(CL24:CL28,\"~*\")),\"NA \",DMAX(CK23:CL28,CK23,CQ29:CQ30)))","v":"NA "},null,null,null,{"$f":"IF(COUNTIF(CK24:CK28,\"!error\")>0,\"!error\",IF(OR(COUNT(CK24:CK28)=0,COUNT(CK24:CK28)=COUNTIF(CL24:CL28,\"~*\")),\"NA \",DMIN(CK23:CL28,CK23,CQ29:CQ30)))","v":"NA "},null,null,{"$f":"IF(COUNTIF(CK24:CK28,\"!error\")>0,\"!error\",IF(OR(COUNT(CK24:CK28)=0,COUNT(CK24:CK28)=COUNTIF(CL24:CL28,\"~*\")),\"NA \",DAVERAGE(CK23:CL28,CK23,CQ29:CQ30)))","v":"NA "},null,{"$f":"IF(COUNTIF(CK24:CK28,\"!error\")>0,\"!error\",IF(OR(COUNT(CK24:CK28)=0,COUNT(CK24:CK28)=COUNTIF(CL24:CL28,\"~*\")),\"NA \",DSTDEVP(CK23:CL28,CK23,CQ29:CQ30)))","v":"NA "}]
[null,null,null,null,null,null,null,null,null,null,null,null,null,null,null,null,null,null,null,null,null,null,null,null,null,null,null,null,null,null,null,null,null,null,null,null,null,null,null,null,null,null,null,null,null,null,null,null,null,"DISINFECTANT",null,null,null,null," ","FCL","CLO2","CLA","O3","O3 Cell 1","NA"]
[null,null,null,null,null,"DISINFECTION PROCESS DATA ",null,null,null,null,null,null,null,null,null,null,null,null,null,null,null,null,null,null,null,null,null,null,null,null,null,null,null,null,null,null,null,null,null,null,null,null,null,null,null,null,null,null,null,"DISINFECTANT LIST 5B",null,null,null,null," ","FCL","CLO2","CLA","O3","NA"]
[null,"DATE:",null,null,null,{"$f":"OR(AND(COUNTA(D24:G33)=0,C20=\"\"),IsDate(C20))","v":true},"TIME:",null,null,null,null,"Operator Initials:"]
[null,"INDIVIDUAL DISINFECTION ZONES",null,null,null,null,null,null,null,null,null,null,"PLANT TOTAL",null,null,null,null,null,null,null,null,null,null,null,null,null,null,null,null,null,null,null,null,null,null,null,null,null,null,null,null,null,null,null,null,null,null,null,null,"PUMPAGE",null,null,null,null,{"$f":"\"DISINFECTION ZONES  ( D\"&$BD$11&\" - D\"&$BH$11&\" )\"","v":"DISINFECTION ZONES  ( D1 - D5 )"},null,null,null,null,null,null,null,null,null,null,null,null,null,null,null,null,null,{"$f":"\"DISINFECTION ZONES  ( D\"&$BI$11&\" - D\"&$BM$11&\" )\"","v":"DISINFECTION ZONES  ( D6 - D10 )"},null,null,null,null,null,null,null,null,null,null,null,null,null,null,null,"DAILY DISINFECTION DATA SUMMARY"]
[null,null,null,"C","Flow","Temp",null,null,"Giardia","Virus","Giardia","Virus","Giardia","Virus","Inact.",null,null,null,null,null,null,null,null,null,null,null,null,null,null,null,null,null,null,null,null,null,null,null,null,null,null,null,null,null,null,null,null,null,null,null,"RAW",null,null,null,null,null,null,null,null,null,null,null,null,"GIARDIA","GIARDIA","GIARDIA","VIRUS","VIRUS","VIRUS",null,null,null,null,null,null,null,null,null,null,null,null,"GIARDIA","GIARDIA","GIARDIA","VIRUS","VIRUS","VIRUS",null,"GIARDIA",null,"GIARDIA",null,"VIRUS",null,"VIRUS",null,"MINIMUM",null,null,null,"NO DATA"]
[null,"Disinfectant",null,"(mg/L)","(MGD)","(oC)","pH","CTCALC","CTREQD","CTREQD","Log","Log","Log","Log","Ratio",null,null,null,null,null,null,null,null,null,null,null,null,null,null,null,null,null,null,null,null,null,null,null,null,null,null,null,null,null,null,null,null,null,null,"DATE","WATER",null,null,"AT LEAST ONE PRECEDING ZONE <> \"NA\"","DISINFECTANT",null,null,"C","FLOW","T10","TEMP","pH","CTACTUAL","CTREQD","INACT. RATIO","LOG","CTREQD","INACT. RATIO","LOG",null,null,null,"DISINFECTANT",null,null,"C","FLOW","T10","TEMP","pH","CTACTUAL","CTREQD","INACT. RATIO","LOG","CTREQD","INACT. RATIO","LOG",null,"LOG",null,"INACT. RATIO",null,"LOG",null,"INACT. RATIO",null,"INACT. RATIO",null,null,null,{"$f":"\"D\"&$BD$11&\" - D\"&$BH$11","v":"D1 - D5"},{"$f":"\"D\"&$BI$11&\" - D\"&$BM$11","v":"D6 - D10"}]
[null,null,{"$f":"$C$15","v":1},null,null,null,null,{"$f":"IF(BL24=\"!error\",\"!error\",$BK24)","v":"missing"},{"$f":"$BL24","v":"missing"},{"$f":"$BO24","v":"missing"},{"$f":"$BN24","v":"missing"},{"$f":"$BQ24","v":"missing"},{"$f":"IF($CK24=\"\",\"\",IF($CK24=\"NA\",\"NA\",IF($CK24=\"!error\",-99,IF(COUNTIF(CW24:CX28,\"ND\")=$BN$4,\"MD\",IF(ISNUMBER($CK24),FIXED($CK24,2)&IF($CL24=\"*\",\"*\",\" \"),\"\")))))","v":""},{"$f":"IF($CO24=\"\",\"\",IF($CO24=\"NA\",\"NA \",IF($CO24=\"!error\",-99,IF(COUNTIF(CW24:CX28,\"ND\")=$BN$4,\"MD\",IF(ISNUMBER($CO24),FIXED($CO24,2)&IF($CP24=\"*\",\"*\",\" \"),\"\")))))","v":""},{"$f":"IF($CS24=\"\",\"\",IF($CS24=\"NA\",\"NA\",IF($CS24=\"!error\",-99,IF(AND($CW24=\"ND\",$CW25=\"ND\",$CW26=\"ND\",$CW27=\"ND\",$CW28=\"ND\",$CX24=\"ND\",$CX25=\"ND\",$CX26=\"ND\",$CX27=\"ND\",$CX28=\"ND\"),\"ND\",IF(ISNUMBER($CS24),$CS24,\"\")))))","v":""},null,{"$f":"IF(AND(BE24=1,D24>4,D24<>\"ND\"),\"Note: The inactivation credit in zone D\" & C24 & \" was restricted due to elevated free chlorine levels.\",\"\")","v":""},null,null,null,null,null,null,null,null,null,null,null,null,null,null,null,null,null,null,null,null,null,null,null,null,null,null,null,null,null,null,null,null,1,1,{"$f":"IF($BD$14=0,0,IF(COUNTIF(OFFSET($BD24,0,0,MIN($BD$14,5),1),\"<>NA\")+IF($BD$14>5,COUNTIF(OFFSET($BV24,0,0,$BD$14-5,1),\"<>NA\"),0),1,0))","v":0},{"$f":"IF($BD$14=0,0,IF(COUNTIF(OFFSET($BD24,0,0,MIN($BD$14,5),1),\"O3\")+COUNTIF(OFFSET($BD24,0,0,MIN($BD$14,5),1),\"O3 Cell 1\")+IF($BD$14>5,COUNTIF(OFFSET($BV24,0,0,$BD$14-5,1),\"O3\"),0)+IF($BD$14>5,COUNTIF(OFFSET($BV24,0,0,$BD$14-5,1),\"O3 Cell 1\"),0),1,0))","v":0},{"$f":"IF(OR($AY24=0,AND(COUNTA(D24,F24:G24)=0,COUNTIF(E24,0))),\"NA\",\n       IF(COUNTA(D24:G24),IF(BA24,4,\n                                                                     5),\n            IF($BD$15=1,IF(BA24,4,\n                                                        IF(AZ24,5,\n                                                                         6)),\n                    IF(BD24=\"!error\",IF(BA24,4,\n                                                                        5),\n                          IF(BA24,\"5B\",\n                                            6)))))","v":6},{"$f":"$BD$11","v":1},{"$f":"IF(AND(IF($BN$4=\"missing\",10,$BN$4)>=1,$AY24<>\"\"),IF(OR($AY24=0,AND($B24=\"NA\",COUNTA($D24,$F24:$G24)=0,COUNTIF($E24,0)),AND($B24=\"NA\",COUNTA($D24:$G24)=0,IF($BD$14=0,0,COUNTIF(OFFSET($BD24,0,0,MIN($BD$14,5),1),\"NA\")+IF($BD$14>5,COUNTIF(OFFSET($BV24,0,0,$BD$14-5,1),\"NA\"),0))=$BD$14),AND($B24=\"NA\",COUNTA($D24:$G24)=0,IF($BD$14<5,COUNTA(OFFSET($D24,$BD$14,0,MIN(5-$BD$14,$BD$15),4))-COUNTIF(OFFSET($E24,$BD$14,0,MIN(5-$BD$14,$BD$15),1),0),0)+IF($BD$14+$BD$15>5,COUNTA(OFFSET($D29,MAX($BD$14-5,0),0,MIN($BD$14+$BD$15-5,$BD$15),4))-COUNTIF(OFFSET($E29,MAX($BD$14-5,0),0,MIN($BD$14+$BD$15-5,$BD$15),1),0),0)),AND($B24=\"NA\",COUNTA($D24:$G24)=0,IF($BD$14<5,COUNTIF(OFFSET($B24,$BD$14,0,MIN(5-$BD$14,$BD$15),1),\"NA\"),0)+IF($BD$14+$BD$15>5,COUNTIF(OFFSET($B29,MAX($BD$14-5,0),0,MIN($BD$14+$BD$15-5,$BD$15),1),\"NA\"),0)<>$BD$15)),\"NA\",IF($B24=\"\",\"missing\",IF(AND($B24<>\"NA\",COUNTA($D24,$F24:$G24)+COUNTIF($E24,\"<>0\")),UPPER($B24),\"!error\"))),\"\")","v":"missing"},{"$f":"IF(BD24=\"\",\"\",IF(BD24=\"FCL\",1,IF(BD24=\"CLO2\",2,IF(BD24=\"O3 Cell 1\",99,IF(BD24=\"O3\",3,IF(BD24=\"CLA\",4,0))))))","v":0},{"$f":"IF(BD24=\"\",\"\",IF(BD24=\"NA\",\"NA\",IF(ISBLANK($D24),\"missing\",IF(AND(BE24=1,ISNUMBER($D24),$D24>4),4,IF(AND(ISNUMBER($D24),$D24>=0),$D24,IF(AND(ISTEXT($D24),$D24=\"ND\"),\"ND\",\"!error\"))))))","v":"missing"},{"$f":"IF(BD24=\"\",\"\",IF(BD24=\"NA\",\"NA\",IF(ISBLANK($E24),\"missing\",IF(OR(AND(ISBLANK($B24),COUNT(BF24,BI24:BJ24)=0,ISNUMBER($E24),$E24=0),AND(ISNUMBER($E24),$E24>0),AND(ISTEXT($E24),$E24=\"ND\")),$E24,\"!error\"))))","v":"missing"},{"$f":"IF(BD24=\"\",\"\",IF(AY24=0,\"NA\",IF(OR($BD$12=\"!error\",$BD$13=\"!error\",BG24=\"!error\"),\"!error\",IF(BD24=\"NA\",\"NA\",IF(AND(ISNUMBER(BG24),BG24=0),0,IF(AND(ISNUMBER($BD$12),ISNUMBER($BD$13),ISNUMBER(BG24)),$BD$13*$BD$12/BG24,IF(BG24=\"ND\",\"ND\",\"missing\")))))))","v":"missing"},{"$f":"IF(BD24=\"\",\"\",IF(BD24=\"NA\",\"NA\",IF(ISBLANK($F24),\"missing\",IF(OR(ISNUMBER($F24),$F24=\"ND\"),$F24,\"!error\"))))","v":"missing"},{"$f":"IF(BD24=\"\",\"\",IF(BD24=\"NA\",\"NA\",IF(ISBLANK($G24),\"missing\",IF(OR(AND(ISNUMBER($G24),$G24>=0,$G24<=14),$G24=\"ND\"),$G24,\"!error\"))))","v":"missing"},{"$f":"IF(BD24=\"\",\"\",IF(AY24=0,\"NA\",IF(OR(BF24=\"!error\",BH24=\"!error\"),\"!error\",IF(BD24=\"NA\",\"NA\",IF(OR(AND(ISNUMBER(BF24),BF24=0),AND(ISNUMBER(BH24),BH24=0)),0,IF(AND(ISNUMBER(BF24),ISNUMBER(BH24)),BF24*BH24,IF(OR(BF24=\"ND\",BH24=\"ND\"),\"ND\",\"missing\")))))))","v":"missing"},{"$f":"IF(BD24=\"\",\"\",IF(AY24=0,\"NA\",IF(CW24=\"ND\",\"ND\",IF(OR($BN$12=\"!error\",BD24=\"!error\",AND(BD24=\"missing\",ISNUMBER(BF24)),IF(BE24=1,BF24=\"!error\",0),BI24=\"!error\",BJ24=\"!error\"),\"!error\",IF(OR(BD24=\"NA\",AND(ISNUMBER($BN$12),$BN$12=0),AND(BE24<>0,ISNUMBER(BK24),BK24=0),AND(BE24=1,ISNUMBER(BJ24),BJ24>9),AND(BE24=2,ISNUMBER(BJ24),OR(BJ24<6,BJ24>=9.5)),AND(OR(BE24=3,BE24=4),ISNUMBER(BJ24),OR(BJ24<5.5,BJ24>=9.5))),\"NA\",IF(AND(ISNUMBER($BN$12),BE24<>0,IF(BE24=1,ISNUMBER(BF24),1),ISNUMBER(BI24),ISNUMBER(BJ24)),CT_Giardia(BE24,$BN$12,BI24,BJ24,IF(BE24=1,BF24,)),IF(COUNTIF(BE24,\"<>0\")+COUNT(BF24,BG24,BI24,BJ24)=5,\"!error\",\"missing\")))))))","v":"missing"},{"$f":"IF(BD24=\"\",\"\",IF(OR(AY24=0,AND(ISNUMBER($BN$12),$BN$12=0)),\"NA\",IF(CW24=\"ND\",\"ND\",IF(OR(BK24=\"!error\",BL24=\"!error\",BN24=\"!error\"),\"!error\",IF(BD24=\"NA\",\"NA\",IF(BL24=\"NA\",0,IF(AND(BE24<>99,ISNUMBER(BK24),ISNUMBER(BL24)),BK24/BL24,IF(AND(BE24=99,BN24=0.5),BN24/$BN$12,\"missing\"))))))))","v":"missing"},{"$f":"IF(BD24=\"\",\"\",IF(AY24=0,\"NA\",IF(CW24=\"ND\",\"ND\",IF(OR(BD24=\"!error\",AND(BD24=\"missing\",ISNUMBER(BF24)),BF24=\"!error\",BH24=\"!error\",BI24=\"!error\",BJ24=\"!error\"),\"!error\",IF(BD24=\"NA\",\"NA\",IF(OR(AND(BE24<>0,ISNUMBER(BK24),BK24=0),AND(BE24=1,ISNUMBER(BJ24),BJ24>9),AND(BE24=2,ISNUMBER(BJ24),OR(BJ24<6,BJ24>=9.5)),AND(OR(BE24=3,BE24=4),ISNUMBER(BJ24),OR(BJ24<5.5,BJ24>=9.5))),0,IF(AND(ISNUMBER($BN$12),BE24<>0,ISNUMBER(BF24),ISNUMBER(BH24),ISNUMBER(BI24),ISNUMBER(BJ24)),log_Giardia(BE24,$BN$12,BI24,BJ24,BF24,BH24),IF(COUNTIF(BE24,\"<>0\")+COUNT(BF24,BG24,BI24,BJ24)=5,\"!error\",\"missing\"))))))))","v":"missing"},{"$f":"IF(BD24=\"\",\"\",IF(AY24=0,\"NA\",IF(CW24=\"ND\",\"ND\",IF(OR($BP$12=\"!error\",BD24=\"!error\",AND(BD24=\"missing\",ISNUMBER(BF24)),BI24=\"!error\",BJ24=\"!error\"),\"!error\",IF(OR(BD24=\"NA\",AND(ISNUMBER($BP$12),$BP$12=0),AND(BE24<>0,ISNUMBER(BK24),BK24=0),AND(BE24=1,ISNUMBER(BJ24),BJ24>=10.5),AND(BE24=2,ISNUMBER(BJ24),OR(BJ24<6,BJ24>=9.5)),AND(BE24=3,ISNUMBER(BJ24),OR(BJ24<6,BJ24>9)),AND(BE24=4,ISNUMBER(BJ24),OR(BJ24<6,BJ24>10))),\"NA\",IF(AND(ISNUMBER($BP$12),BE24<>0,ISNUMBER(BI24),ISNUMBER(BJ24)),CT_Virus(BE24,$BP$12,BI24,BJ24),IF(COUNTIF(BE24,\"<>0\")+COUNT(BF24,BG24,BI24,BJ24)=5,\"!error\",\"missing\")))))))","v":"missing"},{"$f":"IF(BD24=\"\",\"\",IF(OR(AY24=0,AND(ISNUMBER($BP$12),$BP$12=0)),\"NA\",IF(CW24=\"ND\",\"ND\",IF(OR(BK24=\"!error\",BO24=\"!error\",BQ24=\"!error\"),\"!error\",IF(BD24=\"NA\",\"NA\",IF(BO24=\"NA\",0,IF(AND(BE24<>99,ISNUMBER(BK24),ISNUMBER(BO24)),BK24/BO24,IF(AND(BE24=99,BQ24=1),BQ24/$BP$12,\"missing\"))))))))","v":"missing"},{"$f":"IF(BD24=\"\",\"\",IF(AY24=0,\"NA\",IF(CW24=\"ND\",\"ND\",IF(OR(BD24=\"!error\",AND(BD24=\"missing\",ISNUMBER(BF24)),BF24=\"!error\",BH24=\"!error\",BI24=\"!error\",BJ24=\"!error\"),\"!error\",IF(BD24=\"NA\",\"NA\",IF(OR(AND(BE24<>0,ISNUMBER(BK24),BK24=0),AND(BE24=1,ISNUMBER(BJ24),BJ24>=10.5),AND(BE24=2,ISNUMBER(BJ24),OR(BJ24<6,BJ24>=9.5)),AND(BE24=3,ISNUMBER(BJ24),OR(BJ24<6,BJ24>9)),AND(BE24=4,ISNUMBER(BJ24),OR(BJ24<6,BJ24>10))),0,IF(AND(ISNUMBER($BP$12),BE24<>0,ISNUMBER(BF24),ISNUMBER(BH24),ISNUMBER(BI24),ISNUMBER(BJ24)),Log_Virus(BE24,$BP$12,BI24,BJ24,BF24,BH24),IF(COUNTIF(BE24,\"<>0\")+COUNT(BF24,BG24,BI24,BJ24)=5,\"!error\",\"missing\"))))))))","v":"missing"},{"$f":"IF($BI$14=0,0,IF(COUNTIF(OFFSET($BD24,0,0,MIN($BI$14,5),1),\"<>NA\")+IF($BI$14>5,COUNTIF(OFFSET($BV24,0,0,$BI$14-5,1),\"<>NA\"),0),1,0))","v":1},{"$f":"IF($BI$14=0,0,IF(COUNTIF(OFFSET($BD24,0,0,MIN($BI$14,5),1),\"O3\")+COUNTIF(OFFSET($BD24,0,0,MIN($BI$14,5),1),\"O3 Cell 1\")+IF($BI$14>5,COUNTIF(OFFSET($BV24,0,0,$BI$14-5,1),\"O3\"),0)+IF($BI$14>5,COUNTIF(OFFSET($BV24,0,0,$BI$14-5,1),\"O3 Cell 1\"),0),1,0))","v":0},{"$f":"IF(OR($AY24=0,AND(COUNTA(D29,F29:G29)=0,COUNTIF(E29,0))),\"NA\",IF(COUNTA(D29:G29),IF(BS24,4,5),IF($BI$15=1,IF(BS24,4,IF(BR24,5,6)),IF(BV24=\"!error\",IF(BS24,4,5),IF(BS24,\"5B\",6)))))","v":6},{"$f":"$BI$11","v":6},{"$f":"IF(AND(IF($BN$4=\"missing\",10,$BN$4)>=6,$AY24<>\"\"),IF(OR($AY24=0,AND($B29=\"NA\",COUNTA($D29,$F29:$G29)=0,COUNTIF($E29,0)),AND($B29=\"NA\",COUNTA($D29:$G29)=0,IF($BI$14=0,0,COUNTIF(OFFSET($BD24,0,0,MIN($BI$14,5),1),\"NA\")+IF($BI$14>5,COUNTIF(OFFSET($BV24,0,0,$BI$14-5,1),\"NA\"),0))=$BI$14),AND($B29=\"NA\",COUNTA($D29:$G29)=0,IF($BI$14<5,COUNTA(OFFSET($D24,$BI$14,0,MIN(5-$BI$14,$BI$15),4))-COUNTIF(OFFSET($E24,$BI$14,0,MIN(5-$BI$14,$BI$15),1),0),0)+IF($BI$14+$BI$15>5,COUNTA(OFFSET($D29,MAX($BI$14-5,0),0,MIN($BI$14+$BI$15-5,$BI$15),4))-COUNTIF(OFFSET($E29,MAX($BI$14-5,0),0,MIN($BI$14+$BI$15-5,$BI$15),1),0),0)),AND($B29=\"NA\",COUNTA($D29:$G29)=0,IF($BI$14<5,COUNTIF(OFFSET($B24,$BI$14,0,MIN(5-$BI$14,$BI$15),1),\"NA\"),0)+IF($BI$14+$BI$15>5,COUNTIF(OFFSET($B29,MAX($BI$14-5,0),0,MIN($BI$14+$BI$15-5,$BI$15),1),\"NA\"),0)<>$BI$15)),\"NA\",IF($B29=\"\",\"missing\",IF(AND($B29<>\"NA\",COUNTA($D29,$F29:$G29)+COUNTIF($E29,\"<>0\")),UPPER($B29),\"!error\"))),\"\")","v":""},{"$f":"IF(BV24=\"\",\"\",IF(BV24=\"FCL\",1,IF(BV24=\"CLO2\",2,IF(BV24=\"O3 Cell 1\",99,IF(BV24=\"O3\",3,IF(BV24=\"CLA\",4,0))))))","v":""},{"$f":"IF(BV24=\"\",\"\",IF(BV24=\"NA\",\"NA\",IF(ISBLANK($D29),\"missing\",IF(AND(BW24=1,ISNUMBER($D29),$D29>4),4,IF(AND(ISNUMBER($D29),$D29>=0),$D29,IF(AND(ISTEXT($D29),$D29=\"ND\"),\"ND\",\"!error\"))))))","v":""},{"$f":"IF(BV24=\"\",\"\",IF(BV24=\"NA\",\"NA\",IF(ISBLANK($E29),\"missing\",IF(OR(AND(ISBLANK($B29),COUNT(BX24,CA24:CB24)=0,ISNUMBER($E29),$E29=0),AND(ISNUMBER($E29),$E29>0),AND(ISTEXT($E29),$E29=\"ND\")),$E29,\"!error\"))))","v":""},{"$f":"IF(BV24=\"\",\"\",IF(AY24=0,\"NA\",IF(OR($BI$12=\"!error\",$BI$13=\"!error\",BY24=\"!error\"),\"!error\",IF(BV24=\"NA\",\"NA\",IF(AND(ISNUMBER(BY24),BY24=0),0,IF(AND(ISNUMBER($BI$12),ISNUMBER($BI$13),ISNUMBER(BY24)),$BI$13*$BI$12/BY24,IF(BY24=\"ND\",\"ND\",\"missing\")))))))","v":""},{"$f":"IF(BV24=\"\",\"\",IF(BV24=\"NA\",\"NA\",IF(ISBLANK($F29),\"missing\",IF(OR(ISNUMBER($F29),$F29=\"ND\"),$F29,\"!error\"))))","v":""},{"$f":"IF(BV24=\"\",\"\",IF(BV24=\"NA\",\"NA\",IF(ISBLANK($G29),\"missing\",IF(OR(AND(ISNUMBER($G29),$G29>=0,$G29<=14),$G29=\"ND\"),$G29,\"!error\"))))","v":""},{"$f":"IF(BV24=\"\",\"\",IF(AY24=0,\"NA\",IF(OR(BX24=\"!error\",BZ24=\"!error\"),\"!error\",IF(BV24=\"NA\",\"NA\",IF(OR(AND(ISNUMBER(BX24),BX24=0),AND(ISNUMBER(BZ24),BZ24=0)),0,IF(AND(ISNUMBER(BX24),ISNUMBER(BZ24)),BX24*BZ24,IF(OR(BX24=\"ND\",BZ24=\"ND\"),\"ND\",\"missing\")))))))","v":""},{"$f":"IF(BV24=\"\",\"\",IF(AY24=0,\"NA\",IF(CX24=\"ND\",\"ND\",IF(OR($BN$12=\"!error\",BV24=\"!error\",AND(BV24=\"missing\",ISNUMBER(BX24)),IF(BW24=1,BX24=\"!error\",0),CA24=\"!error\",CB24=\"!error\"),\"!error\",IF(OR(BV24=\"NA\",AND(ISNUMBER($BN$12),$BN$12=0),AND(BW24<>0,ISNUMBER(CC24),CC24=0),AND(BW24=1,ISNUMBER(CB24),CB24>9),AND(BW24>1,ISNUMBER(CB24),OR(CB24<6,CB24>=9.5))),\"NA\",IF(AND(ISNUMBER($BN$12),BW24<>0,IF(BW24=1,ISNUMBER(BX24),1),ISNUMBER(CA24),ISNUMBER(CB24)),CT_Giardia(BW24,$BN$12,CA24,CB24,IF(BW24=1,BX24,)),IF(COUNTIF(BW24,\"<>0\")+COUNT(BX24,BY24,CA24,CB24)=5,\"!error\",\"missing\")))))))","v":""},{"$f":"IF(BV24=\"\",\"\",IF(OR(AY24=0,AND(ISNUMBER($BN$12),$BN$12=0)),\"NA\",IF(CX24=\"ND\",\"ND\",IF(OR(CC24=\"!error\",CD24=\"!error\",CF24=\"!error\"),\"!error\",IF(BV24=\"NA\",\"NA\",IF(CD24=\"NA\",0,IF(AND(ISNUMBER(CC24),ISNUMBER(CD24)),CC24/CD24,IF(AND(BW24=99,CF24=0.5),CF24/$BN$12,\"missing\"))))))))","v":""},{"$f":"IF(BV24=\"\",\"\",IF(AY24=0,\"NA\",IF(CX24=\"ND\",\"ND\",IF(OR(BV24=\"!error\",AND(BV24=\"missing\",ISNUMBER(BX24)),BX24=\"!error\",BZ24=\"!error\",CA24=\"!error\",CB24=\"!error\"),\"!error\",IF(BV24=\"NA\",\"NA\",IF(OR(AND(BW24<>0,ISNUMBER(CC24),CC24=0),AND(BW24=1,ISNUMBER(CB24),CB24>9),AND(BW24>1,ISNUMBER(CB24),OR(CB24<6,CB24>=9.5))),0,IF(AND(ISNUMBER($BN$12),BW24<>0,ISNUMBER(BX24),ISNUMBER(BZ24),ISNUMBER(CA24),ISNUMBER(CB24)),log_Giardia(BW24,$BN$12,CA24,CB24,BX24,BZ24),IF(COUNTIF(BW24,\"<>0\")+COUNT(BX24,BY24,CA24,CB24)=5,\"!error\",\"missing\"))))))))","v":""},{"$f":"IF(BV24=\"\",\"\",IF(AY24=0,\"NA\",IF(CX24=\"ND\",\"ND\",IF(OR($BP$12=\"!error\",BV24=\"!error\",AND(BV24=\"missing\",ISNUMBER(BX24)),CA24=\"!error\",CB24=\"!error\"),\"!error\",IF(OR(BV24=\"NA\",AND(ISNUMBER($BP$12),$BP$12=0),AND(BW24<>0,ISNUMBER(CC24),CC24=0),AND(BW24=1,ISNUMBER(CB24),OR(CB24<5.5,CB24>=10.5)),AND(OR(BW24=2,BW24=4),ISNUMBER(CB24),OR(CB24<6,CB24>=9.5)),AND(BW24=3,ISNUMBER(CB24),OR(CB24<6,CB24>9))),\"NA\",IF(AND(ISNUMBER($BP$12),BW24<>0,ISNUMBER(CA24),ISNUMBER(CB24)),CT_Virus(BW24,$BP$12,CA24,CB24),IF(COUNTIF(BW24,\"<>0\")+COUNT(BX24,BY24,CA24,CB24)=5,\"!error\",\"missing\")))))))","v":""},{"$f":"IF(BV24=\"\",\"\",IF(OR(AY24=0,AND(ISNUMBER($BP$12),$BP$12=0)),\"NA\",IF(CX24=\"ND\",\"ND\",IF(OR(CC24=\"!error\",CG24=\"!error\",CI24=\"!error\"),\"!error\",IF(BV24=\"NA\",\"NA\",IF(CG24=\"NA\",0,IF(AND(ISNUMBER(CC24),ISNUMBER(CG24)),CC24/CG24,IF(AND(BW24=99,CI24=1),CI24/$BP$12,\"missing\"))))))))","v":""},{"$f":"IF(BV24=\"\",\"\",IF(AY24=0,\"NA\",IF(CX24=\"ND\",\"ND\",IF(OR(BV24=\"!error\",AND(BV24=\"missing\",ISNUMBER(BX24)),BX24=\"!error\",BZ24=\"!error\",CA24=\"!error\",CB24=\"!error\"),\"!error\",IF(BV24=\"NA\",\"NA\",IF(OR(AND(BW24<>0,ISNUMBER(CC24),CC24=0),AND(BW24=1,ISNUMBER(CB24),OR(CB24<5.5,CB24>=10.5)),AND(OR(BW24=2,BW24=4),ISNUMBER(CB24),OR(CB24<6,CB24>=9.5)),AND(BW24=3,ISNUMBER(CB24),OR(CB24<6,CB24>9))),0,IF(AND(ISNUMBER($BP$12),BW24<>0,ISNUMBER(BX24),ISNUMBER(BZ24),ISNUMBER(CA24),ISNUMBER(CB24)),Log_Virus(BW24,$BP$12,CA24,CB24,BX24,BZ24),IF(COUNTIF(BW24,\"<>0\")+COUNT(BX24,BY24,CA24,CB24)=5,\"!error\",\"missing\"))))))))","v":""},null,{"$f":"IF(AY24=\"\",\"\",IF(AY24=0,\"NA\",IF(COUNTIF(BN24:BN28,\"!error\")+COUNTIF(CF24:CF28,\"!error\")>0,\"!error\",IF(COUNT(BN24:BN28,CF24:CF28)>0,SUMIFF(BC24:BC28,\">0\",BN24:BN28)+SUMIFF(BU24:BU28,\">0\",CF24:CF28)+MINIF(BC24:BC28,BU24:BU28,\"1?\",BN24:BN28,CF24:CF28)+MINIF(BC24:BC28,BU24:BU28,\"2?\",BN24:BN28,CF24:CF28)+MINIF(BC24:BC28,BU24:BU28,\"3?\",BN24:BN28,CF24:CF28)+MINIF(BC24:BC28,BU24:BU28,\"4?\",BN24:BN28,CF24:CF28)+MINIF(BC24:BC28,BU24:BU28,\"5?\",BN24:BN28,CF24:CF28)+MINIF(BC24:BC28,BU24:BU28,\"6?\",BN24:BN28,CF24:CF28)+MINIF(BC24:BC28,BU24:BU28,\"7?\",BN24:BN28,CF24:CF28)+MINIF(BC24:BC28,BU24:BU28,\"8?\",BN24:BN28,CF24:CF28)+MINIF(BC24:BC28,BU24:BU28,\"9?\",BN24:BN28,CF24:CF28)+MINIF(BC24:BC28,BU24:BU28,\"10?\",BN24:BN28,CF24:CF28),IF(COUNTIF(BN24:BN28,\"NA\")+COUNTIF(CF24:CF28,\"NA\")=IF($AZ$4=\"missing\",10,SUM($BD$4:$BM$4)),0,\"missing\")))))","v":"missing"},{"$f":"IF(AND(ISNUMBER(CK24),COUNT(BN24:BN28,CF24:CF28)+COUNTIF(BN24:BN28,\"NA\")+COUNTIF(CF24:CF28,\"NA\")<IF($AZ$4=\"missing\",10,SUM($BD$4:$BM$4))),\"*\",\"\")","v":""},{"$f":"IF(AY24=\"\",\"\",IF(OR(AY24=0,AND(ISNUMBER($BN$12),$BN$12=0)),\"NA\",IF(COUNTIF(BM24:BM28,\"!error\")+COUNTIF(CE24:CE28,\"!error\")>0,\"!error\",IF(COUNT(BM24:BM28,CE24:CE28)>0,SUMIFF(BC24:BC28,\">0\",BM24:BM28)+SUMIFF(BU24:BU28,\">0\",CE24:CE28)+MINIF(BC24:BC28,BU24:BU28,\"1?\",BM24:BM28,CE24:CE28)+MINIF(BC24:BC28,BU24:BU28,\"2?\",BM24:BM28,CE24:CE28)+MINIF(BC24:BC28,BU24:BU28,\"3?\",BM24:BM28,CE24:CE28)+MINIF(BC24:BC28,BU24:BU28,\"4?\",BM24:BM28,CE24:CE28)+MINIF(BC24:BC28,BU24:BU28,\"5?\",BM24:BM28,CE24:CE28)+MINIF(BC24:BC28,BU24:BU28,\"6?\",BM24:BM28,CE24:CE28)+MINIF(BC24:BC28,BU24:BU28,\"7?\",BM24:BM28,CE24:CE28)+MINIF(BC24:BC28,BU24:BU28,\"8?\",BM24:BM28,CE24:CE28)+MINIF(BC24:BC28,BU24:BU28,\"9?\",BM24:BM28,CE24:CE28)+MINIF(BC24:BC28,BU24:BU28,\"10?\",BM24:BM28,CE24:CE28),IF(COUNTIF(BM24:BM28,\"NA\")+COUNTIF(CE24:CE28,\"NA\")=IF($AZ$4=\"missing\",10,SUM($BD$4:$BM$4)),0,\"missing\")))))","v":"missing"},{"$f":"IF(AND(ISNUMBER(CM24),COUNT(BM24:BM28,CE24:CE28)+COUNTIF(BM24:BM28,\"NA\")+COUNTIF(CE24:CE28,\"NA\")<IF($AZ$4=\"missing\",10,SUM($BD$4:$BM$4))),\"*\",\"\")","v":""},{"$f":"IF(AY24=\"\",\"\",IF(AY24=0,\"NA\",IF(COUNTIF(BQ24:BQ28,\"!error\")+COUNTIF(CI24:CI28,\"!error\")>0,\"!error\",IF(COUNT(BQ24:BQ28,CI24:CI28)>0,SUMIFF(BC24:BC28,\">0\",BQ24:BQ28)+SUMIFF(BU24:BU28,\">0\",CI24:CI28)+MINIF(BC24:BC28,BU24:BU28,\"1?\",BQ24:BQ28,CI24:CI28)+MINIF(BC24:BC28,BU24:BU28,\"2?\",BQ24:BQ28,CI24:CI28)+MINIF(BC24:BC28,BU24:BU28,\"3?\",BQ24:BQ28,CI24:CI28)+MINIF(BC24:BC28,BU24:BU28,\"4?\",BQ24:BQ28,CI24:CI28)+MINIF(BC24:BC28,BU24:BU28,\"5?\",BQ24:BQ28,CI24:CI28)+MINIF(BC24:BC28,BU24:BU28,\"6?\",BQ24:BQ28,CI24:CI28)+MINIF(BC24:BC28,BU24:BU28,\"7?\",BQ24:BQ28,CI24:CI28)+MINIF(BC24:BC28,BU24:BU28,\"8?\",BQ24:BQ28,CI24:CI28)+MINIF(BC24:BC28,BU24:BU28,\"9?\",BQ24:BQ28,CI24:CI28)+MINIF(BC24:BC28,BU24:BU28,\"10?\",BQ24:BQ28,CI24:CI28),IF(COUNTIF(BQ24:BQ28,\"NA\")+COUNTIF(CI24:CI28,\"NA\")=IF($AZ$4=\"missing\",10,SUM($BD$4:$BM$4)),0,\"missing\")))))","v":"missing"},{"$f":"IF(AND(ISNUMBER(CO24),COUNT(BQ24:BQ28,CI24:CI28)+COUNTIF(BQ24:BQ28,\"NA\")+COUNTIF(CI24:CI28,\"NA\")<IF($AZ$4=\"missing\",10,SUM($BD$4:$BM$4))),\"*\",\"\")","v":""},{"$f":"IF(AY24=\"\",\"\",IF(OR(AY24=0,AND(ISNUMBER($BP$12),$BP$12=0)),\"NA\",IF(COUNTIF(BP24:BP28,\"!error\")+COUNTIF(CH24:CH28,\"!error\")>0,\"!error\",IF(COUNT(BP24:BP28,CH24:CH28)>0,SUMIFF(BC24:BC28,\">0\",BP24:BP28)+SUMIFF(BU24:BU28,\">0\",CH24:CH28)+MINIF(BC24:BC28,BU24:BU28,\"1?\",BP24:BP28,CH24:CH28)+MINIF(BC24:BC28,BU24:BU28,\"2?\",BP24:BP28,CH24:CH28)+MINIF(BC24:BC28,BU24:BU28,\"3?\",BP24:BP28,CH24:CH28)+MINIF(BC24:BC28,BU24:BU28,\"4?\",BP24:BP28,CH24:CH28)+MINIF(BC24:BC28,BU24:BU28,\"5?\",BP24:BP28,CH24:CH28)+MINIF(BC24:BC28,BU24:BU28,\"6?\",BP24:BP28,CH24:CH28)+MINIF(BC24:BC28,BU24:BU28,\"7?\",BP24:BP28,CH24:CH28)+MINIF(BC24:BC28,BU24:BU28,\"8?\",BP24:BP28,CH24:CH28)+MINIF(BC24:BC28,BU24:BU28,\"9?\",BP24:BP28,CH24:CH28)+MINIF(BC24:BC28,BU24:BU28,\"10?\",BP24:BP28,CH24:CH28),IF(COUNTIF(BP24:BP28,\"NA\")+COUNTIF(CH24:CH28,\"NA\")=IF($AZ$4=\"missing\",10,SUM($BD$4:$BM$4)),0,\"missing\")))))","v":"missing"},{"$f":"IF(AND(ISNUMBER(CQ24),COUNT(BP24:BP28,CH24:CH28)+COUNTIF(BP24:BP28,\"NA\")+COUNTIF(CH24:CH28,\"NA\")<IF($AZ$4=\"missing\",10,SUM($BD$4:$BM$4))),\"*\",\"\")","v":""},{"$f":"IF(AY24=\"\",\"\",IF(AND(CM24=\"NA\",CQ24=\"NA\"),\"NA\",IF(OR(AND(ISNUMBER(CM24),ISNUMBER(CQ24)),AND(ISNUMBER(CM24),CQ24=\"NA\"),AND(CM24=\"NA\",ISNUMBER(CQ24)),AND(ISNUMBER(CM24),CM24=0),AND(ISNUMBER(CQ24),CQ24=0)),MIN(CM24,CQ24),IF(OR(CM24=\"!error\",CQ24=\"!error\"),\"!error\",\"missing\"))))","v":"missing"},{"$f":"IF(ISNUMBER(CS24),IF(CM24<CQ24,IF(CN24=\"*\",\"*\",\"\"),IF(CQ24<CM24,IF(CR24=\"*\",\"*\",\"\"),IF(AND(CN24=\"*\",CR24=\"*\"),\"*\",\"\"))),\"\")","v":""},{"$f":"IF(ISNUMBER(CS24),IF(CM24<CQ24,\"(G)\",IF(CQ24<CM24,\"(V)\",IF(AND(CN24=\"\",CR24=\"*\"),\"(G)\",IF(AND(CN24=\"*\",CR24=\"\"),\"(V)\",\"(G/V)\")))),\"\")","v":""},null,{"$f":"IF(OR(BF24=\"ND\",BG24=\"ND\",BI24=\"ND\",BJ24=\"ND\"),\"ND\",\"data\")","v":"data"},{"$f":"IF(OR(BX24=\"ND\",BY24=\"ND\",CA24=\"ND\",CB24=\"ND\"),\"ND\",\"data\")","v":"data"}]
[null," ",{"$f":"$D$15","v":2},null,null,null,null,{"$f":"IF(BL25=\"!error\",\"!error\",$BK25)","v":"missing"},{"$f":"$BL25","v":"missing"},{"$f":"$BO25","v":"missing"},{"$f":"$BN25","v":"missing"},{"$f":"$BQ25","v":"missing"},null,null,null,null,{"$f":"IF(AND(BE25=1,D25>4,D25<>\"ND\"),\"Note: The inactivation credit in zone D\" & C25 & \" was restricted due to elevated free chlorine levels.\",\"\")","v":""},null,null,null,null,null,null,null,null,null,null,null,null,null,null,null,null,null,null,null,null,null,null,null,null,null,null,null,null,null,null,null,null,null,1,{"$f":"IF($BE$14=0,0,IF(COUNTIF(OFFSET($BD24,0,0,MIN($BE$14,5),1),\"<>NA\")+IF($BE$14>5,COUNTIF(OFFSET($BV24,0,0,$BE$14-5,1),\"<>NA\"),0),1,0))","v":1},{"$f":"IF($BE$14=0,0,IF(COUNTIF(OFFSET($BD24,0,0,MIN($BE$14,5),1),\"O3\")+COUNTIF(OFFSET($BD24,0,0,MIN($BE$14,5),1),\"O3 Cell 1\")+IF($BE$14>5,COUNTIF(OFFSET($BV24,0,0,$BE$14-5,1),\"O3\"),0)+IF($BE$14>5,COUNTIF(OFFSET($BV24,0,0,$BE$14-5,1),\"O3 Cell 1\"),0),1,0))","v":0},{"$f":"IF(OR($AY25=0,AND(COUNTA(D25,F25:G25)=0,COUNTIF(E25,0))),\"NA\",IF(COUNTA(D25:G25),IF(BA25,4,5),IF($BE$15=1,IF(BA25,4,IF(AZ25,5,6)),IF(BD25=\"!error\",IF(BA25,4,5),IF(BA25,\"5B\",6)))))","v":5},{"$f":"$BE$11","v":2},{"$f":"IF(AND(IF($BN$4=\"missing\",10,$BN$4)>=2,$AY25<>\"\"),IF(OR($AY25=0,AND($B25=\"NA\",COUNTA($D25,$F25:$G25)=0,COUNTIF($E25,0)),AND($B25=\"NA\",COUNTA($D25:$G25)=0,IF($BE$14=0,0,COUNTIF(OFFSET($BD24,0,0,MIN($BE$14,5),1),\"NA\")+IF($BE$14>5,COUNTIF(OFFSET($BV24,0,0,$BE$14-5,1),\"NA\"),0))=$BE$14),AND($B25=\"NA\",COUNTA($D25:$G25)=0,IF($BE$14<5,COUNTA(OFFSET($D24,$BE$14,0,MIN(5-$BE$14,$BE$15),4))-COUNTIF(OFFSET($E24,$BE$14,0,MIN(5-$BE$14,$BE$15),1),0),0)+IF($BE$14+$BE$15>5,COUNTA(OFFSET($D29,MAX($BE$14-5,0),0,MIN($BE$14+$BE$15-5,$BE$15),4))-COUNTIF(OFFSET($E29,MAX($BE$14-5,0),0,MIN($BE$14+$BE$15-5,$BE$15),1),0),0)),AND($B25=\"NA\",COUNTA($D25:$G25)=0,IF($BE$14<5,COUNTIF(OFFSET($B24,$BE$14,0,MIN(5-$BE$14,$BE$15),1),\"NA\"),0)+IF($BE$14+$BE$15>5,COUNTIF(OFFSET($B29,MAX($BE$14-5,0),0,MIN($BE$14+$BE$15-5,$BE$15),1),\"NA\"),0)<>$BE$15)),\"NA\",IF($B25=\"\",\"missing\",IF(AND($B25<>\"NA\",COUNTA($D25,$F25:$G25)+COUNTIF($E25,\"<>0\")),UPPER($B25),\"!error\"))),\"\")","v":" "},0,{"$f":"IF(BD25=\"\",\"\",IF(BD25=\"NA\",\"NA\",IF(ISBLANK($D25),\"missing\",IF(AND(BE25=1,ISNUMBER($D25),$D25>4),4,IF(AND(ISNUMBER($D25),$D25>=0),$D25,IF(AND(ISTEXT($D25),$D25=\"ND\"),\"ND\",\"!error\"))))))","v":"missing"},{"$f":"IF(BD25=\"\",\"\",IF(BD25=\"NA\",\"NA\",IF(ISBLANK($E25),\"missing\",IF(OR(AND(ISBLANK($B25),COUNT(BF25,BI25:BJ25)=0,ISNUMBER($E25),$E25=0),AND(ISNUMBER($E25),$E25>0),AND(ISTEXT($E25),$E25=\"ND\")),$E25,\"!error\"))))","v":"missing"},{"$f":"IF(BD25=\"\",\"\",IF(AY25=0,\"NA\",IF(OR($BE$12=\"!error\",$BE$13=\"!error\",BG25=\"!error\"),\"!error\",IF(BD25=\"NA\",\"NA\",IF(AND(ISNUMBER(BG25),BG25=0),0,IF(AND(ISNUMBER($BE$12),ISNUMBER($BE$13),ISNUMBER(BG25)),$BE$13*$BE$12/BG25,IF(BG25=\"ND\",\"ND\",\"missing\")))))))","v":"missing"},{"$f":"IF(BD25=\"\",\"\",IF(BD25=\"NA\",\"NA\",IF(ISBLANK($F25),\"missing\",IF(OR(ISNUMBER($F25),$F25=\"ND\"),$F25,\"!error\"))))","v":"missing"},{"$f":"IF(BD25=\"\",\"\",IF(BD25=\"NA\",\"NA\",IF(ISBLANK($G25),\"missing\",IF(OR(AND(ISNUMBER($G25),$G25>=0,$G25<=14),$G25=\"ND\"),$G25,\"!error\"))))","v":"missing"},"missing",{"$f":"IF(BD25=\"\",\"\",IF(AY25=0,\"NA\",IF(CW25=\"ND\",\"ND\",IF(OR($BN$12=\"!error\",BD25=\"!error\",AND(BD25=\"missing\",ISNUMBER(BF25)),IF(BE25=1,BF25=\"!error\",0),BI25=\"!error\",BJ25=\"!error\"),\"!error\",IF(OR(BD25=\"NA\",AND(ISNUMBER($BN$12),$BN$12=0),AND(BE25<>0,ISNUMBER(BK25),BK25=0),AND(BE25=1,ISNUMBER(BJ25),BJ25>9),AND(BE25=2,ISNUMBER(BJ25),OR(BJ25<6,BJ25>=9.5)),AND(OR(BE25=3,BE25=4),ISNUMBER(BJ25),OR(BJ25<5.5,BJ25>=9.5))),\"NA\",IF(AND(ISNUMBER($BN$12),BE25<>0,IF(BE25=1,ISNUMBER(BF25),1),ISNUMBER(BI25),ISNUMBER(BJ25)),CT_Giardia(BE25,$BN$12,BI25,BJ25,IF(BE25=1,BF25,)),IF(COUNTIF(BE25,\"<>0\")+COUNT(BF25,BG25,BI25,BJ25)=5,\"!error\",\"missing\")))))))","v":"missing"},{"$f":"IF(BD25=\"\",\"\",IF(OR(AY25=0,AND(ISNUMBER($BN$12),$BN$12=0)),\"NA\",IF(CW25=\"ND\",\"ND\",IF(OR(BK25=\"!error\",BL25=\"!error\",BN25=\"!error\"),\"!error\",IF(BD25=\"NA\",\"NA\",IF(BL25=\"NA\",0,IF(AND(BE25<>99,ISNUMBER(BK25),ISNUMBER(BL25)),BK25/BL25,IF(AND(BE25=99,BN25=0.5),BN25/$BN$12,\"missing\"))))))))","v":"missing"},{"$f":"IF(BD25=\"\",\"\",IF(AY25=0,\"NA\",IF(CW25=\"ND\",\"ND\",IF(OR(BD25=\"!error\",AND(BD25=\"missing\",ISNUMBER(BF25)),BF25=\"!error\",BH25=\"!error\",BI25=\"!error\",BJ25=\"!error\"),\"!error\",IF(BD25=\"NA\",\"NA\",IF(OR(AND(BE25<>0,ISNUMBER(BK25),BK25=0),AND(BE25=1,ISNUMBER(BJ25),BJ25>9),AND(BE25=2,ISNUMBER(BJ25),OR(BJ25<6,BJ25>=9.5)),AND(OR(BE25=3,BE25=4),ISNUMBER(BJ25),OR(BJ25<5.5,BJ25>=9.5))),0,IF(AND(ISNUMBER($BN$12),BE25<>0,ISNUMBER(BF25),ISNUMBER(BH25),ISNUMBER(BI25),ISNUMBER(BJ25)),log_Giardia(BE25,$BN$12,BI25,BJ25,BF25,BH25),IF(COUNTIF(BE25,\"<>0\")+COUNT(BF25,BG25,BI25,BJ25)=5,\"!error\",\"missing\"))))))))","v":"missing"},{"$f":"IF(BD25=\"\",\"\",IF(AY25=0,\"NA\",IF(CW25=\"ND\",\"ND\",IF(OR($BP$12=\"!error\",BD25=\"!error\",AND(BD25=\"missing\",ISNUMBER(BF25)),BI25=\"!error\",BJ25=\"!error\"),\"!error\",IF(OR(BD25=\"NA\",AND(ISNUMBER($BP$12),$BP$12=0),AND(BE25<>0,ISNUMBER(BK25),BK25=0),AND(BE25=1,ISNUMBER(BJ25),BJ25>=10.5),AND(BE25=2,ISNUMBER(BJ25),OR(BJ25<6,BJ25>=9.5)),AND(BE25=3,ISNUMBER(BJ25),OR(BJ25<6,BJ25>9)),AND(BE25=4,ISNUMBER(BJ25),OR(BJ25<6,BJ25>10))),\"NA\",IF(AND(ISNUMBER($BP$12),BE25<>0,ISNUMBER(BI25),ISNUMBER(BJ25)),CT_Virus(BE25,$BP$12,BI25,BJ25),IF(COUNTIF(BE25,\"<>0\")+COUNT(BF25,BG25,BI25,BJ25)=5,\"!error\",\"missing\")))))))","v":"missing"},{"$f":"IF(BD25=\"\",\"\",IF(OR(AY25=0,AND(ISNUMBER($BP$12),$BP$12=0)),\"NA\",IF(CW25=\"ND\",\"ND\",IF(OR(BK25=\"!error\",BO25=\"!error\",BQ25=\"!error\"),\"!error\",IF(BD25=\"NA\",\"NA\",IF(BO25=\"NA\",0,IF(AND(BE25<>99,ISNUMBER(BK25),ISNUMBER(BO25)),BK25/BO25,IF(AND(BE25=99,BQ25=1),BQ25/$BP$12,\"missing\"))))))))","v":"missing"},{"$f":"IF(BD25=\"\",\"\",IF(AY25=0,\"NA\",IF(CW25=\"ND\",\"ND\",IF(OR(BD25=\"!error\",AND(BD25=\"missing\",ISNUMBER(BF25)),BF25=\"!error\",BH25=\"!error\",BI25=\"!error\",BJ25=\"!error\"),\"!error\",IF(BD25=\"NA\",\"NA\",IF(OR(AND(BE25<>0,ISNUMBER(BK25),BK25=0),AND(BE25=1,ISNUMBER(BJ25),BJ25>=10.5),AND(BE25=2,ISNUMBER(BJ25),OR(BJ25<6,BJ25>=9.5)),AND(BE25=3,ISNUMBER(BJ25),OR(BJ25<6,BJ25>9)),AND(BE25=4,ISNUMBER(BJ25),OR(BJ25<6,BJ25>10))),0,IF(AND(ISNUMBER($BP$12),BE25<>0,ISNUMBER(BF25),ISNUMBER(BH25),ISNUMBER(BI25),ISNUMBER(BJ25)),Log_Virus(BE25,$BP$12,BI25,BJ25,BF25,BH25),IF(COUNTIF(BE25,\"<>0\")+COUNT(BF25,BG25,BI25,BJ25)=5,\"!error\",\"missing\"))))))))","v":"missing"},{"$f":"IF($BJ$14=0,0,IF(COUNTIF(OFFSET($BD24,0,0,MIN($BJ$14,5),1),\"<>NA\")+IF($BJ$14>5,COUNTIF(OFFSET($BV24,0,0,$BJ$14-5,1),\"<>NA\"),0),1,0))","v":1},{"$f":"IF($BJ$14=0,0,IF(COUNTIF(OFFSET($BD24,0,0,MIN($BJ$14,5),1),\"O3\")+COUNTIF(OFFSET($BD24,0,0,MIN($BJ$14,5),1),\"O3 Cell 1\")+IF($BJ$14>5,COUNTIF(OFFSET($BV24,0,0,$BJ$14-5,1),\"O3\"),0)+IF($BJ$14>5,COUNTIF(OFFSET($BV24,0,0,$BJ$14-5,1),\"O3 Cell 1\"),0),1,0))","v":0},{"$f":"IF(OR($AY25=0,AND(COUNTA(D30,F30:G30)=0,COUNTIF(E30,0))),\"NA\",IF(COUNTA(D30:G30),IF(BS25,4,5),IF($BJ$15=1,IF(BS25,4,IF(BR25,5,6)),IF(BV25=\"!error\",IF(BS25,4,5),IF(BS25,\"5B\",6)))))","v":6},{"$f":"$BJ$11","v":7},{"$f":"IF(AND(IF($BN$4=\"missing\",10,$BN$4)>=7,$AY25<>\"\"),IF(OR($AY25=0,AND($B30=\"NA\",COUNTA($D30,$F30:$G30)=0,COUNTIF($E30,0)),AND($B30=\"NA\",COUNTA($D30:$G30)=0,IF($BJ$14=0,0,COUNTIF(OFFSET($BD24,0,0,MIN($BJ$14,5),1),\"NA\")+IF($BJ$14>5,COUNTIF(OFFSET($BV24,0,0,$BJ$14-5,1),\"NA\"),0))=$BJ$14),AND($B30=\"NA\",COUNTA($D30:$G30)=0,IF($BJ$14<5,COUNTA(OFFSET($D24,$BJ$14,0,MIN(5-$BJ$14,$BJ$15),4))-COUNTIF(OFFSET($E24,$BJ$14,0,MIN(5-$BJ$14,$BJ$15),1),0),0)+IF($BJ$14+$BJ$15>5,COUNTA(OFFSET($D29,MAX($BJ$14-5,0),0,MIN($BJ$14+$BJ$15-5,$BJ$15),4))-COUNTIF(OFFSET($E29,MAX($BJ$14-5,0),0,MIN($BJ$14+$BJ$15-5,$BJ$15),1),0),0)),AND($B30=\"NA\",COUNTA($D30:$G30)=0,IF($BJ$14<5,COUNTIF(OFFSET($B24,$BJ$14,0,MIN(5-$BJ$14,$BJ$15),1),\"NA\"),0)+IF($BJ$14+$BJ$15>5,COUNTIF(OFFSET($B29,MAX($BJ$14-5,0),0,MIN($BJ$14+$BJ$15-5,$BJ$15),1),\"NA\"),0)<>$BJ$15)),\"NA\",IF($B30=\"\",\"missing\",IF(AND($B30<>\"NA\",COUNTA($D30,$F30:$G30)+COUNTIF($E30,\"<>0\")),UPPER($B30),\"!error\"))),\"\")","v":""},"",{"$f":"IF(BV25=\"\",\"\",IF(BV25=\"NA\",\"NA\",IF(ISBLANK($D30),\"missing\",IF(AND(BW25=1,ISNUMBER($D30),$D30>4),4,IF(AND(ISNUMBER($D30),$D30>=0),$D30,IF(AND(ISTEXT($D30),$D30=\"ND\"),\"ND\",\"!error\"))))))","v":""},{"$f":"IF(BV25=\"\",\"\",IF(BV25=\"NA\",\"NA\",IF(ISBLANK($E30),\"missing\",IF(OR(AND(ISBLANK($B30),COUNT(BX25,CA25:CB25)=0,ISNUMBER($E30),$E30=0),AND(ISNUMBER($E30),$E30>0),AND(ISTEXT($E30),$E30=\"ND\")),$E30,\"!error\"))))","v":""},{"$f":"IF(BV25=\"\",\"\",IF(AY25=0,\"NA\",IF(OR($BJ$12=\"!error\",$BJ$13=\"!error\",BY25=\"!error\"),\"!error\",IF(BV25=\"NA\",\"NA\",IF(AND(ISNUMBER(BY25),BY25=0),0,IF(AND(ISNUMBER($BJ$12),ISNUMBER($BJ$13),ISNUMBER(BY25)),$BJ$13*$BJ$12/BY25,IF(BY25=\"ND\",\"ND\",\"missing\")))))))","v":""},{"$f":"IF(BV25=\"\",\"\",IF(BV25=\"NA\",\"NA\",IF(ISBLANK($F30),\"missing\",IF(OR(ISNUMBER($F30),$F30=\"ND\"),$F30,\"!error\"))))","v":""},{"$f":"IF(BV25=\"\",\"\",IF(BV25=\"NA\",\"NA\",IF(ISBLANK($G30),\"missing\",IF(OR(AND(ISNUMBER($G30),$G30>=0,$G30<=14),$G30=\"ND\"),$G30,\"!error\"))))","v":""},"",{"$f":"IF(BV25=\"\",\"\",IF(AY25=0,\"NA\",IF(CX25=\"ND\",\"ND\",IF(OR($BN$12=\"!error\",BV25=\"!error\",AND(BV25=\"missing\",ISNUMBER(BX25)),IF(BW25=1,BX25=\"!error\",0),CA25=\"!error\",CB25=\"!error\"),\"!error\",IF(OR(BV25=\"NA\",AND(ISNUMBER($BN$12),$BN$12=0),AND(BW25<>0,ISNUMBER(CC25),CC25=0),AND(BW25=1,ISNUMBER(CB25),CB25>9),AND(BW25>1,ISNUMBER(CB25),OR(CB25<6,CB25>=9.5))),\"NA\",IF(AND(ISNUMBER($BN$12),BW25<>0,IF(BW25=1,ISNUMBER(BX25),1),ISNUMBER(CA25),ISNUMBER(CB25)),CT_Giardia(BW25,$BN$12,CA25,CB25,IF(BW25=1,BX25,)),IF(COUNTIF(BW25,\"<>0\")+COUNT(BX25,BY25,CA25,CB25)=5,\"!error\",\"missing\")))))))","v":""},{"$f":"IF(BV25=\"\",\"\",IF(OR(AY25=0,AND(ISNUMBER($BN$12),$BN$12=0)),\"NA\",IF(CX25=\"ND\",\"ND\",IF(OR(CC25=\"!error\",CD25=\"!error\",CF25=\"!error\"),\"!error\",IF(BV25=\"NA\",\"NA\",IF(CD25=\"NA\",0,IF(AND(ISNUMBER(CC25),ISNUMBER(CD25)),CC25/CD25,IF(AND(BW25=99,CF25=0.5),CF25/$BN$12,\"missing\"))))))))","v":""},{"$f":"IF(BV25=\"\",\"\",IF(AY25=0,\"NA\",IF(CX25=\"ND\",\"ND\",IF(OR(BV25=\"!error\",AND(BV25=\"missing\",ISNUMBER(BX25)),BX25=\"!error\",BZ25=\"!error\",CA25=\"!error\",CB25=\"!error\"),\"!error\",IF(BV25=\"NA\",\"NA\",IF(OR(AND(BW25<>0,ISNUMBER(CC25),CC25=0),AND(BW25=1,ISNUMBER(CB25),CB25>9),AND(BW25>1,ISNUMBER(CB25),OR(CB25<6,CB25>=9.5))),0,IF(AND(ISNUMBER($BN$12),BW25<>0,ISNUMBER(BX25),ISNUMBER(BZ25),ISNUMBER(CA25),ISNUMBER(CB25)),log_Giardia(BW25,$BN$12,CA25,CB25,BX25,BZ25),IF(COUNTIF(BW25,\"<>0\")+COUNT(BX25,BY25,CA25,CB25)=5,\"!error\",\"missing\"))))))))","v":""},{"$f":"IF(BV25=\"\",\"\",IF(AY25=0,\"NA\",IF(CX25=\"ND\",\"ND\",IF(OR($BP$12=\"!error\",BV25=\"!error\",AND(BV25=\"missing\",ISNUMBER(BX25)),CA25=\"!error\",CB25=\"!error\"),\"!error\",IF(OR(BV25=\"NA\",AND(ISNUMBER($BP$12),$BP$12=0),AND(BW25<>0,ISNUMBER(CC25),CC25=0),AND(BW25=1,ISNUMBER(CB25),OR(CB25<5.5,CB25>=10.5)),AND(OR(BW25=2,BW25=4),ISNUMBER(CB25),OR(CB25<6,CB25>=9.5)),AND(BW25=3,ISNUMBER(CB25),OR(CB25<6,CB25>9))),\"NA\",IF(AND(ISNUMBER($BP$12),BW25<>0,ISNUMBER(CA25),ISNUMBER(CB25)),CT_Virus(BW25,$BP$12,CA25,CB25),IF(COUNTIF(BW25,\"<>0\")+COUNT(BX25,BY25,CA25,CB25)=5,\"!error\",\"missing\")))))))","v":""},{"$f":"IF(BV25=\"\",\"\",IF(OR(AY25=0,AND(ISNUMBER($BP$12),$BP$12=0)),\"NA\",IF(CX25=\"ND\",\"ND\",IF(OR(CC25=\"!error\",CG25=\"!error\",CI25=\"!error\"),\"!error\",IF(BV25=\"NA\",\"NA\",IF(CG25=\"NA\",0,IF(AND(ISNUMBER(CC25),ISNUMBER(CG25)),CC25/CG25,IF(AND(BW25=99,CI25=1),CI25/$BP$12,\"missing\"))))))))","v":""},{"$f":"IF(BV25=\"\",\"\",IF(AY25=0,\"NA\",IF(CX25=\"ND\",\"ND\",IF(OR(BV25=\"!error\",AND(BV25=\"missing\",ISNUMBER(BX25)),BX25=\"!error\",BZ25=\"!error\",CA25=\"!error\",CB25=\"!error\"),\"!error\",IF(BV25=\"NA\",\"NA\",IF(OR(AND(BW25<>0,ISNUMBER(CC25),CC25=0),AND(BW25=1,ISNUMBER(CB25),OR(CB25<5.5,CB25>=10.5)),AND(OR(BW25=2,BW25=4),ISNUMBER(CB25),OR(CB25<6,CB25>=9.5)),AND(BW25=3,ISNUMBER(CB25),OR(CB25<6,CB25>9))),0,IF(AND(ISNUMBER($BP$12),BW25<>0,ISNUMBER(BX25),ISNUMBER(BZ25),ISNUMBER(CA25),ISNUMBER(CB25)),Log_Virus(BW25,$BP$12,CA25,CB25,BX25,BZ25),IF(COUNTIF(BW25,\"<>0\")+COUNT(BX25,BY25,CA25,CB25)=5,\"!error\",\"missing\"))))))))","v":""},null,null,null,null,null,null,null,null,null,null,null,null,null,{"$f":"IF(OR(BF25=\"ND\",BG25=\"ND\",BI25=\"ND\",BJ25=\"ND\"),\"ND\",\"data\")","v":"data"},{"$f":"IF(OR(BX25=\"ND\",BY25=\"ND\",CA25=\"ND\",CB25=\"ND\"),\"ND\",\"data\")","v":"data"}]
[null," ",{"$f":"$E$15","v":3},null,null,null,null,{"$f":"IF(BL26=\"!error\",\"!error\",$BK26)","v":"missing"},"missing","missing","missing","missing",null,null,null,null,"",null,null,null,null,null,null,null,null,null,null,null,null,null,null,null,null,null,null,null,null,null,null,null,null,null,null,null,null,null,null,null,null,null,1,{"$f":"IF($BF$14=0,0,IF(COUNTIF(OFFSET($BD24,0,0,MIN($BF$14,5),1),\"<>NA\")+IF($BF$14>5,COUNTIF(OFFSET($BV24,0,0,$BF$14-5,1),\"<>NA\"),0),1,0))","v":1},{"$f":"IF($BF$14=0,0,IF(COUNTIF(OFFSET($BD24,0,0,MIN($BF$14,5),1),\"O3\")+COUNTIF(OFFSET($BD24,0,0,MIN($BF$14,5),1),\"O3 Cell 1\")+IF($BF$14>5,COUNTIF(OFFSET($BV24,0,0,$BF$14-5,1),\"O3\"),0)+IF($BF$14>5,COUNTIF(OFFSET($BV24,0,0,$BF$14-5,1),\"O3 Cell 1\"),0),1,0))","v":0},{"$f":"IF(OR($AY26=0,AND(COUNTA(D26,F26:G26)=0,COUNTIF(E26,0))),\"NA\",IF(COUNTA(D26:G26),IF(BA26,4,5),IF($BF$15=1,IF(BA26,4,IF(AZ26,5,6)),IF(BD26=\"!error\",IF(BA26,4,5),IF(BA26,\"5B\",6)))))","v":5},{"$f":"$BF$11","v":3},{"$f":"IF(AND(IF($BN$4=\"missing\",10,$BN$4)>=3,$AY26<>\"\"),IF(OR($AY26=0,AND($B26=\"NA\",COUNTA($D26,$F26:$G26)=0,COUNTIF($E26,0)),AND($B26=\"NA\",COUNTA($D26:$G26)=0,IF($BF$14=0,0,COUNTIF(OFFSET($BD24,0,0,MIN($BF$14,5),1),\"NA\")+IF($BF$14>5,COUNTIF(OFFSET($BV24,0,0,$BF$14-5,1),\"NA\"),0))=$BF$14),AND($B26=\"NA\",COUNTA($D26:$G26)=0,IF($BF$14<5,COUNTA(OFFSET($D24,$BF$14,0,MIN(5-$BF$14,$BF$15),4))-COUNTIF(OFFSET($E24,$BF$14,0,MIN(5-$BF$14,$BF$15),1),0),0)+IF($BF$14+$BF$15>5,COUNTA(OFFSET($D29,MAX($BF$14-5,0),0,MIN($BF$14+$BF$15-5,$BF$15),4))-COUNTIF(OFFSET($E29,MAX($BF$14-5,0),0,MIN($BF$14+$BF$15-5,$BF$15),1),0),0)),AND($B26=\"NA\",COUNTA($D26:$G26)=0,IF($BF$14<5,COUNTIF(OFFSET($B24,$BF$14,0,MIN(5-$BF$14,$BF$15),1),\"NA\"),0)+IF($BF$14+$BF$15>5,COUNTIF(OFFSET($B29,MAX($BF$14-5,0),0,MIN($BF$14+$BF$15-5,$BF$15),1),\"NA\"),0)<>$BF$15)),\"NA\",IF($B26=\"\",\"missing\",IF(AND($B26<>\"NA\",COUNTA($D26,$F26:$G26)+COUNTIF($E26,\"<>0\")),UPPER($B26),\"!error\"))),\"\")","v":" "},0,"missing","missing",{"$f":"IF(BD26=\"\",\"\",IF(AY26=0,\"NA\",IF(OR($BF$12=\"!error\",$BF$13=\"!error\",BG26=\"!error\"),\"!error\",IF(BD26=\"NA\",\"NA\",IF(AND(ISNUMBER(BG26),BG26=0),0,IF(AND(ISNUMBER($BF$12),ISNUMBER($BF$13),ISNUMBER(BG26)),$BF$13*$BF$12/BG26,IF(BG26=\"ND\",\"ND\",\"missing\")))))))","v":"missing"},"missing","missing","missing",{"$f":"IF(BD26=\"\",\"\",IF(AY26=0,\"NA\",IF(CW26=\"ND\",\"ND\",IF(OR($BN$12=\"!error\",BD26=\"!error\",AND(BD26=\"missing\",ISNUMBER(BF26)),IF(BE26=1,BF26=\"!error\",0),BI26=\"!error\",BJ26=\"!error\"),\"!error\",IF(OR(BD26=\"NA\",AND(ISNUMBER($BN$12),$BN$12=0),AND(BE26<>0,ISNUMBER(BK26),BK26=0),AND(BE26=1,ISNUMBER(BJ26),BJ26>9),AND(BE26=2,ISNUMBER(BJ26),OR(BJ26<6,BJ26>=9.5)),AND(OR(BE26=3,BE26=4),ISNUMBER(BJ26),OR(BJ26<5.5,BJ26>=9.5))),\"NA\",IF(AND(ISNUMBER($BN$12),BE26<>0,IF(BE26=1,ISNUMBER(BF26),1),ISNUMBER(BI26),ISNUMBER(BJ26)),CT_Giardia(BE26,$BN$12,BI26,BJ26,IF(BE26=1,BF26,)),IF(COUNTIF(BE26,\"<>0\")+COUNT(BF26,BG26,BI26,BJ26)=5,\"!error\",\"missing\")))))))","v":"missing"},{"$f":"IF(BD26=\"\",\"\",IF(OR(AY26=0,AND(ISNUMBER($BN$12),$BN$12=0)),\"NA\",IF(CW26=\"ND\",\"ND\",IF(OR(BK26=\"!error\",BL26=\"!error\",BN26=\"!error\"),\"!error\",IF(BD26=\"NA\",\"NA\",IF(BL26=\"NA\",0,IF(AND(BE26<>99,ISNUMBER(BK26),ISNUMBER(BL26)),BK26/BL26,IF(AND(BE26=99,BN26=0.5),BN26/$BN$12,\"missing\"))))))))","v":"missing"},{"$f":"IF(BD26=\"\",\"\",IF(AY26=0,\"NA\",IF(CW26=\"ND\",\"ND\",IF(OR(BD26=\"!error\",AND(BD26=\"missing\",ISNUMBER(BF26)),BF26=\"!error\",BH26=\"!error\",BI26=\"!error\",BJ26=\"!error\"),\"!error\",IF(BD26=\"NA\",\"NA\",IF(OR(AND(BE26<>0,ISNUMBER(BK26),BK26=0),AND(BE26=1,ISNUMBER(BJ26),BJ26>9),AND(BE26=2,ISNUMBER(BJ26),OR(BJ26<6,BJ26>=9.5)),AND(OR(BE26=3,BE26=4),ISNUMBER(BJ26),OR(BJ26<5.5,BJ26>=9.5))),0,IF(AND(ISNUMBER($BN$12),BE26<>0,ISNUMBER(BF26),ISNUMBER(BH26),ISNUMBER(BI26),ISNUMBER(BJ26)),log_Giardia(BE26,$BN$12,BI26,BJ26,BF26,BH26),IF(COUNTIF(BE26,\"<>0\")+COUNT(BF26,BG26,BI26,BJ26)=5,\"!error\",\"missing\"))))))))","v":"missing"},{"$f":"IF(BD26=\"\",\"\",IF(AY26=0,\"NA\",IF(CW26=\"ND\",\"ND\",IF(OR($BP$12=\"!error\",BD26=\"!error\",AND(BD26=\"missing\",ISNUMBER(BF26)),BI26=\"!error\",BJ26=\"!error\"),\"!error\",IF(OR(BD26=\"NA\",AND(ISNUMBER($BP$12),$BP$12=0),AND(BE26<>0,ISNUMBER(BK26),BK26=0),AND(BE26=1,ISNUMBER(BJ26),BJ26>=10.5),AND(BE26=2,ISNUMBER(BJ26),OR(BJ26<6,BJ26>=9.5)),AND(BE26=3,ISNUMBER(BJ26),OR(BJ26<6,BJ26>9)),AND(BE26=4,ISNUMBER(BJ26),OR(BJ26<6,BJ26>10))),\"NA\",IF(AND(ISNUMBER($BP$12),BE26<>0,ISNUMBER(BI26),ISNUMBER(BJ26)),CT_Virus(BE26,$BP$12,BI26,BJ26),IF(COUNTIF(BE26,\"<>0\")+COUNT(BF26,BG26,BI26,BJ26)=5,\"!error\",\"missing\")))))))","v":"missing"},{"$f":"IF(BD26=\"\",\"\",IF(OR(AY26=0,AND(ISNUMBER($BP$12),$BP$12=0)),\"NA\",IF(CW26=\"ND\",\"ND\",IF(OR(BK26=\"!error\",BO26=\"!error\",BQ26=\"!error\"),\"!error\",IF(BD26=\"NA\",\"NA\",IF(BO26=\"NA\",0,IF(AND(BE26<>99,ISNUMBER(BK26),ISNUMBER(BO26)),BK26/BO26,IF(AND(BE26=99,BQ26=1),BQ26/$BP$12,\"missing\"))))))))","v":"missing"},{"$f":"IF(BD26=\"\",\"\",IF(AY26=0,\"NA\",IF(CW26=\"ND\",\"ND\",IF(OR(BD26=\"!error\",AND(BD26=\"missing\",ISNUMBER(BF26)),BF26=\"!error\",BH26=\"!error\",BI26=\"!error\",BJ26=\"!error\"),\"!error\",IF(BD26=\"NA\",\"NA\",IF(OR(AND(BE26<>0,ISNUMBER(BK26),BK26=0),AND(BE26=1,ISNUMBER(BJ26),BJ26>=10.5),AND(BE26=2,ISNUMBER(BJ26),OR(BJ26<6,BJ26>=9.5)),AND(BE26=3,ISNUMBER(BJ26),OR(BJ26<6,BJ26>9)),AND(BE26=4,ISNUMBER(BJ26),OR(BJ26<6,BJ26>10))),0,IF(AND(ISNUMBER($BP$12),BE26<>0,ISNUMBER(BF26),ISNUMBER(BH26),ISNUMBER(BI26),ISNUMBER(BJ26)),Log_Virus(BE26,$BP$12,BI26,BJ26,BF26,BH26),IF(COUNTIF(BE26,\"<>0\")+COUNT(BF26,BG26,BI26,BJ26)=5,\"!error\",\"missing\"))))))))","v":"missing"},{"$f":"IF($BK$14=0,0,IF(COUNTIF(OFFSET($BD24,0,0,MIN($BK$14,5),1),\"<>NA\")+IF($BK$14>5,COUNTIF(OFFSET($BV24,0,0,$BK$14-5,1),\"<>NA\"),0),1,0))","v":1},{"$f":"IF($BK$14=0,0,IF(COUNTIF(OFFSET($BD24,0,0,MIN($BK$14,5),1),\"O3\")+COUNTIF(OFFSET($BD24,0,0,MIN($BK$14,5),1),\"O3 Cell 1\")+IF($BK$14>5,COUNTIF(OFFSET($BV24,0,0,$BK$14-5,1),\"O3\"),0)+IF($BK$14>5,COUNTIF(OFFSET($BV24,0,0,$BK$14-5,1),\"O3 Cell 1\"),0),1,0))","v":0},{"$f":"IF(OR($AY26=0,AND(COUNTA(D31,F31:G31)=0,COUNTIF(E31,0))),\"NA\",IF(COUNTA(D31:G31),IF(BS26,4,5),IF($BK$15=1,IF(BS26,4,IF(BR26,5,6)),IF(BV26=\"!error\",IF(BS26,4,5),IF(BS26,\"5B\",6)))))","v":6},{"$f":"$BK$11","v":8},{"$f":"IF(AND(IF($BN$4=\"missing\",10,$BN$4)>=8,$AY26<>\"\"),IF(OR($AY26=0,AND($B31=\"NA\",COUNTA($D31,$F31:$G31)=0,COUNTIF($E31,0)),AND($B31=\"NA\",COUNTA($D31:$G31)=0,IF($BK$14=0,0,COUNTIF(OFFSET($BD24,0,0,MIN($BK$14,5),1),\"NA\")+IF($BK$14>5,COUNTIF(OFFSET($BV24,0,0,$BK$14-5,1),\"NA\"),0))=$BK$14),AND($B31=\"NA\",COUNTA($D31:$G31)=0,IF($BK$14<5,COUNTA(OFFSET($D24,$BK$14,0,MIN(5-$BK$14,$BK$15),4))-COUNTIF(OFFSET($E24,$BK$14,0,MIN(5-$BK$14,$BK$15),1),0),0)+IF($BK$14+$BK$15>5,COUNTA(OFFSET($D29,MAX($BK$14-5,0),0,MIN($BK$14+$BK$15-5,$BK$15),4))-COUNTIF(OFFSET($E29,MAX($BK$14-5,0),0,MIN($BK$14+$BK$15-5,$BK$15),1),0),0)),AND($B31=\"NA\",COUNTA($D31:$G31)=0,IF($BK$14<5,COUNTIF(OFFSET($B24,$BK$14,0,MIN(5-$BK$14,$BK$15),1),\"NA\"),0)+IF($BK$14+$BK$15>5,COUNTIF(OFFSET($B29,MAX($BK$14-5,0),0,MIN($BK$14+$BK$15-5,$BK$15),1),\"NA\"),0)<>$BK$15)),\"NA\",IF($B31=\"\",\"missing\",IF(AND($B31<>\"NA\",COUNTA($D31,$F31:$G31)+COUNTIF($E31,\"<>0\")),UPPER($B31),\"!error\"))),\"\")","v":""},"",{"$f":"IF(BV26=\"\",\"\",IF(BV26=\"NA\",\"NA\",IF(ISBLANK($D31),\"missing\",IF(AND(BW26=1,ISNUMBER($D31),$D31>4),4,IF(AND(ISNUMBER($D31),$D31>=0),$D31,IF(AND(ISTEXT($D31),$D31=\"ND\"),\"ND\",\"!error\"))))))","v":""},{"$f":"IF(BV26=\"\",\"\",IF(BV26=\"NA\",\"NA\",IF(ISBLANK($E31),\"missing\",IF(OR(AND(ISBLANK($B31),COUNT(BX26,CA26:CB26)=0,ISNUMBER($E31),$E31=0),AND(ISNUMBER($E31),$E31>0),AND(ISTEXT($E31),$E31=\"ND\")),$E31,\"!error\"))))","v":""},{"$f":"IF(BV26=\"\",\"\",IF(AY26=0,\"NA\",IF(OR($BK$12=\"!error\",$BK$13=\"!error\",BY26=\"!error\"),\"!error\",IF(BV26=\"NA\",\"NA\",IF(AND(ISNUMBER(BY26),BY26=0),0,IF(AND(ISNUMBER($BK$12),ISNUMBER($BK$13),ISNUMBER(BY26)),$BK$13*$BK$12/BY26,IF(BY26=\"ND\",\"ND\",\"missing\")))))))","v":""},{"$f":"IF(BV26=\"\",\"\",IF(BV26=\"NA\",\"NA\",IF(ISBLANK($F31),\"missing\",IF(OR(ISNUMBER($F31),$F31=\"ND\"),$F31,\"!error\"))))","v":""},{"$f":"IF(BV26=\"\",\"\",IF(BV26=\"NA\",\"NA\",IF(ISBLANK($G31),\"missing\",IF(OR(AND(ISNUMBER($G31),$G31>=0,$G31<=14),$G31=\"ND\"),$G31,\"!error\"))))","v":""},"",{"$f":"IF(BV26=\"\",\"\",IF(AY26=0,\"NA\",IF(CX26=\"ND\",\"ND\",IF(OR($BN$12=\"!error\",BV26=\"!error\",AND(BV26=\"missing\",ISNUMBER(BX26)),IF(BW26=1,BX26=\"!error\",0),CA26=\"!error\",CB26=\"!error\"),\"!error\",IF(OR(BV26=\"NA\",AND(ISNUMBER($BN$12),$BN$12=0),AND(BW26<>0,ISNUMBER(CC26),CC26=0),AND(BW26=1,ISNUMBER(CB26),CB26>9),AND(BW26>1,ISNUMBER(CB26),OR(CB26<6,CB26>=9.5))),\"NA\",IF(AND(ISNUMBER($BN$12),BW26<>0,IF(BW26=1,ISNUMBER(BX26),1),ISNUMBER(CA26),ISNUMBER(CB26)),CT_Giardia(BW26,$BN$12,CA26,CB26,IF(BW26=1,BX26,)),IF(COUNTIF(BW26,\"<>0\")+COUNT(BX26,BY26,CA26,CB26)=5,\"!error\",\"missing\")))))))","v":""},{"$f":"IF(BV26=\"\",\"\",IF(OR(AY26=0,AND(ISNUMBER($BN$12),$BN$12=0)),\"NA\",IF(CX26=\"ND\",\"ND\",IF(OR(CC26=\"!error\",CD26=\"!error\",CF26=\"!error\"),\"!error\",IF(BV26=\"NA\",\"NA\",IF(CD26=\"NA\",0,IF(AND(ISNUMBER(CC26),ISNUMBER(CD26)),CC26/CD26,IF(AND(BW26=99,CF26=0.5),CF26/$BN$12,\"missing\"))))))))","v":""},{"$f":"IF(BV26=\"\",\"\",IF(AY26=0,\"NA\",IF(CX26=\"ND\",\"ND\",IF(OR(BV26=\"!error\",AND(BV26=\"missing\",ISNUMBER(BX26)),BX26=\"!error\",BZ26=\"!error\",CA26=\"!error\",CB26=\"!error\"),\"!error\",IF(BV26=\"NA\",\"NA\",IF(OR(AND(BW26<>0,ISNUMBER(CC26),CC26=0),AND(BW26=1,ISNUMBER(CB26),CB26>9),AND(BW26>1,ISNUMBER(CB26),OR(CB26<6,CB26>=9.5))),0,IF(AND(ISNUMBER($BN$12),BW26<>0,ISNUMBER(BX26),ISNUMBER(BZ26),ISNUMBER(CA26),ISNUMBER(CB26)),log_Giardia(BW26,$BN$12,CA26,CB26,BX26,BZ26),IF(COUNTIF(BW26,\"<>0\")+COUNT(BX26,BY26,CA26,CB26)=5,\"!error\",\"missing\"))))))))","v":""},{"$f":"IF(BV26=\"\",\"\",IF(AY26=0,\"NA\",IF(CX26=\"ND\",\"ND\",IF(OR($BP$12=\"!error\",BV26=\"!error\",AND(BV26=\"missing\",ISNUMBER(BX26)),CA26=\"!error\",CB26=\"!error\"),\"!error\",IF(OR(BV26=\"NA\",AND(ISNUMBER($BP$12),$BP$12=0),AND(BW26<>0,ISNUMBER(CC26),CC26=0),AND(BW26=1,ISNUMBER(CB26),OR(CB26<5.5,CB26>=10.5)),AND(OR(BW26=2,BW26=4),ISNUMBER(CB26),OR(CB26<6,CB26>=9.5)),AND(BW26=3,ISNUMBER(CB26),OR(CB26<6,CB26>9))),\"NA\",IF(AND(ISNUMBER($BP$12),BW26<>0,ISNUMBER(CA26),ISNUMBER(CB26)),CT_Virus(BW26,$BP$12,CA26,CB26),IF(COUNTIF(BW26,\"<>0\")+COUNT(BX26,BY26,CA26,CB26)=5,\"!error\",\"missing\")))))))","v":""},{"$f":"IF(BV26=\"\",\"\",IF(OR(AY26=0,AND(ISNUMBER($BP$12),$BP$12=0)),\"NA\",IF(CX26=\"ND\",\"ND\",IF(OR(CC26=\"!error\",CG26=\"!error\",CI26=\"!error\"),\"!error\",IF(BV26=\"NA\",\"NA\",IF(CG26=\"NA\",0,IF(AND(ISNUMBER(CC26),ISNUMBER(CG26)),CC26/CG26,IF(AND(BW26=99,CI26=1),CI26/$BP$12,\"missing\"))))))))","v":""},{"$f":"IF(BV26=\"\",\"\",IF(AY26=0,\"NA\",IF(CX26=\"ND\",\"ND\",IF(OR(BV26=\"!error\",AND(BV26=\"missing\",ISNUMBER(BX26)),BX26=\"!error\",BZ26=\"!error\",CA26=\"!error\",CB26=\"!error\"),\"!error\",IF(BV26=\"NA\",\"NA\",IF(OR(AND(BW26<>0,ISNUMBER(CC26),CC26=0),AND(BW26=1,ISNUMBER(CB26),OR(CB26<5.5,CB26>=10.5)),AND(OR(BW26=2,BW26=4),ISNUMBER(CB26),OR(CB26<6,CB26>=9.5)),AND(BW26=3,ISNUMBER(CB26),OR(CB26<6,CB26>9))),0,IF(AND(ISNUMBER($BP$12),BW26<>0,ISNUMBER(BX26),ISNUMBER(BZ26),ISNUMBER(CA26),ISNUMBER(CB26)),Log_Virus(BW26,$BP$12,CA26,CB26,BX26,BZ26),IF(COUNTIF(BW26,\"<>0\")+COUNT(BX26,BY26,CA26,CB26)=5,\"!error\",\"missing\"))))))))","v":""},null,null,null,null,null,null,null,null,null,null,null,null,null,"data","data"]
[null," ",{"$f":"$F$15","v":4},null,null,null,null,{"$f":"IF(BL27=\"!error\",\"!error\",$BK27)","v":""},"","","","",null,null,null,null,"",null,null,null,null,null,null,null,null,null,null,null,null,null,null,null,null,null,null,null,null,null,null,null,null,null,null,null,null,null,null,null,null,null,1,{"$f":"IF($BG$14=0,0,IF(COUNTIF(OFFSET($BD24,0,0,MIN($BG$14,5),1),\"<>NA\")+IF($BG$14>5,COUNTIF(OFFSET($BV24,0,0,$BG$14-5,1),\"<>NA\"),0),1,0))","v":1},{"$f":"IF($BG$14=0,0,IF(COUNTIF(OFFSET($BD24,0,0,MIN($BG$14,5),1),\"O3\")+COUNTIF(OFFSET($BD24,0,0,MIN($BG$14,5),1),\"O3 Cell 1\")+IF($BG$14>5,COUNTIF(OFFSET($BV24,0,0,$BG$14-5,1),\"O3\"),0)+IF($BG$14>5,COUNTIF(OFFSET($BV24,0,0,$BG$14-5,1),\"O3 Cell 1\"),0),1,0))","v":0},{"$f":"IF(OR($AY27=0,AND(COUNTA(D27,F27:G27)=0,COUNTIF(E27,0))),\"NA\",IF(COUNTA(D27:G27),IF(BA27,4,5),IF($BG$15=1,IF(BA27,4,IF(AZ27,5,6)),IF(BD27=\"!error\",IF(BA27,4,5),IF(BA27,\"5B\",6)))))","v":6},{"$f":"$BG$11","v":4},{"$f":"IF(AND(IF($BN$4=\"missing\",10,$BN$4)>=4,$AY27<>\"\"),IF(OR($AY27=0,AND($B27=\"NA\",COUNTA($D27,$F27:$G27)=0,COUNTIF($E27,0)),AND($B27=\"NA\",COUNTA($D27:$G27)=0,IF($BG$14=0,0,COUNTIF(OFFSET($BD24,0,0,MIN($BG$14,5),1),\"NA\")+IF($BG$14>5,COUNTIF(OFFSET($BV24,0,0,$BG$14-5,1),\"NA\"),0))=$BG$14),AND($B27=\"NA\",COUNTA($D27:$G27)=0,IF($BG$14<5,COUNTA(OFFSET($D24,$BG$14,0,MIN(5-$BG$14,$BG$15),4))-COUNTIF(OFFSET($E24,$BG$14,0,MIN(5-$BG$14,$BG$15),1),0),0)+IF($BG$14+$BG$15>5,COUNTA(OFFSET($D29,MAX($BG$14-5,0),0,MIN($BG$14+$BG$15-5,$BG$15),4))-COUNTIF(OFFSET($E29,MAX($BG$14-5,0),0,MIN($BG$14+$BG$15-5,$BG$15),1),0),0)),AND($B27=\"NA\",COUNTA($D27:$G27)=0,IF($BG$14<5,COUNTIF(OFFSET($B24,$BG$14,0,MIN(5-$BG$14,$BG$15),1),\"NA\"),0)+IF($BG$14+$BG$15>5,COUNTIF(OFFSET($B29,MAX($BG$14-5,0),0,MIN($BG$14+$BG$15-5,$BG$15),1),\"NA\"),0)<>$BG$15)),\"NA\",IF($B27=\"\",\"missing\",IF(AND($B27<>\"NA\",COUNTA($D27,$F27:$G27)+COUNTIF($E27,\"<>0\")),UPPER($B27),\"!error\"))),\"\")","v":""},"","","",{"$f":"IF(BD27=\"\",\"\",IF(AY27=0,\"NA\",IF(OR($BG$12=\"!error\",$BG$13=\"!error\",BG27=\"!error\"),\"!error\",IF(BD27=\"NA\",\"NA\",IF(AND(ISNUMBER(BG27),BG27=0),0,IF(AND(ISNUMBER($BG$12),ISNUMBER($BG$13),ISNUMBER(BG27)),$BG$13*$BG$12/BG27,IF(BG27=\"ND\",\"ND\",\"missing\")))))))","v":""},"","","",{"$f":"IF(BD27=\"\",\"\",IF(AY27=0,\"NA\",IF(CW27=\"ND\",\"ND\",IF(OR($BN$12=\"!error\",BD27=\"!error\",AND(BD27=\"missing\",ISNUMBER(BF27)),IF(BE27=1,BF27=\"!error\",0),BI27=\"!error\",BJ27=\"!error\"),\"!error\",IF(OR(BD27=\"NA\",AND(ISNUMBER($BN$12),$BN$12=0),AND(BE27<>0,ISNUMBER(BK27),BK27=0),AND(BE27=1,ISNUMBER(BJ27),BJ27>9),AND(BE27=2,ISNUMBER(BJ27),OR(BJ27<6,BJ27>=9.5)),AND(OR(BE27=3,BE27=4),ISNUMBER(BJ27),OR(BJ27<5.5,BJ27>=9.5))),\"NA\",IF(AND(ISNUMBER($BN$12),BE27<>0,IF(BE27=1,ISNUMBER(BF27),1),ISNUMBER(BI27),ISNUMBER(BJ27)),CT_Giardia(BE27,$BN$12,BI27,BJ27,IF(BE27=1,BF27,)),IF(COUNTIF(BE27,\"<>0\")+COUNT(BF27,BG27,BI27,BJ27)=5,\"!error\",\"missing\")))))))","v":""},{"$f":"IF(BD27=\"\",\"\",IF(OR(AY27=0,AND(ISNUMBER($BN$12),$BN$12=0)),\"NA\",IF(CW27=\"ND\",\"ND\",IF(OR(BK27=\"!error\",BL27=\"!error\",BN27=\"!error\"),\"!error\",IF(BD27=\"NA\",\"NA\",IF(BL27=\"NA\",0,IF(AND(BE27<>99,ISNUMBER(BK27),ISNUMBER(BL27)),BK27/BL27,IF(AND(BE27=99,BN27=0.5),BN27/$BN$12,\"missing\"))))))))","v":""},{"$f":"IF(BD27=\"\",\"\",IF(AY27=0,\"NA\",IF(CW27=\"ND\",\"ND\",IF(OR(BD27=\"!error\",AND(BD27=\"missing\",ISNUMBER(BF27)),BF27=\"!error\",BH27=\"!error\",BI27=\"!error\",BJ27=\"!error\"),\"!error\",IF(BD27=\"NA\",\"NA\",IF(OR(AND(BE27<>0,ISNUMBER(BK27),BK27=0),AND(BE27=1,ISNUMBER(BJ27),BJ27>9),AND(BE27=2,ISNUMBER(BJ27),OR(BJ27<6,BJ27>=9.5)),AND(OR(BE27=3,BE27=4),ISNUMBER(BJ27),OR(BJ27<5.5,BJ27>=9.5))),0,IF(AND(ISNUMBER($BN$12),BE27<>0,ISNUMBER(BF27),ISNUMBER(BH27),ISNUMBER(BI27),ISNUMBER(BJ27)),log_Giardia(BE27,$BN$12,BI27,BJ27,BF27,BH27),IF(COUNTIF(BE27,\"<>0\")+COUNT(BF27,BG27,BI27,BJ27)=5,\"!error\",\"missing\"))))))))","v":""},{"$f":"IF(BD27=\"\",\"\",IF(AY27=0,\"NA\",IF(CW27=\"ND\",\"ND\",IF(OR($BP$12=\"!error\",BD27=\"!error\",AND(BD27=\"missing\",ISNUMBER(BF27)),BI27=\"!error\",BJ27=\"!error\"),\"!error\",IF(OR(BD27=\"NA\",AND(ISNUMBER($BP$12),$BP$12=0),AND(BE27<>0,ISNUMBER(BK27),BK27=0),AND(BE27=1,ISNUMBER(BJ27),BJ27>=10.5),AND(BE27=2,ISNUMBER(BJ27),OR(BJ27<6,BJ27>=9.5)),AND(BE27=3,ISNUMBER(BJ27),OR(BJ27<6,BJ27>9)),AND(BE27=4,ISNUMBER(BJ27),OR(BJ27<6,BJ27>10))),\"NA\",IF(AND(ISNUMBER($BP$12),BE27<>0,ISNUMBER(BI27),ISNUMBER(BJ27)),CT_Virus(BE27,$BP$12,BI27,BJ27),IF(COUNTIF(BE27,\"<>0\")+COUNT(BF27,BG27,BI27,BJ27)=5,\"!error\",\"missing\")))))))","v":""},{"$f":"IF(BD27=\"\",\"\",IF(OR(AY27=0,AND(ISNUMBER($BP$12),$BP$12=0)),\"NA\",IF(CW27=\"ND\",\"ND\",IF(OR(BK27=\"!error\",BO27=\"!error\",BQ27=\"!error\"),\"!error\",IF(BD27=\"NA\",\"NA\",IF(BO27=\"NA\",0,IF(AND(BE27<>99,ISNUMBER(BK27),ISNUMBER(BO27)),BK27/BO27,IF(AND(BE27=99,BQ27=1),BQ27/$BP$12,\"missing\"))))))))","v":""},{"$f":"IF(BD27=\"\",\"\",IF(AY27=0,\"NA\",IF(CW27=\"ND\",\"ND\",IF(OR(BD27=\"!error\",AND(BD27=\"missing\",ISNUMBER(BF27)),BF27=\"!error\",BH27=\"!error\",BI27=\"!error\",BJ27=\"!error\"),\"!error\",IF(BD27=\"NA\",\"NA\",IF(OR(AND(BE27<>0,ISNUMBER(BK27),BK27=0),AND(BE27=1,ISNUMBER(BJ27),BJ27>=10.5),AND(BE27=2,ISNUMBER(BJ27),OR(BJ27<6,BJ27>=9.5)),AND(BE27=3,ISNUMBER(BJ27),OR(BJ27<6,BJ27>9)),AND(BE27=4,ISNUMBER(BJ27),OR(BJ27<6,BJ27>10))),0,IF(AND(ISNUMBER($BP$12),BE27<>0,ISNUMBER(BF27),ISNUMBER(BH27),ISNUMBER(BI27),ISNUMBER(BJ27)),Log_Virus(BE27,$BP$12,BI27,BJ27,BF27,BH27),IF(COUNTIF(BE27,\"<>0\")+COUNT(BF27,BG27,BI27,BJ27)=5,\"!error\",\"missing\"))))))))","v":""},{"$f":"IF($BL$14=0,0,IF(COUNTIF(OFFSET($BD24,0,0,MIN($BL$14,5),1),\"<>NA\")+IF($BL$14>5,COUNTIF(OFFSET($BV24,0,0,$BL$14-5,1),\"<>NA\"),0),1,0))","v":1},{"$f":"IF($BL$14=0,0,IF(COUNTIF(OFFSET($BD24,0,0,MIN($BL$14,5),1),\"O3\")+COUNTIF(OFFSET($BD24,0,0,MIN($BL$14,5),1),\"O3 Cell 1\")+IF($BL$14>5,COUNTIF(OFFSET($BV24,0,0,$BL$14-5,1),\"O3\"),0)+IF($BL$14>5,COUNTIF(OFFSET($BV24,0,0,$BL$14-5,1),\"O3 Cell 1\"),0),1,0))","v":0},{"$f":"IF(OR($AY27=0,AND(COUNTA(D32,F32:G32)=0,COUNTIF(E32,0))),\"NA\",IF(COUNTA(D32:G32),IF(BS27,4,5),IF($BL$15=1,IF(BS27,4,IF(BR27,5,6)),IF(BV27=\"!error\",IF(BS27,4,5),IF(BS27,\"5B\",6)))))","v":6},{"$f":"$BL$11","v":9},{"$f":"IF(AND(IF($BN$4=\"missing\",10,$BN$4)>=9,$AY27<>\"\"),IF(OR($AY27=0,AND($B32=\"NA\",COUNTA($D32,$F32:$G32)=0,COUNTIF($E32,0)),AND($B32=\"NA\",COUNTA($D32:$G32)=0,IF($BL$14=0,0,COUNTIF(OFFSET($BD24,0,0,MIN($BL$14,5),1),\"NA\")+IF($BL$14>5,COUNTIF(OFFSET($BV24,0,0,$BL$14-5,1),\"NA\"),0))=$BL$14),AND($B32=\"NA\",COUNTA($D32:$G32)=0,IF($BL$14<5,COUNTA(OFFSET($D24,$BL$14,0,MIN(5-$BL$14,$BL$15),4))-COUNTIF(OFFSET($E24,$BL$14,0,MIN(5-$BL$14,$BL$15),1),0),0)+IF($BL$14+$BL$15>5,COUNTA(OFFSET($D29,MAX($BL$14-5,0),0,MIN($BL$14+$BL$15-5,$BL$15),4))-COUNTIF(OFFSET($E29,MAX($BL$14-5,0),0,MIN($BL$14+$BL$15-5,$BL$15),1),0),0)),AND($B32=\"NA\",COUNTA($D32:$G32)=0,IF($BL$14<5,COUNTIF(OFFSET($B24,$BL$14,0,MIN(5-$BL$14,$BL$15),1),\"NA\"),0)+IF($BL$14+$BL$15>5,COUNTIF(OFFSET($B29,MAX($BL$14-5,0),0,MIN($BL$14+$BL$15-5,$BL$15),1),\"NA\"),0)<>$BL$15)),\"NA\",IF($B32=\"\",\"missing\",IF(AND($B32<>\"NA\",COUNTA($D32,$F32:$G32)+COUNTIF($E32,\"<>0\")),UPPER($B32),\"!error\"))),\"\")","v":""},"",{"$f":"IF(BV27=\"\",\"\",IF(BV27=\"NA\",\"NA\",IF(ISBLANK($D32),\"missing\",IF(AND(BW27=1,ISNUMBER($D32),$D32>4),4,IF(AND(ISNUMBER($D32),$D32>=0),$D32,IF(AND(ISTEXT($D32),$D32=\"ND\"),\"ND\",\"!error\"))))))","v":""},{"$f":"IF(BV27=\"\",\"\",IF(BV27=\"NA\",\"NA\",IF(ISBLANK($E32),\"missing\",IF(OR(AND(ISBLANK($B32),COUNT(BX27,CA27:CB27)=0,ISNUMBER($E32),$E32=0),AND(ISNUMBER($E32),$E32>0),AND(ISTEXT($E32),$E32=\"ND\")),$E32,\"!error\"))))","v":""},{"$f":"IF(BV27=\"\",\"\",IF(AY27=0,\"NA\",IF(OR($BL$12=\"!error\",$BL$13=\"!error\",BY27=\"!error\"),\"!error\",IF(BV27=\"NA\",\"NA\",IF(AND(ISNUMBER(BY27),BY27=0),0,IF(AND(ISNUMBER($BL$12),ISNUMBER($BL$13),ISNUMBER(BY27)),$BL$13*$BL$12/BY27,IF(BY27=\"ND\",\"ND\",\"missing\")))))))","v":""},{"$f":"IF(BV27=\"\",\"\",IF(BV27=\"NA\",\"NA\",IF(ISBLANK($F32),\"missing\",IF(OR(ISNUMBER($F32),$F32=\"ND\"),$F32,\"!error\"))))","v":""},{"$f":"IF(BV27=\"\",\"\",IF(BV27=\"NA\",\"NA\",IF(ISBLANK($G32),\"missing\",IF(OR(AND(ISNUMBER($G32),$G32>=0,$G32<=14),$G32=\"ND\"),$G32,\"!error\"))))","v":""},"",{"$f":"IF(BV27=\"\",\"\",IF(AY27=0,\"NA\",IF(CX27=\"ND\",\"ND\",IF(OR($BN$12=\"!error\",BV27=\"!error\",AND(BV27=\"missing\",ISNUMBER(BX27)),IF(BW27=1,BX27=\"!error\",0),CA27=\"!error\",CB27=\"!error\"),\"!error\",IF(OR(BV27=\"NA\",AND(ISNUMBER($BN$12),$BN$12=0),AND(BW27<>0,ISNUMBER(CC27),CC27=0),AND(BW27=1,ISNUMBER(CB27),CB27>9),AND(BW27>1,ISNUMBER(CB27),OR(CB27<6,CB27>=9.5))),\"NA\",IF(AND(ISNUMBER($BN$12),BW27<>0,IF(BW27=1,ISNUMBER(BX27),1),ISNUMBER(CA27),ISNUMBER(CB27)),CT_Giardia(BW27,$BN$12,CA27,CB27,IF(BW27=1,BX27,)),IF(COUNTIF(BW27,\"<>0\")+COUNT(BX27,BY27,CA27,CB27)=5,\"!error\",\"missing\")))))))","v":""},{"$f":"IF(BV27=\"\",\"\",IF(OR(AY27=0,AND(ISNUMBER($BN$12),$BN$12=0)),\"NA\",IF(CX27=\"ND\",\"ND\",IF(OR(CC27=\"!error\",CD27=\"!error\",CF27=\"!error\"),\"!error\",IF(BV27=\"NA\",\"NA\",IF(CD27=\"NA\",0,IF(AND(ISNUMBER(CC27),ISNUMBER(CD27)),CC27/CD27,IF(AND(BW27=99,CF27=0.5),CF27/$BN$12,\"missing\"))))))))","v":""},{"$f":"IF(BV27=\"\",\"\",IF(AY27=0,\"NA\",IF(CX27=\"ND\",\"ND\",IF(OR(BV27=\"!error\",AND(BV27=\"missing\",ISNUMBER(BX27)),BX27=\"!error\",BZ27=\"!error\",CA27=\"!error\",CB27=\"!error\"),\"!error\",IF(BV27=\"NA\",\"NA\",IF(OR(AND(BW27<>0,ISNUMBER(CC27),CC27=0),AND(BW27=1,ISNUMBER(CB27),CB27>9),AND(BW27>1,ISNUMBER(CB27),OR(CB27<6,CB27>=9.5))),0,IF(AND(ISNUMBER($BN$12),BW27<>0,ISNUMBER(BX27),ISNUMBER(BZ27),ISNUMBER(CA27),ISNUMBER(CB27)),log_Giardia(BW27,$BN$12,CA27,CB27,BX27,BZ27),IF(COUNTIF(BW27,\"<>0\")+COUNT(BX27,BY27,CA27,CB27)=5,\"!error\",\"missing\"))))))))","v":""},{"$f":"IF(BV27=\"\",\"\",IF(AY27=0,\"NA\",IF(CX27=\"ND\",\"ND\",IF(OR($BP$12=\"!error\",BV27=\"!error\",AND(BV27=\"missing\",ISNUMBER(BX27)),CA27=\"!error\",CB27=\"!error\"),\"!error\",IF(OR(BV27=\"NA\",AND(ISNUMBER($BP$12),$BP$12=0),AND(BW27<>0,ISNUMBER(CC27),CC27=0),AND(BW27=1,ISNUMBER(CB27),OR(CB27<5.5,CB27>=10.5)),AND(OR(BW27=2,BW27=4),ISNUMBER(CB27),OR(CB27<6,CB27>=9.5)),AND(BW27=3,ISNUMBER(CB27),OR(CB27<6,CB27>9))),\"NA\",IF(AND(ISNUMBER($BP$12),BW27<>0,ISNUMBER(CA27),ISNUMBER(CB27)),CT_Virus(BW27,$BP$12,CA27,CB27),IF(COUNTIF(BW27,\"<>0\")+COUNT(BX27,BY27,CA27,CB27)=5,\"!error\",\"missing\")))))))","v":""},{"$f":"IF(BV27=\"\",\"\",IF(OR(AY27=0,AND(ISNUMBER($BP$12),$BP$12=0)),\"NA\",IF(CX27=\"ND\",\"ND\",IF(OR(CC27=\"!error\",CG27=\"!error\",CI27=\"!error\"),\"!error\",IF(BV27=\"NA\",\"NA\",IF(CG27=\"NA\",0,IF(AND(ISNUMBER(CC27),ISNUMBER(CG27)),CC27/CG27,IF(AND(BW27=99,CI27=1),CI27/$BP$12,\"missing\"))))))))","v":""},{"$f":"IF(BV27=\"\",\"\",IF(AY27=0,\"NA\",IF(CX27=\"ND\",\"ND\",IF(OR(BV27=\"!error\",AND(BV27=\"missing\",ISNUMBER(BX27)),BX27=\"!error\",BZ27=\"!error\",CA27=\"!error\",CB27=\"!error\"),\"!error\",IF(BV27=\"NA\",\"NA\",IF(OR(AND(BW27<>0,ISNUMBER(CC27),CC27=0),AND(BW27=1,ISNUMBER(CB27),OR(CB27<5.5,CB27>=10.5)),AND(OR(BW27=2,BW27=4),ISNUMBER(CB27),OR(CB27<6,CB27>=9.5)),AND(BW27=3,ISNUMBER(CB27),OR(CB27<6,CB27>9))),0,IF(AND(ISNUMBER($BP$12),BW27<>0,ISNUMBER(BX27),ISNUMBER(BZ27),ISNUMBER(CA27),ISNUMBER(CB27)),Log_Virus(BW27,$BP$12,CA27,CB27,BX27,BZ27),IF(COUNTIF(BW27,\"<>0\")+COUNT(BX27,BY27,CA27,CB27)=5,\"!error\",\"missing\"))))))))","v":""},null,null,null,null,null,null,null,null,null,null,null,null,null,"data","data"]
[null," ",{"$f":"$G$15","v":5},null,null,null,null,"","","","","",null,null,null,null,"",null,null,null,null,null,null,null,null,null,null,null,null,null,null,null,null,null,null,null,null,null,null,null,null,null,null,null,null,null,null,null,null,null,1,{"$f":"IF($BH$14=0,0,IF(COUNTIF(OFFSET($BD24,0,0,MIN($BH$14,5),1),\"<>NA\")+IF($BH$14>5,COUNTIF(OFFSET($BV24,0,0,$BH$14-5,1),\"<>NA\"),0),1,0))","v":1},{"$f":"IF($BH$14=0,0,IF(COUNTIF(OFFSET($BD24,0,0,MIN($BH$14,5),1),\"O3\")+COUNTIF(OFFSET($BD24,0,0,MIN($BH$14,5),1),\"O3 Cell 1\")+IF($BH$14>5,COUNTIF(OFFSET($BV24,0,0,$BH$14-5,1),\"O3\"),0)+IF($BH$14>5,COUNTIF(OFFSET($BV24,0,0,$BH$14-5,1),\"O3 Cell 1\"),0),1,0))","v":0},{"$f":"IF(OR($AY28=0,AND(COUNTA(D28,F28:G28)=0,COUNTIF(E28,0))),\"NA\",IF(COUNTA(D28:G28),IF(BA28,4,5),IF($BH$15=1,IF(BA28,4,IF(AZ28,5,6)),IF(BD28=\"!error\",IF(BA28,4,5),IF(BA28,\"5B\",6)))))","v":6},{"$f":"$BH$11","v":5},{"$f":"IF(AND(IF($BN$4=\"missing\",10,$BN$4)>=5,$AY28<>\"\"),IF(OR($AY28=0,AND($B28=\"NA\",COUNTA($D28,$F28:$G28)=0,COUNTIF($E28,0)),AND($B28=\"NA\",COUNTA($D28:$G28)=0,IF($BH$14=0,0,COUNTIF(OFFSET($BD24,0,0,MIN($BH$14,5),1),\"NA\")+IF($BH$14>5,COUNTIF(OFFSET($BV24,0,0,$BH$14-5,1),\"NA\"),0))=$BH$14),AND($B28=\"NA\",COUNTA($D28:$G28)=0,IF($BH$14<5,COUNTA(OFFSET($D24,$BH$14,0,MIN(5-$BH$14,$BH$15),4))-COUNTIF(OFFSET($E24,$BH$14,0,MIN(5-$BH$14,$BH$15),1),0),0)+IF($BH$14+$BH$15>5,COUNTA(OFFSET($D29,MAX($BH$14-5,0),0,MIN($BH$14+$BH$15-5,$BH$15),4))-COUNTIF(OFFSET($E29,MAX($BH$14-5,0),0,MIN($BH$14+$BH$15-5,$BH$15),1),0),0)),AND($B28=\"NA\",COUNTA($D28:$G28)=0,IF($BH$14<5,COUNTIF(OFFSET($B24,$BH$14,0,MIN(5-$BH$14,$BH$15),1),\"NA\"),0)+IF($BH$14+$BH$15>5,COUNTIF(OFFSET($B29,MAX($BH$14-5,0),0,MIN($BH$14+$BH$15-5,$BH$15),1),\"NA\"),0)<>$BH$15)),\"NA\",IF($B28=\"\",\"missing\",IF(AND($B28<>\"NA\",COUNTA($D28,$F28:$G28)+COUNTIF($E28,\"<>0\")),UPPER($B28),\"!error\"))),\"\")","v":""},"","","",{"$f":"IF(BD28=\"\",\"\",IF(AY28=0,\"NA\",IF(OR($BH$12=\"!error\",$BH$13=\"!error\",BG28=\"!error\"),\"!error\",IF(BD28=\"NA\",\"NA\",IF(AND(ISNUMBER(BG28),BG28=0),0,IF(AND(ISNUMBER($BH$12),ISNUMBER($BH$13),ISNUMBER(BG28)),$BH$13*$BH$12/BG28,IF(BG28=\"ND\",\"ND\",\"missing\")))))))","v":""},"","","",{"$f":"IF(BD28=\"\",\"\",IF(AY28=0,\"NA\",IF(CW28=\"ND\",\"ND\",IF(OR($BN$12=\"!error\",BD28=\"!error\",AND(BD28=\"missing\",ISNUMBER(BF28)),IF(BE28=1,BF28=\"!error\",0),BI28=\"!error\",BJ28=\"!error\"),\"!error\",IF(OR(BD28=\"NA\",AND(ISNUMBER($BN$12),$BN$12=0),AND(BE28<>0,ISNUMBER(BK28),BK28=0),AND(BE28=1,ISNUMBER(BJ28),BJ28>9),AND(BE28=2,ISNUMBER(BJ28),OR(BJ28<6,BJ28>=9.5)),AND(OR(BE28=3,BE28=4),ISNUMBER(BJ28),OR(BJ28<5.5,BJ28>=9.5))),\"NA\",IF(AND(ISNUMBER($BN$12),BE28<>0,IF(BE28=1,ISNUMBER(BF28),1),ISNUMBER(BI28),ISNUMBER(BJ28)),CT_Giardia(BE28,$BN$12,BI28,BJ28,IF(BE28=1,BF28,)),IF(COUNTIF(BE28,\"<>0\")+COUNT(BF28,BG28,BI28,BJ28)=5,\"!error\",\"missing\")))))))","v":""},{"$f":"IF(BD28=\"\",\"\",IF(OR(AY28=0,AND(ISNUMBER($BN$12),$BN$12=0)),\"NA\",IF(CW28=\"ND\",\"ND\",IF(OR(BK28=\"!error\",BL28=\"!error\",BN28=\"!error\"),\"!error\",IF(BD28=\"NA\",\"NA\",IF(BL28=\"NA\",0,IF(AND(BE28<>99,ISNUMBER(BK28),ISNUMBER(BL28)),BK28/BL28,IF(AND(BE28=99,BN28=0.5),BN28/$BN$12,\"missing\"))))))))","v":""},{"$f":"IF(BD28=\"\",\"\",IF(AY28=0,\"NA\",IF(CW28=\"ND\",\"ND\",IF(OR(BD28=\"!error\",AND(BD28=\"missing\",ISNUMBER(BF28)),BF28=\"!error\",BH28=\"!error\",BI28=\"!error\",BJ28=\"!error\"),\"!error\",IF(BD28=\"NA\",\"NA\",IF(OR(AND(BE28<>0,ISNUMBER(BK28),BK28=0),AND(BE28=1,ISNUMBER(BJ28),BJ28>9),AND(BE28=2,ISNUMBER(BJ28),OR(BJ28<6,BJ28>=9.5)),AND(OR(BE28=3,BE28=4),ISNUMBER(BJ28),OR(BJ28<5.5,BJ28>=9.5))),0,IF(AND(ISNUMBER($BN$12),BE28<>0,ISNUMBER(BF28),ISNUMBER(BH28),ISNUMBER(BI28),ISNUMBER(BJ28)),log_Giardia(BE28,$BN$12,BI28,BJ28,BF28,BH28),IF(COUNTIF(BE28,\"<>0\")+COUNT(BF28,BG28,BI28,BJ28)=5,\"!error\",\"missing\"))))))))","v":""},{"$f":"IF(BD28=\"\",\"\",IF(AY28=0,\"NA\",IF(CW28=\"ND\",\"ND\",IF(OR($BP$12=\"!error\",BD28=\"!error\",AND(BD28=\"missing\",ISNUMBER(BF28)),BI28=\"!error\",BJ28=\"!error\"),\"!error\",IF(OR(BD28=\"NA\",AND(ISNUMBER($BP$12),$BP$12=0),AND(BE28<>0,ISNUMBER(BK28),BK28=0),AND(BE28=1,ISNUMBER(BJ28),BJ28>=10.5),AND(BE28=2,ISNUMBER(BJ28),OR(BJ28<6,BJ28>=9.5)),AND(BE28=3,ISNUMBER(BJ28),OR(BJ28<6,BJ28>9)),AND(BE28=4,ISNUMBER(BJ28),OR(BJ28<6,BJ28>10))),\"NA\",IF(AND(ISNUMBER($BP$12),BE28<>0,ISNUMBER(BI28),ISNUMBER(BJ28)),CT_Virus(BE28,$BP$12,BI28,BJ28),IF(COUNTIF(BE28,\"<>0\")+COUNT(BF28,BG28,BI28,BJ28)=5,\"!error\",\"missing\")))))))","v":""},{"$f":"IF(BD28=\"\",\"\",IF(OR(AY28=0,AND(ISNUMBER($BP$12),$BP$12=0)),\"NA\",IF(CW28=\"ND\",\"ND\",IF(OR(BK28=\"!error\",BO28=\"!error\",BQ28=\"!error\"),\"!error\",IF(BD28=\"NA\",\"NA\",IF(BO28=\"NA\",0,IF(AND(BE28<>99,ISNUMBER(BK28),ISNUMBER(BO28)),BK28/BO28,IF(AND(BE28=99,BQ28=1),BQ28/$BP$12,\"missing\"))))))))","v":""},{"$f":"IF(BD28=\"\",\"\",IF(AY28=0,\"NA\",IF(CW28=\"ND\",\"ND\",IF(OR(BD28=\"!error\",AND(BD28=\"missing\",ISNUMBER(BF28)),BF28=\"!error\",BH28=\"!error\",BI28=\"!error\",BJ28=\"!error\"),\"!error\",IF(BD28=\"NA\",\"NA\",IF(OR(AND(BE28<>0,ISNUMBER(BK28),BK28=0),AND(BE28=1,ISNUMBER(BJ28),BJ28>=10.5),AND(BE28=2,ISNUMBER(BJ28),OR(BJ28<6,BJ28>=9.5)),AND(BE28=3,ISNUMBER(BJ28),OR(BJ28<6,BJ28>9)),AND(BE28=4,ISNUMBER(BJ28),OR(BJ28<6,BJ28>10))),0,IF(AND(ISNUMBER($BP$12),BE28<>0,ISNUMBER(BF28),ISNUMBER(BH28),ISNUMBER(BI28),ISNUMBER(BJ28)),Log_Virus(BE28,$BP$12,BI28,BJ28,BF28,BH28),IF(COUNTIF(BE28,\"<>0\")+COUNT(BF28,BG28,BI28,BJ28)=5,\"!error\",\"missing\"))))))))","v":""},{"$f":"IF($BM$14=0,0,IF(COUNTIF(OFFSET($BD24,0,0,MIN($BM$14,5),1),\"<>NA\")+IF($BM$14>5,COUNTIF(OFFSET($BV24,0,0,$BM$14-5,1),\"<>NA\"),0),1,0))","v":1},{"$f":"IF($BK$14=0,0,IF(COUNTIF(OFFSET($BD24,0,0,MIN($BK$14,5),1),\"O3\")+COUNTIF(OFFSET($BD24,0,0,MIN($BK$14,5),1),\"O3 Cell 1\")+IF($BK$14>5,COUNTIF(OFFSET($BV24,0,0,$BK$14-5,1),\"O3\"),0)+IF($BK$14>5,COUNTIF(OFFSET($BV24,0,0,$BK$14-5,1),\"O3 Cell 1\"),0),1,0))","v":0},{"$f":"IF(OR($AY28=0,AND(COUNTA(D33,F33:G33)=0,COUNTIF(E33,0))),\"NA\",IF(COUNTA(D33:G33),IF(BS28,4,5),IF($BM$15=1,IF(BS28,4,IF(BR28,5,6)),IF(BV28=\"!error\",IF(BS28,4,5),IF(BS28,\"5B\",6)))))","v":6},{"$f":"$BM$11","v":10},{"$f":"IF(AND(IF($BN$4=\"missing\",10,$BN$4)>=10,$AY28<>\"\"),IF(OR($AY28=0,AND($B33=\"NA\",COUNTA($D33,$F33:$G33)=0,COUNTIF($E33,0)),AND($B33=\"NA\",COUNTA($D33:$G33)=0,IF($BM$14=0,0,COUNTIF(OFFSET($BD24,0,0,MIN($BM$14,5),1),\"NA\")+IF($BM$14>5,COUNTIF(OFFSET($BV24,0,0,$BM$14-5,1),\"NA\"),0))=$BM$14),AND($B33=\"NA\",COUNTA($D33:$G33)=0,IF($BM$14<5,COUNTA(OFFSET($D24,$BM$14,0,MIN(5-$BM$14,$BM$15),4))-COUNTIF(OFFSET($E24,$BM$14,0,MIN(5-$BM$14,$BM$15),1),0),0)+IF($BM$14+$BM$15>5,COUNTA(OFFSET($D29,MAX($BM$14-5,0),0,MIN($BM$14+$BM$15-5,$BM$15),4))-COUNTIF(OFFSET($E29,MAX($BM$14-5,0),0,MIN($BM$14+$BM$15-5,$BM$15),1),0),0)),AND($B33=\"NA\",COUNTA($D33:$G33)=0,IF($BM$14<5,COUNTIF(OFFSET($B24,$BM$14,0,MIN(5-$BM$14,$BM$15),1),\"NA\"),0)+IF($BM$14+$BM$15>5,COUNTIF(OFFSET($B29,MAX($BM$14-5,0),0,MIN($BM$14+$BM$15-5,$BM$15),1),\"NA\"),0)<>$BM$15)),\"NA\",IF($B33=\"\",\"missing\",IF(AND($B33<>\"NA\",COUNTA($D33,$F33:$G33)+COUNTIF($E33,\"<>0\")),UPPER($B33),\"!error\"))),\"\")","v":""},"",{"$f":"IF(BV28=\"\",\"\",IF(BV28=\"NA\",\"NA\",IF(ISBLANK($D33),\"missing\",IF(AND(BW28=1,ISNUMBER($D33),$D33>4),4,IF(AND(ISNUMBER($D33),$D33>=0),$D33,IF(AND(ISTEXT($D33),$D33=\"ND\"),\"ND\",\"!error\"))))))","v":""},{"$f":"IF(BV28=\"\",\"\",IF(BV28=\"NA\",\"NA\",IF(ISBLANK($E33),\"missing\",IF(OR(AND(ISBLANK($B33),COUNT(BX28,CA28:CB28)=0,ISNUMBER($E33),$E33=0),AND(ISNUMBER($E33),$E33>0),AND(ISTEXT($E33),$E33=\"ND\")),$E33,\"!error\"))))","v":""},{"$f":"IF(BV28=\"\",\"\",IF(AY28=0,\"NA\",IF(OR($BM$12=\"!error\",$BM$13=\"!error\",BY28=\"!error\"),\"!error\",IF(BV28=\"NA\",\"NA\",IF(AND(ISNUMBER(BY28),BY28=0),0,IF(AND(ISNUMBER($BM$12),ISNUMBER($BM$13),ISNUMBER(BY28)),$BM$13*$BM$12/BY28,IF(BY28=\"ND\",\"ND\",\"missing\")))))))","v":""},{"$f":"IF(BV28=\"\",\"\",IF(BV28=\"NA\",\"NA\",IF(ISBLANK($F33),\"missing\",IF(OR(ISNUMBER($F33),$F33=\"ND\"),$F33,\"!error\"))))","v":""},{"$f":"IF(BV28=\"\",\"\",IF(BV28=\"NA\",\"NA\",IF(ISBLANK($G33),\"missing\",IF(OR(AND(ISNUMBER($G33),$G33>=0,$G33<=14),$G33=\"ND\"),$G33,\"!error\"))))","v":""},"",{"$f":"IF(BV28=\"\",\"\",IF(AY28=0,\"NA\",IF(CX28=\"ND\",\"ND\",IF(OR($BN$12=\"!error\",BV28=\"!error\",AND(BV28=\"missing\",ISNUMBER(BX28)),IF(BW28=1,BX28=\"!error\",0),CA28=\"!error\",CB28=\"!error\"),\"!error\",IF(OR(BV28=\"NA\",AND(ISNUMBER($BN$12),$BN$12=0),AND(BW28<>0,ISNUMBER(CC28),CC28=0),AND(BW28=1,ISNUMBER(CB28),CB28>9),AND(BW28>1,ISNUMBER(CB28),OR(CB28<6,CB28>=9.5))),\"NA\",IF(AND(ISNUMBER($BN$12),BW28<>0,IF(BW28=1,ISNUMBER(BX28),1),ISNUMBER(CA28),ISNUMBER(CB28)),CT_Giardia(BW28,$BN$12,CA28,CB28,IF(BW28=1,BX28,)),IF(COUNTIF(BW28,\"<>0\")+COUNT(BX28,BY28,CA28,CB28)=5,\"!error\",\"missing\")))))))","v":""},{"$f":"IF(BV28=\"\",\"\",IF(OR(AY28=0,AND(ISNUMBER($BN$12),$BN$12=0)),\"NA\",IF(CX28=\"ND\",\"ND\",IF(OR(CC28=\"!error\",CD28=\"!error\",CF28=\"!error\"),\"!error\",IF(BV28=\"NA\",\"NA\",IF(CD28=\"NA\",0,IF(AND(ISNUMBER(CC28),ISNUMBER(CD28)),CC28/CD28,IF(AND(BW28=99,CF28=0.5),CF28/$BN$12,\"missing\"))))))))","v":""},{"$f":"IF(BV28=\"\",\"\",IF(AY28=0,\"NA\",IF(CX28=\"ND\",\"ND\",IF(OR(BV28=\"!error\",AND(BV28=\"missing\",ISNUMBER(BX28)),BX28=\"!error\",BZ28=\"!error\",CA28=\"!error\",CB28=\"!error\"),\"!error\",IF(BV28=\"NA\",\"NA\",IF(OR(AND(BW28<>0,ISNUMBER(CC28),CC28=0),AND(BW28=1,ISNUMBER(CB28),CB28>9),AND(BW28>1,ISNUMBER(CB28),OR(CB28<6,CB28>=9.5))),0,IF(AND(ISNUMBER($BN$12),BW28<>0,ISNUMBER(BX28),ISNUMBER(BZ28),ISNUMBER(CA28),ISNUMBER(CB28)),log_Giardia(BW28,$BN$12,CA28,CB28,BX28,BZ28),IF(COUNTIF(BW28,\"<>0\")+COUNT(BX28,BY28,CA28,CB28)=5,\"!error\",\"missing\"))))))))","v":""},{"$f":"IF(BV28=\"\",\"\",IF(AY28=0,\"NA\",IF(CX28=\"ND\",\"ND\",IF(OR($BP$12=\"!error\",BV28=\"!error\",AND(BV28=\"missing\",ISNUMBER(BX28)),CA28=\"!error\",CB28=\"!error\"),\"!error\",IF(OR(BV28=\"NA\",AND(ISNUMBER($BP$12),$BP$12=0),AND(BW28<>0,ISNUMBER(CC28),CC28=0),AND(BW28=1,ISNUMBER(CB28),OR(CB28<5.5,CB28>=10.5)),AND(OR(BW28=2,BW28=4),ISNUMBER(CB28),OR(CB28<6,CB28>=9.5)),AND(BW28=3,ISNUMBER(CB28),OR(CB28<6,CB28>9))),\"NA\",IF(AND(ISNUMBER($BP$12),BW28<>0,ISNUMBER(CA28),ISNUMBER(CB28)),CT_Virus(BW28,$BP$12,CA28,CB28),IF(COUNTIF(BW28,\"<>0\")+COUNT(BX28,BY28,CA28,CB28)=5,\"!error\",\"missing\")))))))","v":""},{"$f":"IF(BV28=\"\",\"\",IF(OR(AY28=0,AND(ISNUMBER($BP$12),$BP$12=0)),\"NA\",IF(CX28=\"ND\",\"ND\",IF(OR(CC28=\"!error\",CG28=\"!error\",CI28=\"!error\"),\"!error\",IF(BV28=\"NA\",\"NA\",IF(CG28=\"NA\",0,IF(AND(ISNUMBER(CC28),ISNUMBER(CG28)),CC28/CG28,IF(AND(BW28=99,CI28=1),CI28/$BP$12,\"missing\"))))))))","v":""},{"$f":"IF(BV28=\"\",\"\",IF(AY28=0,\"NA\",IF(CX28=\"ND\",\"ND\",IF(OR(BV28=\"!error\",AND(BV28=\"missing\",ISNUMBER(BX28)),BX28=\"!error\",BZ28=\"!error\",CA28=\"!error\",CB28=\"!error\"),\"!error\",IF(BV28=\"NA\",\"NA\",IF(OR(AND(BW28<>0,ISNUMBER(CC28),CC28=0),AND(BW28=1,ISNUMBER(CB28),OR(CB28<5.5,CB28>=10.5)),AND(OR(BW28=2,BW28=4),ISNUMBER(CB28),OR(CB28<6,CB28>=9.5)),AND(BW28=3,ISNUMBER(CB28),OR(CB28<6,CB28>9))),0,IF(AND(ISNUMBER($BP$12),BW28<>0,ISNUMBER(BX28),ISNUMBER(BZ28),ISNUMBER(CA28),ISNUMBER(CB28)),Log_Virus(BW28,$BP$12,CA28,CB28,BX28,BZ28),IF(COUNTIF(BW28,\"<>0\")+COUNT(BX28,BY28,CA28,CB28)=5,\"!error\",\"missing\"))))))))","v":""},null,null,null,null,null,null,null,null,null,null,null,null,null,{"$f":"IF(OR(BF28=\"ND\",BG28=\"ND\",BI28=\"ND\",BJ28=\"ND\"),\"ND\",\"data\")","v":"data"},{"$f":"IF(OR(BX28=\"ND\",BY28=\"ND\",CA28=\"ND\",CB28=\"ND\"),\"ND\",\"data\")","v":"data"}]
[null," ",{"$f":"$H$15","v":6},null,null,null,null,{"$f":"IF($CD24=\"!error\",\"!error\",$CC24)","v":""},{"$f":"$CD24","v":""},{"$f":"$CG24","v":""},{"$f":"$CF24","v":""},{"$f":"$CI24","v":""},null,null,null,null,{"$f":"IF(AND(BW24=1,D29>4,D29<>\"ND\"),\"Note: The inactivation credit in zone D\" & C29 & \" was restricted due to elevated free chlorine levels.\",\"\")","v":""},null,null,null,null,null,null,null,null,null,null,null,null,null,null,null,null,null,null,null,null,null,null,null,null,null,null,null,null,null,null,null,null,null,null,null,null,null,null,null,null,null,null,null,null,null,null,null,null,null,null,null,null,null,null,null,null,null,null,null,null,null,null,null,null,null,null,null,null,null,null,null," Not representative of total log inactivation for all disinfection zones."]
[null," ",{"$f":"$I$15","v":7},null,null,null,null,{"$f":"IF($CD25=\"!error\",\"!error\",$CC25)","v":""},{"$f":"$CD25","v":""},{"$f":"$CG25","v":""},{"$f":"$CF25","v":""},{"$f":"$CI25","v":""},null,null,null,null,{"$f":"IF(AND(BW25=1,D30>4,D30<>\"ND\"),\"Note: The inactivation credit in zone D\" & C30 & \" was restricted due to elevated free chlorine levels.\",\"\")","v":""},null,null,null,null,null,null,null,null,null,null,null,null,null,null,null,null,null,null,null,null,null,null,null,null,null,null,null,null,null,null,null,null,null,null,null,null,null,null,null,null,null,null,null,null,null,null,null,null,null,null,null,null,null,null,null,null,null,null,null,null,null,null,null,null,null,null,null,null,null,null,null,null,null,{"$f":"CL24=\"\"","v":true},null,null,null,{"$f":"CP24=\"\"","v":true}]
[null," ",{"$f":"$J$15","v":8},null,null,null,null,"",{"$f":"$CD26","v":""},{"$f":"$CG26","v":""},{"$f":"$CF26","v":""},{"$f":"$CI26","v":""},null,null,null,null,""]
[null," ",{"$f":"$K$15","v":9},null,null,null,null,"",{"$f":"$CD27","v":""},{"$f":"$CG27","v":""},{"$f":"$CF27","v":""},{"$f":"$CI27","v":""},null,null,null,null,""]
[null," ",{"$f":"$L$15","v":10},null,null,null,null,{"$f":"IF($CC28=\"!error\",\"!error\",$CC28)","v":""},{"$f":"$CD28","v":""},{"$f":"$CG28","v":""},{"$f":"$CF28","v":""},{"$f":"$CI28","v":""},null,null,null,null,""]
[]
[null,null,null,null,null,"DISINFECTION PROCESS DATA "]
[null,"DATE:",null,null,null,{"$f":"OR(AND(COUNTA(D40:G49)=0,C36=\"\"),IsDate(C36))","v":true},"TIME:",null,null,null,null,"Operator Initials:"]
[null,"INDIVIDUAL DISINFECTION ZONES",null,null,null,null,null,null,null,null,null,null,"PLANT TOTAL",null,null,null,null,null,null,null,null,null,null,null,null,null,null,null,null,null,null,null,null,null,null,null,null,null,null,null,null,null,null,null,null,null,null,null,null,"PUMPAGE",null,null,null,null,{"$f":"\"DISINFECTION ZONES  ( D\"&$BD$11&\" - D\"&$BH$11&\" )\"","v":"DISINFECTION ZONES  ( D1 - D5 )"},null,null,null,null,null,null,null,null,null,null,null,null,null,null,null,null,null,{"$f":"\"DISINFECTION ZONES  ( D\"&$BI$11&\" - D\"&$BM$11&\" )\"","v":"DISINFECTION ZONES  ( D6 - D10 )"},null,null,null,null,null,null,null,null,null,null,null,null,null,null,null,"DAILY DISINFECTION DATA SUMMARY"]
[null,null,null,"C","Flow","Temp",null,null,"Giardia","Virus","Giardia","Virus","Giardia","Virus","Inact.",null,null,null,null,null,null,null,null,null,null,null,null,null,null,null,null,null,null,null,null,null,null,null,null,null,null,null,null,null,null,null,null,null,null,null,"RAW",null,null,null,null,null,null,null,null,null,null,null,null,"GIARDIA","GIARDIA","GIARDIA","VIRUS","VIRUS","VIRUS",null,null,null,null,null,null,null,null,null,null,null,null,"GIARDIA","GIARDIA","GIARDIA","VIRUS","VIRUS","VIRUS",null,"GIARDIA",null,"GIARDIA",null,"VIRUS",null,"VIRUS",null,"MINIMUM",null,null,null,"NO DATA"]
[null,"Disinfectant",null,"(mg/L)","(MGD)","(oC)","pH","CTCALC","CTREQD","CTREQD","Log","Log","Log","Log","Ratio",null,null,null,null,null,null,null,null,null,null,null,null,null,null,null,null,null,null,null,null,null,null,null,null,null,null,null,null,null,null,null,null,null,null,"DATE","WATER",null,null,"AT LEAST ONE PRECEDING ZONE <> \"NA\"","DISINFECTANT",null,null,"C","FLOW","T10","TEMP","pH","CTACTUAL","CTREQD","INACT. RATIO","LOG","CTREQD","INACT. RATIO","LOG",null,null,null,"DISINFECTANT",null,null,"C","FLOW","T10","TEMP","pH","CTACTUAL","CTREQD","INACT. RATIO","LOG","CTREQD","INACT. RATIO","LOG",null,"LOG",null,"INACT. RATIO",null,"LOG",null,"INACT. RATIO",null,"INACT. RATIO",null,null,null,{"$f":"\"D\"&$BD$11&\" - D\"&$BH$11","v":"D1 - D5"},{"$f":"\"D\"&$BI$11&\" - D\"&$BM$11","v":"D6 - D10"}]
[null,null,{"$f":"$C$15","v":1},null,null,null,null,{"$f":"IF(BL40=\"!error\",\"!error\",$BK40)","v":"missing"},{"$f":"$BL40","v":"missing"},{"$f":"$BO40","v":"missing"},{"$f":"$BN40","v":"missing"},{"$f":"$BQ40","v":"missing"},{"$f":"IF($CK40=\"\",\"\",IF($CK40=\"NA\",\"NA\",IF($CK40=\"!error\",-99,IF(COUNTIF(CW40:CX44,\"ND\")=$BN$4,\"MD\",IF(ISNUMBER($CK40),FIXED($CK40,2)&IF($CL40=\"*\",\"*\",\" \"),\"\")))))","v":""},{"$f":"IF($CO40=\"\",\"\",IF($CO40=\"NA\",\"NA \",IF($CO40=\"!error\",-99,IF(COUNTIF(CW40:CX44,\"ND\")=$BN$4,\"MD\",IF(ISNUMBER($CO40),FIXED($CO40,2)&IF($CP40=\"*\",\"*\",\" \"),\"\")))))","v":""},{"$f":"IF($CS40=\"\",\"\",IF($CS40=\"NA\",\"NA\",IF($CS40=\"!error\",-99,IF(AND($CW40=\"ND\",$CW41=\"ND\",$CW42=\"ND\",$CW43=\"ND\",$CW44=\"ND\",$CX40=\"ND\",$CX41=\"ND\",$CX42=\"ND\",$CX43=\"ND\",$CX44=\"ND\"),\"ND\",IF(ISNUMBER($CS40),$CS40,\"\")))))","v":""},null,{"$f":"IF(AND(BE40=1,D40>4,D40<>\"ND\"),\"Note: The inactivation credit in zone D\" & C40 & \" was restricted due to elevated free chlorine levels.\",\"\")","v":""},null,null,null,null,null,null,null,null,null,null,null,null,null,null,null,null,null,null,null,null,null,null,null,null,null,null,null,null,null,null,null,null,1,1,{"$f":"IF($BD$14=0,0,IF(COUNTIF(OFFSET($BD40,0,0,MIN($BD$14,5),1),\"<>NA\")+IF($BD$14>5,COUNTIF(OFFSET($BV40,0,0,$BD$14-5,1),\"<>NA\"),0),1,0))","v":0},{"$f":"IF($BD$14=0,0,IF(COUNTIF(OFFSET($BD40,0,0,MIN($BD$14,5),1),\"O3\")+COUNTIF(OFFSET($BD40,0,0,MIN($BD$14,5),1),\"O3 Cell 1\")+IF($BD$14>5,COUNTIF(OFFSET($BV40,0,0,$BD$14-5,1),\"O3\"),0)+IF($BD$14>5,COUNTIF(OFFSET($BV40,0,0,$BD$14-5,1),\"O3 Cell 1\"),0),1,0))","v":0},{"$f":"IF(OR($AY40=0,AND(COUNTA(D40,F40:G40)=0,COUNTIF(E40,0))),\"NA\",\n       IF(COUNTA(D40:G40),IF(BA40,4,\n                                                                     5),\n            IF($BD$15=1,IF(BA40,4,\n                                                        IF(AZ40,5,\n                                                                         6)),\n                    IF(BD40=\"!error\",IF(BA40,4,\n                                                                        5),\n                          IF(BA40,\"5B\",\n                                            6)))))","v":6},{"$f":"$BD$11","v":1},{"$f":"IF(AND(IF($BN$4=\"missing\",10,$BN$4)>=1,$AY40<>\"\"),IF(OR($AY40=0,AND($B40=\"NA\",COUNTA($D40,$F40:$G40)=0,COUNTIF($E40,0)),AND($B40=\"NA\",COUNTA($D40:$G40)=0,IF($BD$14=0,0,COUNTIF(OFFSET($BD40,0,0,MIN($BD$14,5),1),\"NA\")+IF($BD$14>5,COUNTIF(OFFSET($BV40,0,0,$BD$14-5,1),\"NA\"),0))=$BD$14),AND($B40=\"NA\",COUNTA($D40:$G40)=0,IF($BD$14<5,COUNTA(OFFSET($D40,$BD$14,0,MIN(5-$BD$14,$BD$15),4))-COUNTIF(OFFSET($E40,$BD$14,0,MIN(5-$BD$14,$BD$15),1),0),0)+IF($BD$14+$BD$15>5,COUNTA(OFFSET($D45,MAX($BD$14-5,0),0,MIN($BD$14+$BD$15-5,$BD$15),4))-COUNTIF(OFFSET($E45,MAX($BD$14-5,0),0,MIN($BD$14+$BD$15-5,$BD$15),1),0),0)),AND($B40=\"NA\",COUNTA($D40:$G40)=0,IF($BD$14<5,COUNTIF(OFFSET($B40,$BD$14,0,MIN(5-$BD$14,$BD$15),1),\"NA\"),0)+IF($BD$14+$BD$15>5,COUNTIF(OFFSET($B45,MAX($BD$14-5,0),0,MIN($BD$14+$BD$15-5,$BD$15),1),\"NA\"),0)<>$BD$15)),\"NA\",IF($B40=\"\",\"missing\",IF(AND($B40<>\"NA\",COUNTA($D40,$F40:$G40)+COUNTIF($E40,\"<>0\")),UPPER($B40),\"!error\"))),\"\")","v":"missing"},{"$f":"IF(BD40=\"\",\"\",IF(BD40=\"FCL\",1,IF(BD40=\"CLO2\",2,IF(BD40=\"O3 Cell 1\",99,IF(BD40=\"O3\",3,IF(BD40=\"CLA\",4,0))))))","v":0},{"$f":"IF(BD40=\"\",\"\",IF(BD40=\"NA\",\"NA\",IF(ISBLANK($D40),\"missing\",IF(AND(BE40=1,ISNUMBER($D40),$D40>4),4,IF(AND(ISNUMBER($D40),$D40>=0),$D40,IF(AND(ISTEXT($D40),$D40=\"ND\"),\"ND\",\"!error\"))))))","v":"missing"},{"$f":"IF(BD40=\"\",\"\",IF(BD40=\"NA\",\"NA\",IF(ISBLANK($E40),\"missing\",IF(OR(AND(ISBLANK($B40),COUNT(BF40,BI40:BJ40)=0,ISNUMBER($E40),$E40=0),AND(ISNUMBER($E40),$E40>0),AND(ISTEXT($E40),$E40=\"ND\")),$E40,\"!error\"))))","v":"missing"},{"$f":"IF(BD40=\"\",\"\",IF(AY40=0,\"NA\",IF(OR($BD$12=\"!error\",$BD$13=\"!error\",BG40=\"!error\"),\"!error\",IF(BD40=\"NA\",\"NA\",IF(AND(ISNUMBER(BG40),BG40=0),0,IF(AND(ISNUMBER($BD$12),ISNUMBER($BD$13),ISNUMBER(BG40)),$BD$13*$BD$12/BG40,IF(BG40=\"ND\",\"ND\",\"missing\")))))))","v":"missing"},{"$f":"IF(BD40=\"\",\"\",IF(BD40=\"NA\",\"NA\",IF(ISBLANK($F40),\"missing\",IF(OR(ISNUMBER($F40),$F40=\"ND\"),$F40,\"!error\"))))","v":"missing"},{"$f":"IF(BD40=\"\",\"\",IF(BD40=\"NA\",\"NA\",IF(ISBLANK($G40),\"missing\",IF(OR(AND(ISNUMBER($G40),$G40>=0,$G40<=14),$G40=\"ND\"),$G40,\"!error\"))))","v":"missing"},{"$f":"IF(BD40=\"\",\"\",IF(AY40=0,\"NA\",IF(OR(BF40=\"!error\",BH40=\"!error\"),\"!error\",IF(BD40=\"NA\",\"NA\",IF(OR(AND(ISNUMBER(BF40),BF40=0),AND(ISNUMBER(BH40),BH40=0)),0,IF(AND(ISNUMBER(BF40),ISNUMBER(BH40)),BF40*BH40,IF(OR(BF40=\"ND\",BH40=\"ND\"),\"ND\",\"missing\")))))))","v":"missing"},{"$f":"IF(BD40=\"\",\"\",IF(AY40=0,\"NA\",IF(CW40=\"ND\",\"ND\",IF(OR($BN$12=\"!error\",BD40=\"!error\",AND(BD40=\"missing\",ISNUMBER(BF40)),IF(BE40=1,BF40=\"!error\",0),BI40=\"!error\",BJ40=\"!error\"),\"!error\",IF(OR(BD40=\"NA\",AND(ISNUMBER($BN$12),$BN$12=0),AND(BE40<>0,ISNUMBER(BK40),BK40=0),AND(BE40=1,ISNUMBER(BJ40),BJ40>9),AND(BE40=2,ISNUMBER(BJ40),OR(BJ40<6,BJ40>=9.5)),AND(OR(BE40=3,BE40=4),ISNUMBER(BJ40),OR(BJ40<5.5,BJ40>=9.5))),\"NA\",IF(AND(ISNUMBER($BN$12),BE40<>0,IF(BE40=1,ISNUMBER(BF40),1),ISNUMBER(BI40),ISNUMBER(BJ40)),CT_Giardia(BE40,$BN$12,BI40,BJ40,IF(BE40=1,BF40,)),IF(COUNTIF(BE40,\"<>0\")+COUNT(BF40,BG40,BI40,BJ40)=5,\"!error\",\"missing\")))))))","v":"missing"},{"$f":"IF(BD40=\"\",\"\",IF(OR(AY40=0,AND(ISNUMBER($BN$12),$BN$12=0)),\"NA\",IF(CW40=\"ND\",\"ND\",IF(OR(BK40=\"!error\",BL40=\"!error\",BN40=\"!error\"),\"!error\",IF(BD40=\"NA\",\"NA\",IF(BL40=\"NA\",0,IF(AND(BE40<>99,ISNUMBER(BK40),ISNUMBER(BL40)),BK40/BL40,IF(AND(BE40=99,BN40=0.5),BN40/$BN$12,\"missing\"))))))))","v":"missing"},{"$f":"IF(BD40=\"\",\"\",IF(AY40=0,\"NA\",IF(CW40=\"ND\",\"ND\",IF(OR(BD40=\"!error\",AND(BD40=\"missing\",ISNUMBER(BF40)),BF40=\"!error\",BH40=\"!error\",BI40=\"!error\",BJ40=\"!error\"),\"!error\",IF(BD40=\"NA\",\"NA\",IF(OR(AND(BE40<>0,ISNUMBER(BK40),BK40=0),AND(BE40=1,ISNUMBER(BJ40),BJ40>9),AND(BE40=2,ISNUMBER(BJ40),OR(BJ40<6,BJ40>=9.5)),AND(OR(BE40=3,BE40=4),ISNUMBER(BJ40),OR(BJ40<5.5,BJ40>=9.5))),0,IF(AND(ISNUMBER($BN$12),BE40<>0,ISNUMBER(BF40),ISNUMBER(BH40),ISNUMBER(BI40),ISNUMBER(BJ40)),log_Giardia(BE40,$BN$12,BI40,BJ40,BF40,BH40),IF(COUNTIF(BE40,\"<>0\")+COUNT(BF40,BG40,BI40,BJ40)=5,\"!error\",\"missing\"))))))))","v":"missing"},{"$f":"IF(BD40=\"\",\"\",IF(AY40=0,\"NA\",IF(CW40=\"ND\",\"ND\",IF(OR($BP$12=\"!error\",BD40=\"!error\",AND(BD40=\"missing\",ISNUMBER(BF40)),BI40=\"!error\",BJ40=\"!error\"),\"!error\",IF(OR(BD40=\"NA\",AND(ISNUMBER($BP$12),$BP$12=0),AND(BE40<>0,ISNUMBER(BK40),BK40=0),AND(BE40=1,ISNUMBER(BJ40),BJ40>=10.5),AND(BE40=2,ISNUMBER(BJ40),OR(BJ40<6,BJ40>=9.5)),AND(BE40=3,ISNUMBER(BJ40),OR(BJ40<6,BJ40>9)),AND(BE40=4,ISNUMBER(BJ40),OR(BJ40<6,BJ40>10))),\"NA\",IF(AND(ISNUMBER($BP$12),BE40<>0,ISNUMBER(BI40),ISNUMBER(BJ40)),CT_Virus(BE40,$BP$12,BI40,BJ40),IF(COUNTIF(BE40,\"<>0\")+COUNT(BF40,BG40,BI40,BJ40)=5,\"!error\",\"missing\")))))))","v":"missing"},{"$f":"IF(BD40=\"\",\"\",IF(OR(AY40=0,AND(ISNUMBER($BP$12),$BP$12=0)),\"NA\",IF(CW40=\"ND\",\"ND\",IF(OR(BK40=\"!error\",BO40=\"!error\",BQ40=\"!error\"),\"!error\",IF(BD40=\"NA\",\"NA\",IF(BO40=\"NA\",0,IF(AND(BE40<>99,ISNUMBER(BK40),ISNUMBER(BO40)),BK40/BO40,IF(AND(BE40=99,BQ40=1),BQ40/$BP$12,\"missing\"))))))))","v":"missing"},{"$f":"IF(BD40=\"\",\"\",IF(AY40=0,\"NA\",IF(CW40=\"ND\",\"ND\",IF(OR(BD40=\"!error\",AND(BD40=\"missing\",ISNUMBER(BF40)),BF40=\"!error\",BH40=\"!error\",BI40=\"!error\",BJ40=\"!error\"),\"!error\",IF(BD40=\"NA\",\"NA\",IF(OR(AND(BE40<>0,ISNUMBER(BK40),BK40=0),AND(BE40=1,ISNUMBER(BJ40),BJ40>=10.5),AND(BE40=2,ISNUMBER(BJ40),OR(BJ40<6,BJ40>=9.5)),AND(BE40=3,ISNUMBER(BJ40),OR(BJ40<6,BJ40>9)),AND(BE40=4,ISNUMBER(BJ40),OR(BJ40<6,BJ40>10))),0,IF(AND(ISNUMBER($BP$12),BE40<>0,ISNUMBER(BF40),ISNUMBER(BH40),ISNUMBER(BI40),ISNUMBER(BJ40)),Log_Virus(BE40,$BP$12,BI40,BJ40,BF40,BH40),IF(COUNTIF(BE40,\"<>0\")+COUNT(BF40,BG40,BI40,BJ40)=5,\"!error\",\"missing\"))))))))","v":"missing"},{"$f":"IF($BI$14=0,0,IF(COUNTIF(OFFSET($BD40,0,0,MIN($BI$14,5),1),\"<>NA\")+IF($BI$14>5,COUNTIF(OFFSET($BV40,0,0,$BI$14-5,1),\"<>NA\"),0),1,0))","v":1},{"$f":"IF($BI$14=0,0,IF(COUNTIF(OFFSET($BD40,0,0,MIN($BI$14,5),1),\"O3\")+COUNTIF(OFFSET($BD40,0,0,MIN($BI$14,5),1),\"O3 Cell 1\")+IF($BI$14>5,COUNTIF(OFFSET($BV40,0,0,$BI$14-5,1),\"O3\"),0)+IF($BI$14>5,COUNTIF(OFFSET($BV40,0,0,$BI$14-5,1),\"O3 Cell 1\"),0),1,0))","v":0},{"$f":"IF(OR($AY40=0,AND(COUNTA(D45,F45:G45)=0,COUNTIF(E45,0))),\"NA\",IF(COUNTA(D45:G45),IF(BS40,4,5),IF($BI$15=1,IF(BS40,4,IF(BR40,5,6)),IF(BV40=\"!error\",IF(BS40,4,5),IF(BS40,\"5B\",6)))))","v":6},{"$f":"$BI$11","v":6},{"$f":"IF(AND(IF($BN$4=\"missing\",10,$BN$4)>=6,$AY40<>\"\"),IF(OR($AY40=0,AND($B45=\"NA\",COUNTA($D45,$F45:$G45)=0,COUNTIF($E45,0)),AND($B45=\"NA\",COUNTA($D45:$G45)=0,IF($BI$14=0,0,COUNTIF(OFFSET($BD40,0,0,MIN($BI$14,5),1),\"NA\")+IF($BI$14>5,COUNTIF(OFFSET($BV40,0,0,$BI$14-5,1),\"NA\"),0))=$BI$14),AND($B45=\"NA\",COUNTA($D45:$G45)=0,IF($BI$14<5,COUNTA(OFFSET($D40,$BI$14,0,MIN(5-$BI$14,$BI$15),4))-COUNTIF(OFFSET($E40,$BI$14,0,MIN(5-$BI$14,$BI$15),1),0),0)+IF($BI$14+$BI$15>5,COUNTA(OFFSET($D45,MAX($BI$14-5,0),0,MIN($BI$14+$BI$15-5,$BI$15),4))-COUNTIF(OFFSET($E45,MAX($BI$14-5,0),0,MIN($BI$14+$BI$15-5,$BI$15),1),0),0)),AND($B45=\"NA\",COUNTA($D45:$G45)=0,IF($BI$14<5,COUNTIF(OFFSET($B40,$BI$14,0,MIN(5-$BI$14,$BI$15),1),\"NA\"),0)+IF($BI$14+$BI$15>5,COUNTIF(OFFSET($B45,MAX($BI$14-5,0),0,MIN($BI$14+$BI$15-5,$BI$15),1),\"NA\"),0)<>$BI$15)),\"NA\",IF($B45=\"\",\"missing\",IF(AND($B45<>\"NA\",COUNTA($D45,$F45:$G45)+COUNTIF($E45,\"<>0\")),UPPER($B45),\"!error\"))),\"\")","v":""},{"$f":"IF(BV40=\"\",\"\",IF(BV40=\"FCL\",1,IF(BV40=\"CLO2\",2,IF(BV40=\"O3 Cell 1\",99,IF(BV40=\"O3\",3,IF(BV40=\"CLA\",4,0))))))","v":""},{"$f":"IF(BV40=\"\",\"\",IF(BV40=\"NA\",\"NA\",IF(ISBLANK($D45),\"missing\",IF(AND(BW40=1,ISNUMBER($D45),$D45>4),4,IF(AND(ISNUMBER($D45),$D45>=0),$D45,IF(AND(ISTEXT($D45),$D45=\"ND\"),\"ND\",\"!error\"))))))","v":""},{"$f":"IF(BV40=\"\",\"\",IF(BV40=\"NA\",\"NA\",IF(ISBLANK($E45),\"missing\",IF(OR(AND(ISBLANK($B45),COUNT(BX40,CA40:CB40)=0,ISNUMBER($E45),$E45=0),AND(ISNUMBER($E45),$E45>0),AND(ISTEXT($E45),$E45=\"ND\")),$E45,\"!error\"))))","v":""},{"$f":"IF(BV40=\"\",\"\",IF(AY40=0,\"NA\",IF(OR($BI$12=\"!error\",$BI$13=\"!error\",BY40=\"!error\"),\"!error\",IF(BV40=\"NA\",\"NA\",IF(AND(ISNUMBER(BY40),BY40=0),0,IF(AND(ISNUMBER($BI$12),ISNUMBER($BI$13),ISNUMBER(BY40)),$BI$13*$BI$12/BY40,IF(BY40=\"ND\",\"ND\",\"missing\")))))))","v":""},{"$f":"IF(BV40=\"\",\"\",IF(BV40=\"NA\",\"NA\",IF(ISBLANK($F45),\"missing\",IF(OR(ISNUMBER($F45),$F45=\"ND\"),$F45,\"!error\"))))","v":""},{"$f":"IF(BV40=\"\",\"\",IF(BV40=\"NA\",\"NA\",IF(ISBLANK($G45),\"missing\",IF(OR(AND(ISNUMBER($G45),$G45>=0,$G45<=14),$G45=\"ND\"),$G45,\"!error\"))))","v":""},{"$f":"IF(BV40=\"\",\"\",IF(AY40=0,\"NA\",IF(OR(BX40=\"!error\",BZ40=\"!error\"),\"!error\",IF(BV40=\"NA\",\"NA\",IF(OR(AND(ISNUMBER(BX40),BX40=0),AND(ISNUMBER(BZ40),BZ40=0)),0,IF(AND(ISNUMBER(BX40),ISNUMBER(BZ40)),BX40*BZ40,IF(OR(BX40=\"ND\",BZ40=\"ND\"),\"ND\",\"missing\")))))))","v":""},{"$f":"IF(BV40=\"\",\"\",IF(AY40=0,\"NA\",IF(CX40=\"ND\",\"ND\",IF(OR($BN$12=\"!error\",BV40=\"!error\",AND(BV40=\"missing\",ISNUMBER(BX40)),IF(BW40=1,BX40=\"!error\",0),CA40=\"!error\",CB40=\"!error\"),\"!error\",IF(OR(BV40=\"NA\",AND(ISNUMBER($BN$12),$BN$12=0),AND(BW40<>0,ISNUMBER(CC40),CC40=0),AND(BW40=1,ISNUMBER(CB40),CB40>9),AND(BW40>1,ISNUMBER(CB40),OR(CB40<6,CB40>=9.5))),\"NA\",IF(AND(ISNUMBER($BN$12),BW40<>0,IF(BW40=1,ISNUMBER(BX40),1),ISNUMBER(CA40),ISNUMBER(CB40)),CT_Giardia(BW40,$BN$12,CA40,CB40,IF(BW40=1,BX40,)),IF(COUNTIF(BW40,\"<>0\")+COUNT(BX40,BY40,CA40,CB40)=5,\"!error\",\"missing\")))))))","v":""},{"$f":"IF(BV40=\"\",\"\",IF(OR(AY40=0,AND(ISNUMBER($BN$12),$BN$12=0)),\"NA\",IF(CX40=\"ND\",\"ND\",IF(OR(CC40=\"!error\",CD40=\"!error\",CF40=\"!error\"),\"!error\",IF(BV40=\"NA\",\"NA\",IF(CD40=\"NA\",0,IF(AND(ISNUMBER(CC40),ISNUMBER(CD40)),CC40/CD40,IF(AND(BW40=99,CF40=0.5),CF40/$BN$12,\"missing\"))))))))","v":""},{"$f":"IF(BV40=\"\",\"\",IF(AY40=0,\"NA\",IF(CX40=\"ND\",\"ND\",IF(OR(BV40=\"!error\",AND(BV40=\"missing\",ISNUMBER(BX40)),BX40=\"!error\",BZ40=\"!error\",CA40=\"!error\",CB40=\"!error\"),\"!error\",IF(BV40=\"NA\",\"NA\",IF(OR(AND(BW40<>0,ISNUMBER(CC40),CC40=0),AND(BW40=1,ISNUMBER(CB40),CB40>9),AND(BW40>1,ISNUMBER(CB40),OR(CB40<6,CB40>=9.5))),0,IF(AND(ISNUMBER($BN$12),BW40<>0,ISNUMBER(BX40),ISNUMBER(BZ40),ISNUMBER(CA40),ISNUMBER(CB40)),log_Giardia(BW40,$BN$12,CA40,CB40,BX40,BZ40),IF(COUNTIF(BW40,\"<>0\")+COUNT(BX40,BY40,CA40,CB40)=5,\"!error\",\"missing\"))))))))","v":""},{"$f":"IF(BV40=\"\",\"\",IF(AY40=0,\"NA\",IF(CX40=\"ND\",\"ND\",IF(OR($BP$12=\"!error\",BV40=\"!error\",AND(BV40=\"missing\",ISNUMBER(BX40)),CA40=\"!error\",CB40=\"!error\"),\"!error\",IF(OR(BV40=\"NA\",AND(ISNUMBER($BP$12),$BP$12=0),AND(BW40<>0,ISNUMBER(CC40),CC40=0),AND(BW40=1,ISNUMBER(CB40),OR(CB40<5.5,CB40>=10.5)),AND(OR(BW40=2,BW40=4),ISNUMBER(CB40),OR(CB40<6,CB40>=9.5)),AND(BW40=3,ISNUMBER(CB40),OR(CB40<6,CB40>9))),\"NA\",IF(AND(ISNUMBER($BP$12),BW40<>0,ISNUMBER(CA40),ISNUMBER(CB40)),CT_Virus(BW40,$BP$12,CA40,CB40),IF(COUNTIF(BW40,\"<>0\")+COUNT(BX40,BY40,CA40,CB40)=5,\"!error\",\"missing\")))))))","v":""},{"$f":"IF(BV40=\"\",\"\",IF(OR(AY40=0,AND(ISNUMBER($BP$12),$BP$12=0)),\"NA\",IF(CX40=\"ND\",\"ND\",IF(OR(CC40=\"!error\",CG40=\"!error\",CI40=\"!error\"),\"!error\",IF(BV40=\"NA\",\"NA\",IF(CG40=\"NA\",0,IF(AND(ISNUMBER(CC40),ISNUMBER(CG40)),CC40/CG40,IF(AND(BW40=99,CI40=1),CI40/$BP$12,\"missing\"))))))))","v":""},{"$f":"IF(BV40=\"\",\"\",IF(AY40=0,\"NA\",IF(CX40=\"ND\",\"ND\",IF(OR(BV40=\"!error\",AND(BV40=\"missing\",ISNUMBER(BX40)),BX40=\"!error\",BZ40=\"!error\",CA40=\"!error\",CB40=\"!error\"),\"!error\",IF(BV40=\"NA\",\"NA\",IF(OR(AND(BW40<>0,ISNUMBER(CC40),CC40=0),AND(BW40=1,ISNUMBER(CB40),OR(CB40<5.5,CB40>=10.5)),AND(OR(BW40=2,BW40=4),ISNUMBER(CB40),OR(CB40<6,CB40>=9.5)),AND(BW40=3,ISNUMBER(CB40),OR(CB40<6,CB40>9))),0,IF(AND(ISNUMBER($BP$12),BW40<>0,ISNUMBER(BX40),ISNUMBER(BZ40),ISNUMBER(CA40),ISNUMBER(CB40)),Log_Virus(BW40,$BP$12,CA40,CB40,BX40,BZ40),IF(COUNTIF(BW40,\"<>0\")+COUNT(BX40,BY40,CA40,CB40)=5,\"!error\",\"missing\"))))))))","v":""},null,{"$f":"IF(AY40=\"\",\"\",IF(AY40=0,\"NA\",IF(COUNTIF(BN40:BN44,\"!error\")+COUNTIF(CF40:CF44,\"!error\")>0,\"!error\",IF(COUNT(BN40:BN44,CF40:CF44)>0,SUMIFF(BC40:BC44,\">0\",BN40:BN44)+SUMIFF(BU40:BU44,\">0\",CF40:CF44)+MINIF(BC40:BC44,BU40:BU44,\"1?\",BN40:BN44,CF40:CF44)+MINIF(BC40:BC44,BU40:BU44,\"2?\",BN40:BN44,CF40:CF44)+MINIF(BC40:BC44,BU40:BU44,\"3?\",BN40:BN44,CF40:CF44)+MINIF(BC40:BC44,BU40:BU44,\"4?\",BN40:BN44,CF40:CF44)+MINIF(BC40:BC44,BU40:BU44,\"5?\",BN40:BN44,CF40:CF44)+MINIF(BC40:BC44,BU40:BU44,\"6?\",BN40:BN44,CF40:CF44)+MINIF(BC40:BC44,BU40:BU44,\"7?\",BN40:BN44,CF40:CF44)+MINIF(BC40:BC44,BU40:BU44,\"8?\",BN40:BN44,CF40:CF44)+MINIF(BC40:BC44,BU40:BU44,\"9?\",BN40:BN44,CF40:CF44)+MINIF(BC40:BC44,BU40:BU44,\"10?\",BN40:BN44,CF40:CF44),IF(COUNTIF(BN40:BN44,\"NA\")+COUNTIF(CF40:CF44,\"NA\")=IF($AZ$4=\"missing\",10,SUM($BD$4:$BM$4)),0,\"missing\")))))","v":"missing"},{"$f":"IF(AND(ISNUMBER(CK40),COUNT(BN40:BN44,CF40:CF44)+COUNTIF(BN40:BN44,\"NA\")+COUNTIF(CF40:CF44,\"NA\")<IF($AZ$4=\"missing\",10,SUM($BD$4:$BM$4))),\"*\",\"\")","v":""},{"$f":"IF(AY40=\"\",\"\",IF(OR(AY40=0,AND(ISNUMBER($BN$12),$BN$12=0)),\"NA\",IF(COUNTIF(BM40:BM44,\"!error\")+COUNTIF(CE40:CE44,\"!error\")>0,\"!error\",IF(COUNT(BM40:BM44,CE40:CE44)>0,SUMIFF(BC40:BC44,\">0\",BM40:BM44)+SUMIFF(BU40:BU44,\">0\",CE40:CE44)+MINIF(BC40:BC44,BU40:BU44,\"1?\",BM40:BM44,CE40:CE44)+MINIF(BC40:BC44,BU40:BU44,\"2?\",BM40:BM44,CE40:CE44)+MINIF(BC40:BC44,BU40:BU44,\"3?\",BM40:BM44,CE40:CE44)+MINIF(BC40:BC44,BU40:BU44,\"4?\",BM40:BM44,CE40:CE44)+MINIF(BC40:BC44,BU40:BU44,\"5?\",BM40:BM44,CE40:CE44)+MINIF(BC40:BC44,BU40:BU44,\"6?\",BM40:BM44,CE40:CE44)+MINIF(BC40:BC44,BU40:BU44,\"7?\",BM40:BM44,CE40:CE44)+MINIF(BC40:BC44,BU40:BU44,\"8?\",BM40:BM44,CE40:CE44)+MINIF(BC40:BC44,BU40:BU44,\"9?\",BM40:BM44,CE40:CE44)+MINIF(BC40:BC44,BU40:BU44,\"10?\",BM40:BM44,CE40:CE44),IF(COUNTIF(BM40:BM44,\"NA\")+COUNTIF(CE40:CE44,\"NA\")=IF($AZ$4=\"missing\",10,SUM($BD$4:$BM$4)),0,\"missing\")))))","v":"missing"},{"$f":"IF(AND(ISNUMBER(CM40),COUNT(BM40:BM44,CE40:CE44)+COUNTIF(BM40:BM44,\"NA\")+COUNTIF(CE40:CE44,\"NA\")<IF($AZ$4=\"missing\",10,SUM($BD$4:$BM$4))),\"*\",\"\")","v":""},{"$f":"IF(AY40=\"\",\"\",IF(AY40=0,\"NA\",IF(COUNTIF(BQ40:BQ44,\"!error\")+COUNTIF(CI40:CI44,\"!error\")>0,\"!error\",IF(COUNT(BQ40:BQ44,CI40:CI44)>0,SUMIFF(BC40:BC44,\">0\",BQ40:BQ44)+SUMIFF(BU40:BU44,\">0\",CI40:CI44)+MINIF(BC40:BC44,BU40:BU44,\"1?\",BQ40:BQ44,CI40:CI44)+MINIF(BC40:BC44,BU40:BU44,\"2?\",BQ40:BQ44,CI40:CI44)+MINIF(BC40:BC44,BU40:BU44,\"3?\",BQ40:BQ44,CI40:CI44)+MINIF(BC40:BC44,BU40:BU44,\"4?\",BQ40:BQ44,CI40:CI44)+MINIF(BC40:BC44,BU40:BU44,\"5?\",BQ40:BQ44,CI40:CI44)+MINIF(BC40:BC44,BU40:BU44,\"6?\",BQ40:BQ44,CI40:CI44)+MINIF(BC40:BC44,BU40:BU44,\"7?\",BQ40:BQ44,CI40:CI44)+MINIF(BC40:BC44,BU40:BU44,\"8?\",BQ40:BQ44,CI40:CI44)+MINIF(BC40:BC44,BU40:BU44,\"9?\",BQ40:BQ44,CI40:CI44)+MINIF(BC40:BC44,BU40:BU44,\"10?\",BQ40:BQ44,CI40:CI44),IF(COUNTIF(BQ40:BQ44,\"NA\")+COUNTIF(CI40:CI44,\"NA\")=IF($AZ$4=\"missing\",10,SUM($BD$4:$BM$4)),0,\"missing\")))))","v":"missing"},{"$f":"IF(AND(ISNUMBER(CO40),COUNT(BQ40:BQ44,CI40:CI44)+COUNTIF(BQ40:BQ44,\"NA\")+COUNTIF(CI40:CI44,\"NA\")<IF($AZ$4=\"missing\",10,SUM($BD$4:$BM$4))),\"*\",\"\")","v":""},{"$f":"IF(AY40=\"\",\"\",IF(OR(AY40=0,AND(ISNUMBER($BP$12),$BP$12=0)),\"NA\",IF(COUNTIF(BP40:BP44,\"!error\")+COUNTIF(CH40:CH44,\"!error\")>0,\"!error\",IF(COUNT(BP40:BP44,CH40:CH44)>0,SUMIFF(BC40:BC44,\">0\",BP40:BP44)+SUMIFF(BU40:BU44,\">0\",CH40:CH44)+MINIF(BC40:BC44,BU40:BU44,\"1?\",BP40:BP44,CH40:CH44)+MINIF(BC40:BC44,BU40:BU44,\"2?\",BP40:BP44,CH40:CH44)+MINIF(BC40:BC44,BU40:BU44,\"3?\",BP40:BP44,CH40:CH44)+MINIF(BC40:BC44,BU40:BU44,\"4?\",BP40:BP44,CH40:CH44)+MINIF(BC40:BC44,BU40:BU44,\"5?\",BP40:BP44,CH40:CH44)+MINIF(BC40:BC44,BU40:BU44,\"6?\",BP40:BP44,CH40:CH44)+MINIF(BC40:BC44,BU40:BU44,\"7?\",BP40:BP44,CH40:CH44)+MINIF(BC40:BC44,BU40:BU44,\"8?\",BP40:BP44,CH40:CH44)+MINIF(BC40:BC44,BU40:BU44,\"9?\",BP40:BP44,CH40:CH44)+MINIF(BC40:BC44,BU40:BU44,\"10?\",BP40:BP44,CH40:CH44),IF(COUNTIF(BP40:BP44,\"NA\")+COUNTIF(CH40:CH44,\"NA\")=IF($AZ$4=\"missing\",10,SUM($BD$4:$BM$4)),0,\"missing\")))))","v":"missing"},{"$f":"IF(AND(ISNUMBER(CQ40),COUNT(BP40:BP44,CH40:CH44)+COUNTIF(BP40:BP44,\"NA\")+COUNTIF(CH40:CH44,\"NA\")<IF($AZ$4=\"missing\",10,SUM($BD$4:$BM$4))),\"*\",\"\")","v":""},{"$f":"IF(AY40=\"\",\"\",IF(AND(CM40=\"NA\",CQ40=\"NA\"),\"NA\",IF(OR(AND(ISNUMBER(CM40),ISNUMBER(CQ40)),AND(ISNUMBER(CM40),CQ40=\"NA\"),AND(CM40=\"NA\",ISNUMBER(CQ40)),AND(ISNUMBER(CM40),CM40=0),AND(ISNUMBER(CQ40),CQ40=0)),MIN(CM40,CQ40),IF(OR(CM40=\"!error\",CQ40=\"!error\"),\"!error\",\"missing\"))))","v":"missing"},{"$f":"IF(ISNUMBER(CS40),IF(CM40<CQ40,IF(CN40=\"*\",\"*\",\"\"),IF(CQ40<CM40,IF(CR40=\"*\",\"*\",\"\"),IF(AND(CN40=\"*\",CR40=\"*\"),\"*\",\"\"))),\"\")","v":""},{"$f":"IF(ISNUMBER(CS40),IF(CM40<CQ40,\"(G)\",IF(CQ40<CM40,\"(V)\",IF(AND(CN40=\"\",CR40=\"*\"),\"(G)\",IF(AND(CN40=\"*\",CR40=\"\"),\"(V)\",\"(G/V)\")))),\"\")","v":""},null,{"$f":"IF(OR(BF40=\"ND\",BG40=\"ND\",BI40=\"ND\",BJ40=\"ND\"),\"ND\",\"data\")","v":"data"},{"$f":"IF(OR(BX40=\"ND\",BY40=\"ND\",CA40=\"ND\",CB40=\"ND\"),\"ND\",\"data\")","v":"data"}]
[null," ",{"$f":"$D$15","v":2},null,null,null,null,"missing",{"$f":"$BL41","v":"missing"},{"$f":"$BO41","v":"missing"},{"$f":"$BN41","v":"missing"},{"$f":"$BQ41","v":"missing"},null,null,null,null,{"$f":"IF(AND(BE41=1,D41>4,D41<>\"ND\"),\"Note: The inactivation credit in zone D\" & C41 & \" was restricted due to elevated free chlorine levels.\",\"\")","v":""},null,null,null,null,null,null,null,null,null,null,null,null,null,null,null,null,null,null,null,null,null,null,null,null,null,null,null,null,null,null,null,null,null,1,{"$f":"IF($BE$14=0,0,IF(COUNTIF(OFFSET($BD40,0,0,MIN($BE$14,5),1),\"<>NA\")+IF($BE$14>5,COUNTIF(OFFSET($BV40,0,0,$BE$14-5,1),\"<>NA\"),0),1,0))","v":1},{"$f":"IF($BE$14=0,0,IF(COUNTIF(OFFSET($BD40,0,0,MIN($BE$14,5),1),\"O3\")+COUNTIF(OFFSET($BD40,0,0,MIN($BE$14,5),1),\"O3 Cell 1\")+IF($BE$14>5,COUNTIF(OFFSET($BV40,0,0,$BE$14-5,1),\"O3\"),0)+IF($BE$14>5,COUNTIF(OFFSET($BV40,0,0,$BE$14-5,1),\"O3 Cell 1\"),0),1,0))","v":0},{"$f":"IF(OR($AY41=0,AND(COUNTA(D41,F41:G41)=0,COUNTIF(E41,0))),\"NA\",IF(COUNTA(D41:G41),IF(BA41,4,5),IF($BE$15=1,IF(BA41,4,IF(AZ41,5,6)),IF(BD41=\"!error\",IF(BA41,4,5),IF(BA41,\"5B\",6)))))","v":5},{"$f":"$BE$11","v":2},{"$f":"IF(AND(IF($BN$4=\"missing\",10,$BN$4)>=2,$AY41<>\"\"),IF(OR($AY41=0,AND($B41=\"NA\",COUNTA($D41,$F41:$G41)=0,COUNTIF($E41,0)),AND($B41=\"NA\",COUNTA($D41:$G41)=0,IF($BE$14=0,0,COUNTIF(OFFSET($BD40,0,0,MIN($BE$14,5),1),\"NA\")+IF($BE$14>5,COUNTIF(OFFSET($BV40,0,0,$BE$14-5,1),\"NA\"),0))=$BE$14),AND($B41=\"NA\",COUNTA($D41:$G41)=0,IF($BE$14<5,COUNTA(OFFSET($D40,$BE$14,0,MIN(5-$BE$14,$BE$15),4))-COUNTIF(OFFSET($E40,$BE$14,0,MIN(5-$BE$14,$BE$15),1),0),0)+IF($BE$14+$BE$15>5,COUNTA(OFFSET($D45,MAX($BE$14-5,0),0,MIN($BE$14+$BE$15-5,$BE$15),4))-COUNTIF(OFFSET($E45,MAX($BE$14-5,0),0,MIN($BE$14+$BE$15-5,$BE$15),1),0),0)),AND($B41=\"NA\",COUNTA($D41:$G41)=0,IF($BE$14<5,COUNTIF(OFFSET($B40,$BE$14,0,MIN(5-$BE$14,$BE$15),1),\"NA\"),0)+IF($BE$14+$BE$15>5,COUNTIF(OFFSET($B45,MAX($BE$14-5,0),0,MIN($BE$14+$BE$15-5,$BE$15),1),\"NA\"),0)<>$BE$15)),\"NA\",IF($B41=\"\",\"missing\",IF(AND($B41<>\"NA\",COUNTA($D41,$F41:$G41)+COUNTIF($E41,\"<>0\")),UPPER($B41),\"!error\"))),\"\")","v":" "},0,{"$f":"IF(BD41=\"\",\"\",IF(BD41=\"NA\",\"NA\",IF(ISBLANK($D41),\"missing\",IF(AND(BE41=1,ISNUMBER($D41),$D41>4),4,IF(AND(ISNUMBER($D41),$D41>=0),$D41,IF(AND(ISTEXT($D41),$D41=\"ND\"),\"ND\",\"!error\"))))))","v":"missing"},{"$f":"IF(BD41=\"\",\"\",IF(BD41=\"NA\",\"NA\",IF(ISBLANK($E41),\"missing\",IF(OR(AND(ISBLANK($B41),COUNT(BF41,BI41:BJ41)=0,ISNUMBER($E41),$E41=0),AND(ISNUMBER($E41),$E41>0),AND(ISTEXT($E41),$E41=\"ND\")),$E41,\"!error\"))))","v":"missing"},{"$f":"IF(BD41=\"\",\"\",IF(AY41=0,\"NA\",IF(OR($BE$12=\"!error\",$BE$13=\"!error\",BG41=\"!error\"),\"!error\",IF(BD41=\"NA\",\"NA\",IF(AND(ISNUMBER(BG41),BG41=0),0,IF(AND(ISNUMBER($BE$12),ISNUMBER($BE$13),ISNUMBER(BG41)),$BE$13*$BE$12/BG41,IF(BG41=\"ND\",\"ND\",\"missing\")))))))","v":"missing"},{"$f":"IF(BD41=\"\",\"\",IF(BD41=\"NA\",\"NA\",IF(ISBLANK($F41),\"missing\",IF(OR(ISNUMBER($F41),$F41=\"ND\"),$F41,\"!error\"))))","v":"missing"},{"$f":"IF(BD41=\"\",\"\",IF(BD41=\"NA\",\"NA\",IF(ISBLANK($G41),\"missing\",IF(OR(AND(ISNUMBER($G41),$G41>=0,$G41<=14),$G41=\"ND\"),$G41,\"!error\"))))","v":"missing"},"missing",{"$f":"IF(BD41=\"\",\"\",IF(AY41=0,\"NA\",IF(CW41=\"ND\",\"ND\",IF(OR($BN$12=\"!error\",BD41=\"!error\",AND(BD41=\"missing\",ISNUMBER(BF41)),IF(BE41=1,BF41=\"!error\",0),BI41=\"!error\",BJ41=\"!error\"),\"!error\",IF(OR(BD41=\"NA\",AND(ISNUMBER($BN$12),$BN$12=0),AND(BE41<>0,ISNUMBER(BK41),BK41=0),AND(BE41=1,ISNUMBER(BJ41),BJ41>9),AND(BE41=2,ISNUMBER(BJ41),OR(BJ41<6,BJ41>=9.5)),AND(OR(BE41=3,BE41=4),ISNUMBER(BJ41),OR(BJ41<5.5,BJ41>=9.5))),\"NA\",IF(AND(ISNUMBER($BN$12),BE41<>0,IF(BE41=1,ISNUMBER(BF41),1),ISNUMBER(BI41),ISNUMBER(BJ41)),CT_Giardia(BE41,$BN$12,BI41,BJ41,IF(BE41=1,BF41,)),IF(COUNTIF(BE41,\"<>0\")+COUNT(BF41,BG41,BI41,BJ41)=5,\"!error\",\"missing\")))))))","v":"missing"},{"$f":"IF(BD41=\"\",\"\",IF(OR(AY41=0,AND(ISNUMBER($BN$12),$BN$12=0)),\"NA\",IF(CW41=\"ND\",\"ND\",IF(OR(BK41=\"!error\",BL41=\"!error\",BN41=\"!error\"),\"!error\",IF(BD41=\"NA\",\"NA\",IF(BL41=\"NA\",0,IF(AND(BE41<>99,ISNUMBER(BK41),ISNUMBER(BL41)),BK41/BL41,IF(AND(BE41=99,BN41=0.5),BN41/$BN$12,\"missing\"))))))))","v":"missing"},{"$f":"IF(BD41=\"\",\"\",IF(AY41=0,\"NA\",IF(CW41=\"ND\",\"ND\",IF(OR(BD41=\"!error\",AND(BD41=\"missing\",ISNUMBER(BF41)),BF41=\"!error\",BH41=\"!error\",BI41=\"!error\",BJ41=\"!error\"),\"!error\",IF(BD41=\"NA\",\"NA\",IF(OR(AND(BE41<>0,ISNUMBER(BK41),BK41=0),AND(BE41=1,ISNUMBER(BJ41),BJ41>9),AND(BE41=2,ISNUMBER(BJ41),OR(BJ41<6,BJ41>=9.5)),AND(OR(BE41=3,BE41=4),ISNUMBER(BJ41),OR(BJ41<5.5,BJ41>=9.5))),0,IF(AND(ISNUMBER($BN$12),BE41<>0,ISNUMBER(BF41),ISNUMBER(BH41),ISNUMBER(BI41),ISNUMBER(BJ41)),log_Giardia(BE41,$BN$12,BI41,BJ41,BF41,BH41),IF(COUNTIF(BE41,\"<>0\")+COUNT(BF41,BG41,BI41,BJ41)=5,\"!error\",\"missing\"))))))))","v":"missing"},{"$f":"IF(BD41=\"\",\"\",IF(AY41=0,\"NA\",IF(CW41=\"ND\",\"ND\",IF(OR($BP$12=\"!error\",BD41=\"!error\",AND(BD41=\"missing\",ISNUMBER(BF41)),BI41=\"!error\",BJ41=\"!error\"),\"!error\",IF(OR(BD41=\"NA\",AND(ISNUMBER($BP$12),$BP$12=0),AND(BE41<>0,ISNUMBER(BK41),BK41=0),AND(BE41=1,ISNUMBER(BJ41),BJ41>=10.5),AND(BE41=2,ISNUMBER(BJ41),OR(BJ41<6,BJ41>=9.5)),AND(BE41=3,ISNUMBER(BJ41),OR(BJ41<6,BJ41>9)),AND(BE41=4,ISNUMBER(BJ41),OR(BJ41<6,BJ41>10))),\"NA\",IF(AND(ISNUMBER($BP$12),BE41<>0,ISNUMBER(BI41),ISNUMBER(BJ41)),CT_Virus(BE41,$BP$12,BI41,BJ41),IF(COUNTIF(BE41,\"<>0\")+COUNT(BF41,BG41,BI41,BJ41)=5,\"!error\",\"missing\")))))))","v":"missing"},{"$f":"IF(BD41=\"\",\"\",IF(OR(AY41=0,AND(ISNUMBER($BP$12),$BP$12=0)),\"NA\",IF(CW41=\"ND\",\"ND\",IF(OR(BK41=\"!error\",BO41=\"!error\",BQ41=\"!error\"),\"!error\",IF(BD41=\"NA\",\"NA\",IF(BO41=\"NA\",0,IF(AND(BE41<>99,ISNUMBER(BK41),ISNUMBER(BO41)),BK41/BO41,IF(AND(BE41=99,BQ41=1),BQ41/$BP$12,\"missing\"))))))))","v":"missing"},{"$f":"IF(BD41=\"\",\"\",IF(AY41=0,\"NA\",IF(CW41=\"ND\",\"ND\",IF(OR(BD41=\"!error\",AND(BD41=\"missing\",ISNUMBER(BF41)),BF41=\"!error\",BH41=\"!error\",BI41=\"!error\",BJ41=\"!error\"),\"!error\",IF(BD41=\"NA\",\"NA\",IF(OR(AND(BE41<>0,ISNUMBER(BK41),BK41=0),AND(BE41=1,ISNUMBER(BJ41),BJ41>=10.5),AND(BE41=2,ISNUMBER(BJ41),OR(BJ41<6,BJ41>=9.5)),AND(BE41=3,ISNUMBER(BJ41),OR(BJ41<6,BJ41>9)),AND(BE41=4,ISNUMBER(BJ41),OR(BJ41<6,BJ41>10))),0,IF(AND(ISNUMBER($BP$12),BE41<>0,ISNUMBER(BF41),ISNUMBER(BH41),ISNUMBER(BI41),ISNUMBER(BJ41)),Log_Virus(BE41,$BP$12,BI41,BJ41,BF41,BH41),IF(COUNTIF(BE41,\"<>0\")+COUNT(BF41,BG41,BI41,BJ41)=5,\"!error\",\"missing\"))))))))","v":"missing"},{"$f":"IF($BJ$14=0,0,IF(COUNTIF(OFFSET($BD40,0,0,MIN($BJ$14,5),1),\"<>NA\")+IF($BJ$14>5,COUNTIF(OFFSET($BV40,0,0,$BJ$14-5,1),\"<>NA\"),0),1,0))","v":1},{"$f":"IF($BJ$14=0,0,IF(COUNTIF(OFFSET($BD40,0,0,MIN($BJ$14,5),1),\"O3\")+COUNTIF(OFFSET($BD40,0,0,MIN($BJ$14,5),1),\"O3 Cell 1\")+IF($BJ$14>5,COUNTIF(OFFSET($BV40,0,0,$BJ$14-5,1),\"O3\"),0)+IF($BJ$14>5,COUNTIF(OFFSET($BV40,0,0,$BJ$14-5,1),\"O3 Cell 1\"),0),1,0))","v":0},{"$f":"IF(OR($AY41=0,AND(COUNTA(D46,F46:G46)=0,COUNTIF(E46,0))),\"NA\",IF(COUNTA(D46:G46),IF(BS41,4,5),IF($BJ$15=1,IF(BS41,4,IF(BR41,5,6)),IF(BV41=\"!error\",IF(BS41,4,5),IF(BS41,\"5B\",6)))))","v":6},{"$f":"$BJ$11","v":7},{"$f":"IF(AND(IF($BN$4=\"missing\",10,$BN$4)>=7,$AY41<>\"\"),IF(OR($AY41=0,AND($B46=\"NA\",COUNTA($D46,$F46:$G46)=0,COUNTIF($E46,0)),AND($B46=\"NA\",COUNTA($D46:$G46)=0,IF($BJ$14=0,0,COUNTIF(OFFSET($BD40,0,0,MIN($BJ$14,5),1),\"NA\")+IF($BJ$14>5,COUNTIF(OFFSET($BV40,0,0,$BJ$14-5,1),\"NA\"),0))=$BJ$14),AND($B46=\"NA\",COUNTA($D46:$G46)=0,IF($BJ$14<5,COUNTA(OFFSET($D40,$BJ$14,0,MIN(5-$BJ$14,$BJ$15),4))-COUNTIF(OFFSET($E40,$BJ$14,0,MIN(5-$BJ$14,$BJ$15),1),0),0)+IF($BJ$14+$BJ$15>5,COUNTA(OFFSET($D45,MAX($BJ$14-5,0),0,MIN($BJ$14+$BJ$15-5,$BJ$15),4))-COUNTIF(OFFSET($E45,MAX($BJ$14-5,0),0,MIN($BJ$14+$BJ$15-5,$BJ$15),1),0),0)),AND($B46=\"NA\",COUNTA($D46:$G46)=0,IF($BJ$14<5,COUNTIF(OFFSET($B40,$BJ$14,0,MIN(5-$BJ$14,$BJ$15),1),\"NA\"),0)+IF($BJ$14+$BJ$15>5,COUNTIF(OFFSET($B45,MAX($BJ$14-5,0),0,MIN($BJ$14+$BJ$15-5,$BJ$15),1),\"NA\"),0)<>$BJ$15)),\"NA\",IF($B46=\"\",\"missing\",IF(AND($B46<>\"NA\",COUNTA($D46,$F46:$G46)+COUNTIF($E46,\"<>0\")),UPPER($B46),\"!error\"))),\"\")","v":""},"",{"$f":"IF(BV41=\"\",\"\",IF(BV41=\"NA\",\"NA\",IF(ISBLANK($D46),\"missing\",IF(AND(BW41=1,ISNUMBER($D46),$D46>4),4,IF(AND(ISNUMBER($D46),$D46>=0),$D46,IF(AND(ISTEXT($D46),$D46=\"ND\"),\"ND\",\"!error\"))))))","v":""},{"$f":"IF(BV41=\"\",\"\",IF(BV41=\"NA\",\"NA\",IF(ISBLANK($E46),\"missing\",IF(OR(AND(ISBLANK($B46),COUNT(BX41,CA41:CB41)=0,ISNUMBER($E46),$E46=0),AND(ISNUMBER($E46),$E46>0),AND(ISTEXT($E46),$E46=\"ND\")),$E46,\"!error\"))))","v":""},{"$f":"IF(BV41=\"\",\"\",IF(AY41=0,\"NA\",IF(OR($BJ$12=\"!error\",$BJ$13=\"!error\",BY41=\"!error\"),\"!error\",IF(BV41=\"NA\",\"NA\",IF(AND(ISNUMBER(BY41),BY41=0),0,IF(AND(ISNUMBER($BJ$12),ISNUMBER($BJ$13),ISNUMBER(BY41)),$BJ$13*$BJ$12/BY41,IF(BY41=\"ND\",\"ND\",\"missing\")))))))","v":""},{"$f":"IF(BV41=\"\",\"\",IF(BV41=\"NA\",\"NA\",IF(ISBLANK($F46),\"missing\",IF(OR(ISNUMBER($F46),$F46=\"ND\"),$F46,\"!error\"))))","v":""},{"$f":"IF(BV41=\"\",\"\",IF(BV41=\"NA\",\"NA\",IF(ISBLANK($G46),\"missing\",IF(OR(AND(ISNUMBER($G46),$G46>=0,$G46<=14),$G46=\"ND\"),$G46,\"!error\"))))","v":""},"",{"$f":"IF(BV41=\"\",\"\",IF(AY41=0,\"NA\",IF(CX41=\"ND\",\"ND\",IF(OR($BN$12=\"!error\",BV41=\"!error\",AND(BV41=\"missing\",ISNUMBER(BX41)),IF(BW41=1,BX41=\"!error\",0),CA41=\"!error\",CB41=\"!error\"),\"!error\",IF(OR(BV41=\"NA\",AND(ISNUMBER($BN$12),$BN$12=0),AND(BW41<>0,ISNUMBER(CC41),CC41=0),AND(BW41=1,ISNUMBER(CB41),CB41>9),AND(BW41>1,ISNUMBER(CB41),OR(CB41<6,CB41>=9.5))),\"NA\",IF(AND(ISNUMBER($BN$12),BW41<>0,IF(BW41=1,ISNUMBER(BX41),1),ISNUMBER(CA41),ISNUMBER(CB41)),CT_Giardia(BW41,$BN$12,CA41,CB41,IF(BW41=1,BX41,)),IF(COUNTIF(BW41,\"<>0\")+COUNT(BX41,BY41,CA41,CB41)=5,\"!error\",\"missing\")))))))","v":""},{"$f":"IF(BV41=\"\",\"\",IF(OR(AY41=0,AND(ISNUMBER($BN$12),$BN$12=0)),\"NA\",IF(CX41=\"ND\",\"ND\",IF(OR(CC41=\"!error\",CD41=\"!error\",CF41=\"!error\"),\"!error\",IF(BV41=\"NA\",\"NA\",IF(CD41=\"NA\",0,IF(AND(ISNUMBER(CC41),ISNUMBER(CD41)),CC41/CD41,IF(AND(BW41=99,CF41=0.5),CF41/$BN$12,\"missing\"))))))))","v":""},{"$f":"IF(BV41=\"\",\"\",IF(AY41=0,\"NA\",IF(CX41=\"ND\",\"ND\",IF(OR(BV41=\"!error\",AND(BV41=\"missing\",ISNUMBER(BX41)),BX41=\"!error\",BZ41=\"!error\",CA41=\"!error\",CB41=\"!error\"),\"!error\",IF(BV41=\"NA\",\"NA\",IF(OR(AND(BW41<>0,ISNUMBER(CC41),CC41=0),AND(BW41=1,ISNUMBER(CB41),CB41>9),AND(BW41>1,ISNUMBER(CB41),OR(CB41<6,CB41>=9.5))),0,IF(AND(ISNUMBER($BN$12),BW41<>0,ISNUMBER(BX41),ISNUMBER(BZ41),ISNUMBER(CA41),ISNUMBER(CB41)),log_Giardia(BW41,$BN$12,CA41,CB41,BX41,BZ41),IF(COUNTIF(BW41,\"<>0\")+COUNT(BX41,BY41,CA41,CB41)=5,\"!error\",\"missing\"))))))))","v":""},{"$f":"IF(BV41=\"\",\"\",IF(AY41=0,\"NA\",IF(CX41=\"ND\",\"ND\",IF(OR($BP$12=\"!error\",BV41=\"!error\",AND(BV41=\"missing\",ISNUMBER(BX41)),CA41=\"!error\",CB41=\"!error\"),\"!error\",IF(OR(BV41=\"NA\",AND(ISNUMBER($BP$12),$BP$12=0),AND(BW41<>0,ISNUMBER(CC41),CC41=0),AND(BW41=1,ISNUMBER(CB41),OR(CB41<5.5,CB41>=10.5)),AND(OR(BW41=2,BW41=4),ISNUMBER(CB41),OR(CB41<6,CB41>=9.5)),AND(BW41=3,ISNUMBER(CB41),OR(CB41<6,CB41>9))),\"NA\",IF(AND(ISNUMBER($BP$12),BW41<>0,ISNUMBER(CA41),ISNUMBER(CB41)),CT_Virus(BW41,$BP$12,CA41,CB41),IF(COUNTIF(BW41,\"<>0\")+COUNT(BX41,BY41,CA41,CB41)=5,\"!error\",\"missing\")))))))","v":""},{"$f":"IF(BV41=\"\",\"\",IF(OR(AY41=0,AND(ISNUMBER($BP$12),$BP$12=0)),\"NA\",IF(CX41=\"ND\",\"ND\",IF(OR(CC41=\"!error\",CG41=\"!error\",CI41=\"!error\"),\"!error\",IF(BV41=\"NA\",\"NA\",IF(CG41=\"NA\",0,IF(AND(ISNUMBER(CC41),ISNUMBER(CG41)),CC41/CG41,IF(AND(BW41=99,CI41=1),CI41/$BP$12,\"missing\"))))))))","v":""},{"$f":"IF(BV41=\"\",\"\",IF(AY41=0,\"NA\",IF(CX41=\"ND\",\"ND\",IF(OR(BV41=\"!error\",AND(BV41=\"missing\",ISNUMBER(BX41)),BX41=\"!error\",BZ41=\"!error\",CA41=\"!error\",CB41=\"!error\"),\"!error\",IF(BV41=\"NA\",\"NA\",IF(OR(AND(BW41<>0,ISNUMBER(CC41),CC41=0),AND(BW41=1,ISNUMBER(CB41),OR(CB41<5.5,CB41>=10.5)),AND(OR(BW41=2,BW41=4),ISNUMBER(CB41),OR(CB41<6,CB41>=9.5)),AND(BW41=3,ISNUMBER(CB41),OR(CB41<6,CB41>9))),0,IF(AND(ISNUMBER($BP$12),BW41<>0,ISNUMBER(BX41),ISNUMBER(BZ41),ISNUMBER(CA41),ISNUMBER(CB41)),Log_Virus(BW41,$BP$12,CA41,CB41,BX41,BZ41),IF(COUNTIF(BW41,\"<>0\")+COUNT(BX41,BY41,CA41,CB41)=5,\"!error\",\"missing\"))))))))","v":""},null,null,null,null,null,null,null,null,null,null,null,null,null,{"$f":"IF(OR(BF41=\"ND\",BG41=\"ND\",BI41=\"ND\",BJ41=\"ND\"),\"ND\",\"data\")","v":"data"},{"$f":"IF(OR(BX41=\"ND\",BY41=\"ND\",CA41=\"ND\",CB41=\"ND\"),\"ND\",\"data\")","v":"data"}]
[null," ",{"$f":"$E$15","v":3},null,null,null,null,{"$f":"IF(BL42=\"!error\",\"!error\",$BK42)","v":"missing"},"missing","missing","missing","missing",null,null,null,null,"",null,null,null,null,null,null,null,null,null,null,null,null,null,null,null,null,null,null,null,null,null,null,null,null,null,null,null,null,null,null,null,null,null,1,{"$f":"IF($BF$14=0,0,IF(COUNTIF(OFFSET($BD40,0,0,MIN($BF$14,5),1),\"<>NA\")+IF($BF$14>5,COUNTIF(OFFSET($BV40,0,0,$BF$14-5,1),\"<>NA\"),0),1,0))","v":1},{"$f":"IF($BF$14=0,0,IF(COUNTIF(OFFSET($BD40,0,0,MIN($BF$14,5),1),\"O3\")+COUNTIF(OFFSET($BD40,0,0,MIN($BF$14,5),1),\"O3 Cell 1\")+IF($BF$14>5,COUNTIF(OFFSET($BV40,0,0,$BF$14-5,1),\"O3\"),0)+IF($BF$14>5,COUNTIF(OFFSET($BV40,0,0,$BF$14-5,1),\"O3 Cell 1\"),0),1,0))","v":0},{"$f":"IF(OR($AY42=0,AND(COUNTA(D42,F42:G42)=0,COUNTIF(E42,0))),\"NA\",IF(COUNTA(D42:G42),IF(BA42,4,5),IF($BF$15=1,IF(BA42,4,IF(AZ42,5,6)),IF(BD42=\"!error\",IF(BA42,4,5),IF(BA42,\"5B\",6)))))","v":5},{"$f":"$BF$11","v":3},{"$f":"IF(AND(IF($BN$4=\"missing\",10,$BN$4)>=3,$AY42<>\"\"),IF(OR($AY42=0,AND($B42=\"NA\",COUNTA($D42,$F42:$G42)=0,COUNTIF($E42,0)),AND($B42=\"NA\",COUNTA($D42:$G42)=0,IF($BF$14=0,0,COUNTIF(OFFSET($BD40,0,0,MIN($BF$14,5),1),\"NA\")+IF($BF$14>5,COUNTIF(OFFSET($BV40,0,0,$BF$14-5,1),\"NA\"),0))=$BF$14),AND($B42=\"NA\",COUNTA($D42:$G42)=0,IF($BF$14<5,COUNTA(OFFSET($D40,$BF$14,0,MIN(5-$BF$14,$BF$15),4))-COUNTIF(OFFSET($E40,$BF$14,0,MIN(5-$BF$14,$BF$15),1),0),0)+IF($BF$14+$BF$15>5,COUNTA(OFFSET($D45,MAX($BF$14-5,0),0,MIN($BF$14+$BF$15-5,$BF$15),4))-COUNTIF(OFFSET($E45,MAX($BF$14-5,0),0,MIN($BF$14+$BF$15-5,$BF$15),1),0),0)),AND($B42=\"NA\",COUNTA($D42:$G42)=0,IF($BF$14<5,COUNTIF(OFFSET($B40,$BF$14,0,MIN(5-$BF$14,$BF$15),1),\"NA\"),0)+IF($BF$14+$BF$15>5,COUNTIF(OFFSET($B45,MAX($BF$14-5,0),0,MIN($BF$14+$BF$15-5,$BF$15),1),\"NA\"),0)<>$BF$15)),\"NA\",IF($B42=\"\",\"missing\",IF(AND($B42<>\"NA\",COUNTA($D42,$F42:$G42)+COUNTIF($E42,\"<>0\")),UPPER($B42),\"!error\"))),\"\")","v":" "},0,"missing","missing",{"$f":"IF(BD42=\"\",\"\",IF(AY42=0,\"NA\",IF(OR($BF$12=\"!error\",$BF$13=\"!error\",BG42=\"!error\"),\"!error\",IF(BD42=\"NA\",\"NA\",IF(AND(ISNUMBER(BG42),BG42=0),0,IF(AND(ISNUMBER($BF$12),ISNUMBER($BF$13),ISNUMBER(BG42)),$BF$13*$BF$12/BG42,IF(BG42=\"ND\",\"ND\",\"missing\")))))))","v":"missing"},"missing","missing","missing",{"$f":"IF(BD42=\"\",\"\",IF(AY42=0,\"NA\",IF(CW42=\"ND\",\"ND\",IF(OR($BN$12=\"!error\",BD42=\"!error\",AND(BD42=\"missing\",ISNUMBER(BF42)),IF(BE42=1,BF42=\"!error\",0),BI42=\"!error\",BJ42=\"!error\"),\"!error\",IF(OR(BD42=\"NA\",AND(ISNUMBER($BN$12),$BN$12=0),AND(BE42<>0,ISNUMBER(BK42),BK42=0),AND(BE42=1,ISNUMBER(BJ42),BJ42>9),AND(BE42=2,ISNUMBER(BJ42),OR(BJ42<6,BJ42>=9.5)),AND(OR(BE42=3,BE42=4),ISNUMBER(BJ42),OR(BJ42<5.5,BJ42>=9.5))),\"NA\",IF(AND(ISNUMBER($BN$12),BE42<>0,IF(BE42=1,ISNUMBER(BF42),1),ISNUMBER(BI42),ISNUMBER(BJ42)),CT_Giardia(BE42,$BN$12,BI42,BJ42,IF(BE42=1,BF42,)),IF(COUNTIF(BE42,\"<>0\")+COUNT(BF42,BG42,BI42,BJ42)=5,\"!error\",\"missing\")))))))","v":"missing"},{"$f":"IF(BD42=\"\",\"\",IF(OR(AY42=0,AND(ISNUMBER($BN$12),$BN$12=0)),\"NA\",IF(CW42=\"ND\",\"ND\",IF(OR(BK42=\"!error\",BL42=\"!error\",BN42=\"!error\"),\"!error\",IF(BD42=\"NA\",\"NA\",IF(BL42=\"NA\",0,IF(AND(BE42<>99,ISNUMBER(BK42),ISNUMBER(BL42)),BK42/BL42,IF(AND(BE42=99,BN42=0.5),BN42/$BN$12,\"missing\"))))))))","v":"missing"},{"$f":"IF(BD42=\"\",\"\",IF(AY42=0,\"NA\",IF(CW42=\"ND\",\"ND\",IF(OR(BD42=\"!error\",AND(BD42=\"missing\",ISNUMBER(BF42)),BF42=\"!error\",BH42=\"!error\",BI42=\"!error\",BJ42=\"!error\"),\"!error\",IF(BD42=\"NA\",\"NA\",IF(OR(AND(BE42<>0,ISNUMBER(BK42),BK42=0),AND(BE42=1,ISNUMBER(BJ42),BJ42>9),AND(BE42=2,ISNUMBER(BJ42),OR(BJ42<6,BJ42>=9.5)),AND(OR(BE42=3,BE42=4),ISNUMBER(BJ42),OR(BJ42<5.5,BJ42>=9.5))),0,IF(AND(ISNUMBER($BN$12),BE42<>0,ISNUMBER(BF42),ISNUMBER(BH42),ISNUMBER(BI42),ISNUMBER(BJ42)),log_Giardia(BE42,$BN$12,BI42,BJ42,BF42,BH42),IF(COUNTIF(BE42,\"<>0\")+COUNT(BF42,BG42,BI42,BJ42)=5,\"!error\",\"missing\"))))))))","v":"missing"},{"$f":"IF(BD42=\"\",\"\",IF(AY42=0,\"NA\",IF(CW42=\"ND\",\"ND\",IF(OR($BP$12=\"!error\",BD42=\"!error\",AND(BD42=\"missing\",ISNUMBER(BF42)),BI42=\"!error\",BJ42=\"!error\"),\"!error\",IF(OR(BD42=\"NA\",AND(ISNUMBER($BP$12),$BP$12=0),AND(BE42<>0,ISNUMBER(BK42),BK42=0),AND(BE42=1,ISNUMBER(BJ42),BJ42>=10.5),AND(BE42=2,ISNUMBER(BJ42),OR(BJ42<6,BJ42>=9.5)),AND(BE42=3,ISNUMBER(BJ42),OR(BJ42<6,BJ42>9)),AND(BE42=4,ISNUMBER(BJ42),OR(BJ42<6,BJ42>10))),\"NA\",IF(AND(ISNUMBER($BP$12),BE42<>0,ISNUMBER(BI42),ISNUMBER(BJ42)),CT_Virus(BE42,$BP$12,BI42,BJ42),IF(COUNTIF(BE42,\"<>0\")+COUNT(BF42,BG42,BI42,BJ42)=5,\"!error\",\"missing\")))))))","v":"missing"},{"$f":"IF(BD42=\"\",\"\",IF(OR(AY42=0,AND(ISNUMBER($BP$12),$BP$12=0)),\"NA\",IF(CW42=\"ND\",\"ND\",IF(OR(BK42=\"!error\",BO42=\"!error\",BQ42=\"!error\"),\"!error\",IF(BD42=\"NA\",\"NA\",IF(BO42=\"NA\",0,IF(AND(BE42<>99,ISNUMBER(BK42),ISNUMBER(BO42)),BK42/BO42,IF(AND(BE42=99,BQ42=1),BQ42/$BP$12,\"missing\"))))))))","v":"missing"},{"$f":"IF(BD42=\"\",\"\",IF(AY42=0,\"NA\",IF(CW42=\"ND\",\"ND\",IF(OR(BD42=\"!error\",AND(BD42=\"missing\",ISNUMBER(BF42)),BF42=\"!error\",BH42=\"!error\",BI42=\"!error\",BJ42=\"!error\"),\"!error\",IF(BD42=\"NA\",\"NA\",IF(OR(AND(BE42<>0,ISNUMBER(BK42),BK42=0),AND(BE42=1,ISNUMBER(BJ42),BJ42>=10.5),AND(BE42=2,ISNUMBER(BJ42),OR(BJ42<6,BJ42>=9.5)),AND(BE42=3,ISNUMBER(BJ42),OR(BJ42<6,BJ42>9)),AND(BE42=4,ISNUMBER(BJ42),OR(BJ42<6,BJ42>10))),0,IF(AND(ISNUMBER($BP$12),BE42<>0,ISNUMBER(BF42),ISNUMBER(BH42),ISNUMBER(BI42),ISNUMBER(BJ42)),Log_Virus(BE42,$BP$12,BI42,BJ42,BF42,BH42),IF(COUNTIF(BE42,\"<>0\")+COUNT(BF42,BG42,BI42,BJ42)=5,\"!error\",\"missing\"))))))))","v":"missing"},{"$f":"IF($BK$14=0,0,IF(COUNTIF(OFFSET($BD40,0,0,MIN($BK$14,5),1),\"<>NA\")+IF($BK$14>5,COUNTIF(OFFSET($BV40,0,0,$BK$14-5,1),\"<>NA\"),0),1,0))","v":1},{"$f":"IF($BK$14=0,0,IF(COUNTIF(OFFSET($BD40,0,0,MIN($BK$14,5),1),\"O3\")+COUNTIF(OFFSET($BD40,0,0,MIN($BK$14,5),1),\"O3 Cell 1\")+IF($BK$14>5,COUNTIF(OFFSET($BV40,0,0,$BK$14-5,1),\"O3\"),0)+IF($BK$14>5,COUNTIF(OFFSET($BV40,0,0,$BK$14-5,1),\"O3 Cell 1\"),0),1,0))","v":0},{"$f":"IF(OR($AY42=0,AND(COUNTA(D47,F47:G47)=0,COUNTIF(E47,0))),\"NA\",IF(COUNTA(D47:G47),IF(BS42,4,5),IF($BK$15=1,IF(BS42,4,IF(BR42,5,6)),IF(BV42=\"!error\",IF(BS42,4,5),IF(BS42,\"5B\",6)))))","v":6},{"$f":"$BK$11","v":8},{"$f":"IF(AND(IF($BN$4=\"missing\",10,$BN$4)>=8,$AY42<>\"\"),IF(OR($AY42=0,AND($B47=\"NA\",COUNTA($D47,$F47:$G47)=0,COUNTIF($E47,0)),AND($B47=\"NA\",COUNTA($D47:$G47)=0,IF($BK$14=0,0,COUNTIF(OFFSET($BD40,0,0,MIN($BK$14,5),1),\"NA\")+IF($BK$14>5,COUNTIF(OFFSET($BV40,0,0,$BK$14-5,1),\"NA\"),0))=$BK$14),AND($B47=\"NA\",COUNTA($D47:$G47)=0,IF($BK$14<5,COUNTA(OFFSET($D40,$BK$14,0,MIN(5-$BK$14,$BK$15),4))-COUNTIF(OFFSET($E40,$BK$14,0,MIN(5-$BK$14,$BK$15),1),0),0)+IF($BK$14+$BK$15>5,COUNTA(OFFSET($D45,MAX($BK$14-5,0),0,MIN($BK$14+$BK$15-5,$BK$15),4))-COUNTIF(OFFSET($E45,MAX($BK$14-5,0),0,MIN($BK$14+$BK$15-5,$BK$15),1),0),0)),AND($B47=\"NA\",COUNTA($D47:$G47)=0,IF($BK$14<5,COUNTIF(OFFSET($B40,$BK$14,0,MIN(5-$BK$14,$BK$15),1),\"NA\"),0)+IF($BK$14+$BK$15>5,COUNTIF(OFFSET($B45,MAX($BK$14-5,0),0,MIN($BK$14+$BK$15-5,$BK$15),1),\"NA\"),0)<>$BK$15)),\"NA\",IF($B47=\"\",\"missing\",IF(AND($B47<>\"NA\",COUNTA($D47,$F47:$G47)+COUNTIF($E47,\"<>0\")),UPPER($B47),\"!error\"))),\"\")","v":""},"",{"$f":"IF(BV42=\"\",\"\",IF(BV42=\"NA\",\"NA\",IF(ISBLANK($D47),\"missing\",IF(AND(BW42=1,ISNUMBER($D47),$D47>4),4,IF(AND(ISNUMBER($D47),$D47>=0),$D47,IF(AND(ISTEXT($D47),$D47=\"ND\"),\"ND\",\"!error\"))))))","v":""},{"$f":"IF(BV42=\"\",\"\",IF(BV42=\"NA\",\"NA\",IF(ISBLANK($E47),\"missing\",IF(OR(AND(ISBLANK($B47),COUNT(BX42,CA42:CB42)=0,ISNUMBER($E47),$E47=0),AND(ISNUMBER($E47),$E47>0),AND(ISTEXT($E47),$E47=\"ND\")),$E47,\"!error\"))))","v":""},{"$f":"IF(BV42=\"\",\"\",IF(AY42=0,\"NA\",IF(OR($BK$12=\"!error\",$BK$13=\"!error\",BY42=\"!error\"),\"!error\",IF(BV42=\"NA\",\"NA\",IF(AND(ISNUMBER(BY42),BY42=0),0,IF(AND(ISNUMBER($BK$12),ISNUMBER($BK$13),ISNUMBER(BY42)),$BK$13*$BK$12/BY42,IF(BY42=\"ND\",\"ND\",\"missing\")))))))","v":""},{"$f":"IF(BV42=\"\",\"\",IF(BV42=\"NA\",\"NA\",IF(ISBLANK($F47),\"missing\",IF(OR(ISNUMBER($F47),$F47=\"ND\"),$F47,\"!error\"))))","v":""},{"$f":"IF(BV42=\"\",\"\",IF(BV42=\"NA\",\"NA\",IF(ISBLANK($G47),\"missing\",IF(OR(AND(ISNUMBER($G47),$G47>=0,$G47<=14),$G47=\"ND\"),$G47,\"!error\"))))","v":""},"",{"$f":"IF(BV42=\"\",\"\",IF(AY42=0,\"NA\",IF(CX42=\"ND\",\"ND\",IF(OR($BN$12=\"!error\",BV42=\"!error\",AND(BV42=\"missing\",ISNUMBER(BX42)),IF(BW42=1,BX42=\"!error\",0),CA42=\"!error\",CB42=\"!error\"),\"!error\",IF(OR(BV42=\"NA\",AND(ISNUMBER($BN$12),$BN$12=0),AND(BW42<>0,ISNUMBER(CC42),CC42=0),AND(BW42=1,ISNUMBER(CB42),CB42>9),AND(BW42>1,ISNUMBER(CB42),OR(CB42<6,CB42>=9.5))),\"NA\",IF(AND(ISNUMBER($BN$12),BW42<>0,IF(BW42=1,ISNUMBER(BX42),1),ISNUMBER(CA42),ISNUMBER(CB42)),CT_Giardia(BW42,$BN$12,CA42,CB42,IF(BW42=1,BX42,)),IF(COUNTIF(BW42,\"<>0\")+COUNT(BX42,BY42,CA42,CB42)=5,\"!error\",\"missing\")))))))","v":""},{"$f":"IF(BV42=\"\",\"\",IF(OR(AY42=0,AND(ISNUMBER($BN$12),$BN$12=0)),\"NA\",IF(CX42=\"ND\",\"ND\",IF(OR(CC42=\"!error\",CD42=\"!error\",CF42=\"!error\"),\"!error\",IF(BV42=\"NA\",\"NA\",IF(CD42=\"NA\",0,IF(AND(ISNUMBER(CC42),ISNUMBER(CD42)),CC42/CD42,IF(AND(BW42=99,CF42=0.5),CF42/$BN$12,\"missing\"))))))))","v":""},{"$f":"IF(BV42=\"\",\"\",IF(AY42=0,\"NA\",IF(CX42=\"ND\",\"ND\",IF(OR(BV42=\"!error\",AND(BV42=\"missing\",ISNUMBER(BX42)),BX42=\"!error\",BZ42=\"!error\",CA42=\"!error\",CB42=\"!error\"),\"!error\",IF(BV42=\"NA\",\"NA\",IF(OR(AND(BW42<>0,ISNUMBER(CC42),CC42=0),AND(BW42=1,ISNUMBER(CB42),CB42>9),AND(BW42>1,ISNUMBER(CB42),OR(CB42<6,CB42>=9.5))),0,IF(AND(ISNUMBER($BN$12),BW42<>0,ISNUMBER(BX42),ISNUMBER(BZ42),ISNUMBER(CA42),ISNUMBER(CB42)),log_Giardia(BW42,$BN$12,CA42,CB42,BX42,BZ42),IF(COUNTIF(BW42,\"<>0\")+COUNT(BX42,BY42,CA42,CB42)=5,\"!error\",\"missing\"))))))))","v":""},{"$f":"IF(BV42=\"\",\"\",IF(AY42=0,\"NA\",IF(CX42=\"ND\",\"ND\",IF(OR($BP$12=\"!error\",BV42=\"!error\",AND(BV42=\"missing\",ISNUMBER(BX42)),CA42=\"!error\",CB42=\"!error\"),\"!error\",IF(OR(BV42=\"NA\",AND(ISNUMBER($BP$12),$BP$12=0),AND(BW42<>0,ISNUMBER(CC42),CC42=0),AND(BW42=1,ISNUMBER(CB42),OR(CB42<5.5,CB42>=10.5)),AND(OR(BW42=2,BW42=4),ISNUMBER(CB42),OR(CB42<6,CB42>=9.5)),AND(BW42=3,ISNUMBER(CB42),OR(CB42<6,CB42>9))),\"NA\",IF(AND(ISNUMBER($BP$12),BW42<>0,ISNUMBER(CA42),ISNUMBER(CB42)),CT_Virus(BW42,$BP$12,CA42,CB42),IF(COUNTIF(BW42,\"<>0\")+COUNT(BX42,BY42,CA42,CB42)=5,\"!error\",\"missing\")))))))","v":""},{"$f":"IF(BV42=\"\",\"\",IF(OR(AY42=0,AND(ISNUMBER($BP$12),$BP$12=0)),\"NA\",IF(CX42=\"ND\",\"ND\",IF(OR(CC42=\"!error\",CG42=\"!error\",CI42=\"!error\"),\"!error\",IF(BV42=\"NA\",\"NA\",IF(CG42=\"NA\",0,IF(AND(ISNUMBER(CC42),ISNUMBER(CG42)),CC42/CG42,IF(AND(BW42=99,CI42=1),CI42/$BP$12,\"missing\"))))))))","v":""},{"$f":"IF(BV42=\"\",\"\",IF(AY42=0,\"NA\",IF(CX42=\"ND\",\"ND\",IF(OR(BV42=\"!error\",AND(BV42=\"missing\",ISNUMBER(BX42)),BX42=\"!error\",BZ42=\"!error\",CA42=\"!error\",CB42=\"!error\"),\"!error\",IF(BV42=\"NA\",\"NA\",IF(OR(AND(BW42<>0,ISNUMBER(CC42),CC42=0),AND(BW42=1,ISNUMBER(CB42),OR(CB42<5.5,CB42>=10.5)),AND(OR(BW42=2,BW42=4),ISNUMBER(CB42),OR(CB42<6,CB42>=9.5)),AND(BW42=3,ISNUMBER(CB42),OR(CB42<6,CB42>9))),0,IF(AND(ISNUMBER($BP$12),BW42<>0,ISNUMBER(BX42),ISNUMBER(BZ42),ISNUMBER(CA42),ISNUMBER(CB42)),Log_Virus(BW42,$BP$12,CA42,CB42,BX42,BZ42),IF(COUNTIF(BW42,\"<>0\")+COUNT(BX42,BY42,CA42,CB42)=5,\"!error\",\"missing\"))))))))","v":""},null,null,null,null,null,null,null,null,null,null,null,null,null,"data","data"]
[null," ",{"$f":"$F$15","v":4},null,null,null,null,{"$f":"IF(BL43=\"!error\",\"!error\",$BK43)","v":""},"","","","",null,null,null,null,"",null,null,null,null,null,null,null,null,null,null,null,null,null,null,null,null,null,null,null,null,null,null,null,null,null,null,null,null,null,null,null,null,null,1,{"$f":"IF($BG$14=0,0,IF(COUNTIF(OFFSET($BD40,0,0,MIN($BG$14,5),1),\"<>NA\")+IF($BG$14>5,COUNTIF(OFFSET($BV40,0,0,$BG$14-5,1),\"<>NA\"),0),1,0))","v":1},{"$f":"IF($BG$14=0,0,IF(COUNTIF(OFFSET($BD40,0,0,MIN($BG$14,5),1),\"O3\")+COUNTIF(OFFSET($BD40,0,0,MIN($BG$14,5),1),\"O3 Cell 1\")+IF($BG$14>5,COUNTIF(OFFSET($BV40,0,0,$BG$14-5,1),\"O3\"),0)+IF($BG$14>5,COUNTIF(OFFSET($BV40,0,0,$BG$14-5,1),\"O3 Cell 1\"),0),1,0))","v":0},{"$f":"IF(OR($AY43=0,AND(COUNTA(D43,F43:G43)=0,COUNTIF(E43,0))),\"NA\",IF(COUNTA(D43:G43),IF(BA43,4,5),IF($BG$15=1,IF(BA43,4,IF(AZ43,5,6)),IF(BD43=\"!error\",IF(BA43,4,5),IF(BA43,\"5B\",6)))))","v":6},{"$f":"$BG$11","v":4},{"$f":"IF(AND(IF($BN$4=\"missing\",10,$BN$4)>=4,$AY43<>\"\"),IF(OR($AY43=0,AND($B43=\"NA\",COUNTA($D43,$F43:$G43)=0,COUNTIF($E43,0)),AND($B43=\"NA\",COUNTA($D43:$G43)=0,IF($BG$14=0,0,COUNTIF(OFFSET($BD40,0,0,MIN($BG$14,5),1),\"NA\")+IF($BG$14>5,COUNTIF(OFFSET($BV40,0,0,$BG$14-5,1),\"NA\"),0))=$BG$14),AND($B43=\"NA\",COUNTA($D43:$G43)=0,IF($BG$14<5,COUNTA(OFFSET($D40,$BG$14,0,MIN(5-$BG$14,$BG$15),4))-COUNTIF(OFFSET($E40,$BG$14,0,MIN(5-$BG$14,$BG$15),1),0),0)+IF($BG$14+$BG$15>5,COUNTA(OFFSET($D45,MAX($BG$14-5,0),0,MIN($BG$14+$BG$15-5,$BG$15),4))-COUNTIF(OFFSET($E45,MAX($BG$14-5,0),0,MIN($BG$14+$BG$15-5,$BG$15),1),0),0)),AND($B43=\"NA\",COUNTA($D43:$G43)=0,IF($BG$14<5,COUNTIF(OFFSET($B40,$BG$14,0,MIN(5-$BG$14,$BG$15),1),\"NA\"),0)+IF($BG$14+$BG$15>5,COUNTIF(OFFSET($B45,MAX($BG$14-5,0),0,MIN($BG$14+$BG$15-5,$BG$15),1),\"NA\"),0)<>$BG$15)),\"NA\",IF($B43=\"\",\"missing\",IF(AND($B43<>\"NA\",COUNTA($D43,$F43:$G43)+COUNTIF($E43,\"<>0\")),UPPER($B43),\"!error\"))),\"\")","v":""},"","","",{"$f":"IF(BD43=\"\",\"\",IF(AY43=0,\"NA\",IF(OR($BG$12=\"!error\",$BG$13=\"!error\",BG43=\"!error\"),\"!error\",IF(BD43=\"NA\",\"NA\",IF(AND(ISNUMBER(BG43),BG43=0),0,IF(AND(ISNUMBER($BG$12),ISNUMBER($BG$13),ISNUMBER(BG43)),$BG$13*$BG$12/BG43,IF(BG43=\"ND\",\"ND\",\"missing\")))))))","v":""},"","","",{"$f":"IF(BD43=\"\",\"\",IF(AY43=0,\"NA\",IF(CW43=\"ND\",\"ND\",IF(OR($BN$12=\"!error\",BD43=\"!error\",AND(BD43=\"missing\",ISNUMBER(BF43)),IF(BE43=1,BF43=\"!error\",0),BI43=\"!error\",BJ43=\"!error\"),\"!error\",IF(OR(BD43=\"NA\",AND(ISNUMBER($BN$12),$BN$12=0),AND(BE43<>0,ISNUMBER(BK43),BK43=0),AND(BE43=1,ISNUMBER(BJ43),BJ43>9),AND(BE43=2,ISNUMBER(BJ43),OR(BJ43<6,BJ43>=9.5)),AND(OR(BE43=3,BE43=4),ISNUMBER(BJ43),OR(BJ43<5.5,BJ43>=9.5))),\"NA\",IF(AND(ISNUMBER($BN$12),BE43<>0,IF(BE43=1,ISNUMBER(BF43),1),ISNUMBER(BI43),ISNUMBER(BJ43)),CT_Giardia(BE43,$BN$12,BI43,BJ43,IF(BE43=1,BF43,)),IF(COUNTIF(BE43,\"<>0\")+COUNT(BF43,BG43,BI43,BJ43)=5,\"!error\",\"missing\")))))))","v":""},{"$f":"IF(BD43=\"\",\"\",IF(OR(AY43=0,AND(ISNUMBER($BN$12),$BN$12=0)),\"NA\",IF(CW43=\"ND\",\"ND\",IF(OR(BK43=\"!error\",BL43=\"!error\",BN43=\"!error\"),\"!error\",IF(BD43=\"NA\",\"NA\",IF(BL43=\"NA\",0,IF(AND(BE43<>99,ISNUMBER(BK43),ISNUMBER(BL43)),BK43/BL43,IF(AND(BE43=99,BN43=0.5),BN43/$BN$12,\"missing\"))))))))","v":""},{"$f":"IF(BD43=\"\",\"\",IF(AY43=0,\"NA\",IF(CW43=\"ND\",\"ND\",IF(OR(BD43=\"!error\",AND(BD43=\"missing\",ISNUMBER(BF43)),BF43=\"!error\",BH43=\"!error\",BI43=\"!error\",BJ43=\"!error\"),\"!error\",IF(BD43=\"NA\",\"NA\",IF(OR(AND(BE43<>0,ISNUMBER(BK43),BK43=0),AND(BE43=1,ISNUMBER(BJ43),BJ43>9),AND(BE43=2,ISNUMBER(BJ43),OR(BJ43<6,BJ43>=9.5)),AND(OR(BE43=3,BE43=4),ISNUMBER(BJ43),OR(BJ43<5.5,BJ43>=9.5))),0,IF(AND(ISNUMBER($BN$12),BE43<>0,ISNUMBER(BF43),ISNUMBER(BH43),ISNUMBER(BI43),ISNUMBER(BJ43)),log_Giardia(BE43,$BN$12,BI43,BJ43,BF43,BH43),IF(COUNTIF(BE43,\"<>0\")+COUNT(BF43,BG43,BI43,BJ43)=5,\"!error\",\"missing\"))))))))","v":""},{"$f":"IF(BD43=\"\",\"\",IF(AY43=0,\"NA\",IF(CW43=\"ND\",\"ND\",IF(OR($BP$12=\"!error\",BD43=\"!error\",AND(BD43=\"missing\",ISNUMBER(BF43)),BI43=\"!error\",BJ43=\"!error\"),\"!error\",IF(OR(BD43=\"NA\",AND(ISNUMBER($BP$12),$BP$12=0),AND(BE43<>0,ISNUMBER(BK43),BK43=0),AND(BE43=1,ISNUMBER(BJ43),BJ43>=10.5),AND(BE43=2,ISNUMBER(BJ43),OR(BJ43<6,BJ43>=9.5)),AND(BE43=3,ISNUMBER(BJ43),OR(BJ43<6,BJ43>9)),AND(BE43=4,ISNUMBER(BJ43),OR(BJ43<6,BJ43>10))),\"NA\",IF(AND(ISNUMBER($BP$12),BE43<>0,ISNUMBER(BI43),ISNUMBER(BJ43)),CT_Virus(BE43,$BP$12,BI43,BJ43),IF(COUNTIF(BE43,\"<>0\")+COUNT(BF43,BG43,BI43,BJ43)=5,\"!error\",\"missing\")))))))","v":""},{"$f":"IF(BD43=\"\",\"\",IF(OR(AY43=0,AND(ISNUMBER($BP$12),$BP$12=0)),\"NA\",IF(CW43=\"ND\",\"ND\",IF(OR(BK43=\"!error\",BO43=\"!error\",BQ43=\"!error\"),\"!error\",IF(BD43=\"NA\",\"NA\",IF(BO43=\"NA\",0,IF(AND(BE43<>99,ISNUMBER(BK43),ISNUMBER(BO43)),BK43/BO43,IF(AND(BE43=99,BQ43=1),BQ43/$BP$12,\"missing\"))))))))","v":""},{"$f":"IF(BD43=\"\",\"\",IF(AY43=0,\"NA\",IF(CW43=\"ND\",\"ND\",IF(OR(BD43=\"!error\",AND(BD43=\"missing\",ISNUMBER(BF43)),BF43=\"!error\",BH43=\"!error\",BI43=\"!error\",BJ43=\"!error\"),\"!error\",IF(BD43=\"NA\",\"NA\",IF(OR(AND(BE43<>0,ISNUMBER(BK43),BK43=0),AND(BE43=1,ISNUMBER(BJ43),BJ43>=10.5),AND(BE43=2,ISNUMBER(BJ43),OR(BJ43<6,BJ43>=9.5)),AND(BE43=3,ISNUMBER(BJ43),OR(BJ43<6,BJ43>9)),AND(BE43=4,ISNUMBER(BJ43),OR(BJ43<6,BJ43>10))),0,IF(AND(ISNUMBER($BP$12),BE43<>0,ISNUMBER(BF43),ISNUMBER(BH43),ISNUMBER(BI43),ISNUMBER(BJ43)),Log_Virus(BE43,$BP$12,BI43,BJ43,BF43,BH43),IF(COUNTIF(BE43,\"<>0\")+COUNT(BF43,BG43,BI43,BJ43)=5,\"!error\",\"missing\"))))))))","v":""},{"$f":"IF($BL$14=0,0,IF(COUNTIF(OFFSET($BD40,0,0,MIN($BL$14,5),1),\"<>NA\")+IF($BL$14>5,COUNTIF(OFFSET($BV40,0,0,$BL$14-5,1),\"<>NA\"),0),1,0))","v":1},{"$f":"IF($BL$14=0,0,IF(COUNTIF(OFFSET($BD40,0,0,MIN($BL$14,5),1),\"O3\")+COUNTIF(OFFSET($BD40,0,0,MIN($BL$14,5),1),\"O3 Cell 1\")+IF($BL$14>5,COUNTIF(OFFSET($BV40,0,0,$BL$14-5,1),\"O3\"),0)+IF($BL$14>5,COUNTIF(OFFSET($BV40,0,0,$BL$14-5,1),\"O3 Cell 1\"),0),1,0))","v":0},{"$f":"IF(OR($AY43=0,AND(COUNTA(D48,F48:G48)=0,COUNTIF(E48,0))),\"NA\",IF(COUNTA(D48:G48),IF(BS43,4,5),IF($BL$15=1,IF(BS43,4,IF(BR43,5,6)),IF(BV43=\"!error\",IF(BS43,4,5),IF(BS43,\"5B\",6)))))","v":6},{"$f":"$BL$11","v":9},{"$f":"IF(AND(IF($BN$4=\"missing\",10,$BN$4)>=9,$AY43<>\"\"),IF(OR($AY43=0,AND($B48=\"NA\",COUNTA($D48,$F48:$G48)=0,COUNTIF($E48,0)),AND($B48=\"NA\",COUNTA($D48:$G48)=0,IF($BL$14=0,0,COUNTIF(OFFSET($BD40,0,0,MIN($BL$14,5),1),\"NA\")+IF($BL$14>5,COUNTIF(OFFSET($BV40,0,0,$BL$14-5,1),\"NA\"),0))=$BL$14),AND($B48=\"NA\",COUNTA($D48:$G48)=0,IF($BL$14<5,COUNTA(OFFSET($D40,$BL$14,0,MIN(5-$BL$14,$BL$15),4))-COUNTIF(OFFSET($E40,$BL$14,0,MIN(5-$BL$14,$BL$15),1),0),0)+IF($BL$14+$BL$15>5,COUNTA(OFFSET($D45,MAX($BL$14-5,0),0,MIN($BL$14+$BL$15-5,$BL$15),4))-COUNTIF(OFFSET($E45,MAX($BL$14-5,0),0,MIN($BL$14+$BL$15-5,$BL$15),1),0),0)),AND($B48=\"NA\",COUNTA($D48:$G48)=0,IF($BL$14<5,COUNTIF(OFFSET($B40,$BL$14,0,MIN(5-$BL$14,$BL$15),1),\"NA\"),0)+IF($BL$14+$BL$15>5,COUNTIF(OFFSET($B45,MAX($BL$14-5,0),0,MIN($BL$14+$BL$15-5,$BL$15),1),\"NA\"),0)<>$BL$15)),\"NA\",IF($B48=\"\",\"missing\",IF(AND($B48<>\"NA\",COUNTA($D48,$F48:$G48)+COUNTIF($E48,\"<>0\")),UPPER($B48),\"!error\"))),\"\")","v":""},"",{"$f":"IF(BV43=\"\",\"\",IF(BV43=\"NA\",\"NA\",IF(ISBLANK($D48),\"missing\",IF(AND(BW43=1,ISNUMBER($D48),$D48>4),4,IF(AND(ISNUMBER($D48),$D48>=0),$D48,IF(AND(ISTEXT($D48),$D48=\"ND\"),\"ND\",\"!error\"))))))","v":""},{"$f":"IF(BV43=\"\",\"\",IF(BV43=\"NA\",\"NA\",IF(ISBLANK($E48),\"missing\",IF(OR(AND(ISBLANK($B48),COUNT(BX43,CA43:CB43)=0,ISNUMBER($E48),$E48=0),AND(ISNUMBER($E48),$E48>0),AND(ISTEXT($E48),$E48=\"ND\")),$E48,\"!error\"))))","v":""},{"$f":"IF(BV43=\"\",\"\",IF(AY43=0,\"NA\",IF(OR($BL$12=\"!error\",$BL$13=\"!error\",BY43=\"!error\"),\"!error\",IF(BV43=\"NA\",\"NA\",IF(AND(ISNUMBER(BY43),BY43=0),0,IF(AND(ISNUMBER($BL$12),ISNUMBER($BL$13),ISNUMBER(BY43)),$BL$13*$BL$12/BY43,IF(BY43=\"ND\",\"ND\",\"missing\")))))))","v":""},{"$f":"IF(BV43=\"\",\"\",IF(BV43=\"NA\",\"NA\",IF(ISBLANK($F48),\"missing\",IF(OR(ISNUMBER($F48),$F48=\"ND\"),$F48,\"!error\"))))","v":""},{"$f":"IF(BV43=\"\",\"\",IF(BV43=\"NA\",\"NA\",IF(ISBLANK($G48),\"missing\",IF(OR(AND(ISNUMBER($G48),$G48>=0,$G48<=14),$G48=\"ND\"),$G48,\"!error\"))))","v":""},"",{"$f":"IF(BV43=\"\",\"\",IF(AY43=0,\"NA\",IF(CX43=\"ND\",\"ND\",IF(OR($BN$12=\"!error\",BV43=\"!error\",AND(BV43=\"missing\",ISNUMBER(BX43)),IF(BW43=1,BX43=\"!error\",0),CA43=\"!error\",CB43=\"!error\"),\"!error\",IF(OR(BV43=\"NA\",AND(ISNUMBER($BN$12),$BN$12=0),AND(BW43<>0,ISNUMBER(CC43),CC43=0),AND(BW43=1,ISNUMBER(CB43),CB43>9),AND(BW43>1,ISNUMBER(CB43),OR(CB43<6,CB43>=9.5))),\"NA\",IF(AND(ISNUMBER($BN$12),BW43<>0,IF(BW43=1,ISNUMBER(BX43),1),ISNUMBER(CA43),ISNUMBER(CB43)),CT_Giardia(BW43,$BN$12,CA43,CB43,IF(BW43=1,BX43,)),IF(COUNTIF(BW43,\"<>0\")+COUNT(BX43,BY43,CA43,CB43)=5,\"!error\",\"missing\")))))))","v":""},{"$f":"IF(BV43=\"\",\"\",IF(OR(AY43=0,AND(ISNUMBER($BN$12),$BN$12=0)),\"NA\",IF(CX43=\"ND\",\"ND\",IF(OR(CC43=\"!error\",CD43=\"!error\",CF43=\"!error\"),\"!error\",IF(BV43=\"NA\",\"NA\",IF(CD43=\"NA\",0,IF(AND(ISNUMBER(CC43),ISNUMBER(CD43)),CC43/CD43,IF(AND(BW43=99,CF43=0.5),CF43/$BN$12,\"missing\"))))))))","v":""},{"$f":"IF(BV43=\"\",\"\",IF(AY43=0,\"NA\",IF(CX43=\"ND\",\"ND\",IF(OR(BV43=\"!error\",AND(BV43=\"missing\",ISNUMBER(BX43)),BX43=\"!error\",BZ43=\"!error\",CA43=\"!error\",CB43=\"!error\"),\"!error\",IF(BV43=\"NA\",\"NA\",IF(OR(AND(BW43<>0,ISNUMBER(CC43),CC43=0),AND(BW43=1,ISNUMBER(CB43),CB43>9),AND(BW43>1,ISNUMBER(CB43),OR(CB43<6,CB43>=9.5))),0,IF(AND(ISNUMBER($BN$12),BW43<>0,ISNUMBER(BX43),ISNUMBER(BZ43),ISNUMBER(CA43),ISNUMBER(CB43)),log_Giardia(BW43,$BN$12,CA43,CB43,BX43,BZ43),IF(COUNTIF(BW43,\"<>0\")+COUNT(BX43,BY43,CA43,CB43)=5,\"!error\",\"missing\"))))))))","v":""},{"$f":"IF(BV43=\"\",\"\",IF(AY43=0,\"NA\",IF(CX43=\"ND\",\"ND\",IF(OR($BP$12=\"!error\",BV43=\"!error\",AND(BV43=\"missing\",ISNUMBER(BX43)),CA43=\"!error\",CB43=\"!error\"),\"!error\",IF(OR(BV43=\"NA\",AND(ISNUMBER($BP$12),$BP$12=0),AND(BW43<>0,ISNUMBER(CC43),CC43=0),AND(BW43=1,ISNUMBER(CB43),OR(CB43<5.5,CB43>=10.5)),AND(OR(BW43=2,BW43=4),ISNUMBER(CB43),OR(CB43<6,CB43>=9.5)),AND(BW43=3,ISNUMBER(CB43),OR(CB43<6,CB43>9))),\"NA\",IF(AND(ISNUMBER($BP$12),BW43<>0,ISNUMBER(CA43),ISNUMBER(CB43)),CT_Virus(BW43,$BP$12,CA43,CB43),IF(COUNTIF(BW43,\"<>0\")+COUNT(BX43,BY43,CA43,CB43)=5,\"!error\",\"missing\")))))))","v":""},{"$f":"IF(BV43=\"\",\"\",IF(OR(AY43=0,AND(ISNUMBER($BP$12),$BP$12=0)),\"NA\",IF(CX43=\"ND\",\"ND\",IF(OR(CC43=\"!error\",CG43=\"!error\",CI43=\"!error\"),\"!error\",IF(BV43=\"NA\",\"NA\",IF(CG43=\"NA\",0,IF(AND(ISNUMBER(CC43),ISNUMBER(CG43)),CC43/CG43,IF(AND(BW43=99,CI43=1),CI43/$BP$12,\"missing\"))))))))","v":""},{"$f":"IF(BV43=\"\",\"\",IF(AY43=0,\"NA\",IF(CX43=\"ND\",\"ND\",IF(OR(BV43=\"!error\",AND(BV43=\"missing\",ISNUMBER(BX43)),BX43=\"!error\",BZ43=\"!error\",CA43=\"!error\",CB43=\"!error\"),\"!error\",IF(BV43=\"NA\",\"NA\",IF(OR(AND(BW43<>0,ISNUMBER(CC43),CC43=0),AND(BW43=1,ISNUMBER(CB43),OR(CB43<5.5,CB43>=10.5)),AND(OR(BW43=2,BW43=4),ISNUMBER(CB43),OR(CB43<6,CB43>=9.5)),AND(BW43=3,ISNUMBER(CB43),OR(CB43<6,CB43>9))),0,IF(AND(ISNUMBER($BP$12),BW43<>0,ISNUMBER(BX43),ISNUMBER(BZ43),ISNUMBER(CA43),ISNUMBER(CB43)),Log_Virus(BW43,$BP$12,CA43,CB43,BX43,BZ43),IF(COUNTIF(BW43,\"<>0\")+COUNT(BX43,BY43,CA43,CB43)=5,\"!error\",\"missing\"))))))))","v":""},null,null,null,null,null,null,null,null,null,null,null,null,null,"data","data"]
[null," ",{"$f":"$G$15","v":5},null,null,null,null,"","","","","",null,null,null,null,"",null,null,null,null,null,null,null,null,null,null,null,null,null,null,null,null,null,null,null,null,null,null,null,null,null,null,null,null,null,null,null,null,null,1,{"$f":"IF($BH$14=0,0,IF(COUNTIF(OFFSET($BD40,0,0,MIN($BH$14,5),1),\"<>NA\")+IF($BH$14>5,COUNTIF(OFFSET($BV40,0,0,$BH$14-5,1),\"<>NA\"),0),1,0))","v":1},{"$f":"IF($BH$14=0,0,IF(COUNTIF(OFFSET($BD40,0,0,MIN($BH$14,5),1),\"O3\")+COUNTIF(OFFSET($BD40,0,0,MIN($BH$14,5),1),\"O3 Cell 1\")+IF($BH$14>5,COUNTIF(OFFSET($BV40,0,0,$BH$14-5,1),\"O3\"),0)+IF($BH$14>5,COUNTIF(OFFSET($BV40,0,0,$BH$14-5,1),\"O3 Cell 1\"),0),1,0))","v":0},{"$f":"IF(OR($AY44=0,AND(COUNTA(D44,F44:G44)=0,COUNTIF(E44,0))),\"NA\",IF(COUNTA(D44:G44),IF(BA44,4,5),IF($BH$15=1,IF(BA44,4,IF(AZ44,5,6)),IF(BD44=\"!error\",IF(BA44,4,5),IF(BA44,\"5B\",6)))))","v":6},{"$f":"$BH$11","v":5},{"$f":"IF(AND(IF($BN$4=\"missing\",10,$BN$4)>=5,$AY44<>\"\"),IF(OR($AY44=0,AND($B44=\"NA\",COUNTA($D44,$F44:$G44)=0,COUNTIF($E44,0)),AND($B44=\"NA\",COUNTA($D44:$G44)=0,IF($BH$14=0,0,COUNTIF(OFFSET($BD40,0,0,MIN($BH$14,5),1),\"NA\")+IF($BH$14>5,COUNTIF(OFFSET($BV40,0,0,$BH$14-5,1),\"NA\"),0))=$BH$14),AND($B44=\"NA\",COUNTA($D44:$G44)=0,IF($BH$14<5,COUNTA(OFFSET($D40,$BH$14,0,MIN(5-$BH$14,$BH$15),4))-COUNTIF(OFFSET($E40,$BH$14,0,MIN(5-$BH$14,$BH$15),1),0),0)+IF($BH$14+$BH$15>5,COUNTA(OFFSET($D45,MAX($BH$14-5,0),0,MIN($BH$14+$BH$15-5,$BH$15),4))-COUNTIF(OFFSET($E45,MAX($BH$14-5,0),0,MIN($BH$14+$BH$15-5,$BH$15),1),0),0)),AND($B44=\"NA\",COUNTA($D44:$G44)=0,IF($BH$14<5,COUNTIF(OFFSET($B40,$BH$14,0,MIN(5-$BH$14,$BH$15),1),\"NA\"),0)+IF($BH$14+$BH$15>5,COUNTIF(OFFSET($B45,MAX($BH$14-5,0),0,MIN($BH$14+$BH$15-5,$BH$15),1),\"NA\"),0)<>$BH$15)),\"NA\",IF($B44=\"\",\"missing\",IF(AND($B44<>\"NA\",COUNTA($D44,$F44:$G44)+COUNTIF($E44,\"<>0\")),UPPER($B44),\"!error\"))),\"\")","v":""},"","","",{"$f":"IF(BD44=\"\",\"\",IF(AY44=0,\"NA\",IF(OR($BH$12=\"!error\",$BH$13=\"!error\",BG44=\"!error\"),\"!error\",IF(BD44=\"NA\",\"NA\",IF(AND(ISNUMBER(BG44),BG44=0),0,IF(AND(ISNUMBER($BH$12),ISNUMBER($BH$13),ISNUMBER(BG44)),$BH$13*$BH$12/BG44,IF(BG44=\"ND\",\"ND\",\"missing\")))))))","v":""},"","","",{"$f":"IF(BD44=\"\",\"\",IF(AY44=0,\"NA\",IF(CW44=\"ND\",\"ND\",IF(OR($BN$12=\"!error\",BD44=\"!error\",AND(BD44=\"missing\",ISNUMBER(BF44)),IF(BE44=1,BF44=\"!error\",0),BI44=\"!error\",BJ44=\"!error\"),\"!error\",IF(OR(BD44=\"NA\",AND(ISNUMBER($BN$12),$BN$12=0),AND(BE44<>0,ISNUMBER(BK44),BK44=0),AND(BE44=1,ISNUMBER(BJ44),BJ44>9),AND(BE44=2,ISNUMBER(BJ44),OR(BJ44<6,BJ44>=9.5)),AND(OR(BE44=3,BE44=4),ISNUMBER(BJ44),OR(BJ44<5.5,BJ44>=9.5))),\"NA\",IF(AND(ISNUMBER($BN$12),BE44<>0,IF(BE44=1,ISNUMBER(BF44),1),ISNUMBER(BI44),ISNUMBER(BJ44)),CT_Giardia(BE44,$BN$12,BI44,BJ44,IF(BE44=1,BF44,)),IF(COUNTIF(BE44,\"<>0\")+COUNT(BF44,BG44,BI44,BJ44)=5,\"!error\",\"missing\")))))))","v":""},{"$f":"IF(BD44=\"\",\"\",IF(OR(AY44=0,AND(ISNUMBER($BN$12),$BN$12=0)),\"NA\",IF(CW44=\"ND\",\"ND\",IF(OR(BK44=\"!error\",BL44=\"!error\",BN44=\"!error\"),\"!error\",IF(BD44=\"NA\",\"NA\",IF(BL44=\"NA\",0,IF(AND(BE44<>99,ISNUMBER(BK44),ISNUMBER(BL44)),BK44/BL44,IF(AND(BE44=99,BN44=0.5),BN44/$BN$12,\"missing\"))))))))","v":""},{"$f":"IF(BD44=\"\",\"\",IF(AY44=0,\"NA\",IF(CW44=\"ND\",\"ND\",IF(OR(BD44=\"!error\",AND(BD44=\"missing\",ISNUMBER(BF44)),BF44=\"!error\",BH44=\"!error\",BI44=\"!error\",BJ44=\"!error\"),\"!error\",IF(BD44=\"NA\",\"NA\",IF(OR(AND(BE44<>0,ISNUMBER(BK44),BK44=0),AND(BE44=1,ISNUMBER(BJ44),BJ44>9),AND(BE44=2,ISNUMBER(BJ44),OR(BJ44<6,BJ44>=9.5)),AND(OR(BE44=3,BE44=4),ISNUMBER(BJ44),OR(BJ44<5.5,BJ44>=9.5))),0,IF(AND(ISNUMBER($BN$12),BE44<>0,ISNUMBER(BF44),ISNUMBER(BH44),ISNUMBER(BI44),ISNUMBER(BJ44)),log_Giardia(BE44,$BN$12,BI44,BJ44,BF44,BH44),IF(COUNTIF(BE44,\"<>0\")+COUNT(BF44,BG44,BI44,BJ44)=5,\"!error\",\"missing\"))))))))","v":""},{"$f":"IF(BD44=\"\",\"\",IF(AY44=0,\"NA\",IF(CW44=\"ND\",\"ND\",IF(OR($BP$12=\"!error\",BD44=\"!error\",AND(BD44=\"missing\",ISNUMBER(BF44)),BI44=\"!error\",BJ44=\"!error\"),\"!error\",IF(OR(BD44=\"NA\",AND(ISNUMBER($BP$12),$BP$12=0),AND(BE44<>0,ISNUMBER(BK44),BK44=0),AND(BE44=1,ISNUMBER(BJ44),BJ44>=10.5),AND(BE44=2,ISNUMBER(BJ44),OR(BJ44<6,BJ44>=9.5)),AND(BE44=3,ISNUMBER(BJ44),OR(BJ44<6,BJ44>9)),AND(BE44=4,ISNUMBER(BJ44),OR(BJ44<6,BJ44>10))),\"NA\",IF(AND(ISNUMBER($BP$12),BE44<>0,ISNUMBER(BI44),ISNUMBER(BJ44)),CT_Virus(BE44,$BP$12,BI44,BJ44),IF(COUNTIF(BE44,\"<>0\")+COUNT(BF44,BG44,BI44,BJ44)=5,\"!error\",\"missing\")))))))","v":""},{"$f":"IF(BD44=\"\",\"\",IF(OR(AY44=0,AND(ISNUMBER($BP$12),$BP$12=0)),\"NA\",IF(CW44=\"ND\",\"ND\",IF(OR(BK44=\"!error\",BO44=\"!error\",BQ44=\"!error\"),\"!error\",IF(BD44=\"NA\",\"NA\",IF(BO44=\"NA\",0,IF(AND(BE44<>99,ISNUMBER(BK44),ISNUMBER(BO44)),BK44/BO44,IF(AND(BE44=99,BQ44=1),BQ44/$BP$12,\"missing\"))))))))","v":""},{"$f":"IF(BD44=\"\",\"\",IF(AY44=0,\"NA\",IF(CW44=\"ND\",\"ND\",IF(OR(BD44=\"!error\",AND(BD44=\"missing\",ISNUMBER(BF44)),BF44=\"!error\",BH44=\"!error\",BI44=\"!error\",BJ44=\"!error\"),\"!error\",IF(BD44=\"NA\",\"NA\",IF(OR(AND(BE44<>0,ISNUMBER(BK44),BK44=0),AND(BE44=1,ISNUMBER(BJ44),BJ44>=10.5),AND(BE44=2,ISNUMBER(BJ44),OR(BJ44<6,BJ44>=9.5)),AND(BE44=3,ISNUMBER(BJ44),OR(BJ44<6,BJ44>9)),AND(BE44=4,ISNUMBER(BJ44),OR(BJ44<6,BJ44>10))),0,IF(AND(ISNUMBER($BP$12),BE44<>0,ISNUMBER(BF44),ISNUMBER(BH44),ISNUMBER(BI44),ISNUMBER(BJ44)),Log_Virus(BE44,$BP$12,BI44,BJ44,BF44,BH44),IF(COUNTIF(BE44,\"<>0\")+COUNT(BF44,BG44,BI44,BJ44)=5,\"!error\",\"missing\"))))))))","v":""},{"$f":"IF($BM$14=0,0,IF(COUNTIF(OFFSET($BD40,0,0,MIN($BM$14,5),1),\"<>NA\")+IF($BM$14>5,COUNTIF(OFFSET($BV40,0,0,$BM$14-5,1),\"<>NA\"),0),1,0))","v":1},{"$f":"IF($BK$14=0,0,IF(COUNTIF(OFFSET($BD40,0,0,MIN($BK$14,5),1),\"O3\")+COUNTIF(OFFSET($BD40,0,0,MIN($BK$14,5),1),\"O3 Cell 1\")+IF($BK$14>5,COUNTIF(OFFSET($BV40,0,0,$BK$14-5,1),\"O3\"),0)+IF($BK$14>5,COUNTIF(OFFSET($BV40,0,0,$BK$14-5,1),\"O3 Cell 1\"),0),1,0))","v":0},{"$f":"IF(OR($AY44=0,AND(COUNTA(D49,F49:G49)=0,COUNTIF(E49,0))),\"NA\",IF(COUNTA(D49:G49),IF(BS44,4,5),IF($BM$15=1,IF(BS44,4,IF(BR44,5,6)),IF(BV44=\"!error\",IF(BS44,4,5),IF(BS44,\"5B\",6)))))","v":6},{"$f":"$BM$11","v":10},{"$f":"IF(AND(IF($BN$4=\"missing\",10,$BN$4)>=10,$AY44<>\"\"),IF(OR($AY44=0,AND($B49=\"NA\",COUNTA($D49,$F49:$G49)=0,COUNTIF($E49,0)),AND($B49=\"NA\",COUNTA($D49:$G49)=0,IF($BM$14=0,0,COUNTIF(OFFSET($BD40,0,0,MIN($BM$14,5),1),\"NA\")+IF($BM$14>5,COUNTIF(OFFSET($BV40,0,0,$BM$14-5,1),\"NA\"),0))=$BM$14),AND($B49=\"NA\",COUNTA($D49:$G49)=0,IF($BM$14<5,COUNTA(OFFSET($D40,$BM$14,0,MIN(5-$BM$14,$BM$15),4))-COUNTIF(OFFSET($E40,$BM$14,0,MIN(5-$BM$14,$BM$15),1),0),0)+IF($BM$14+$BM$15>5,COUNTA(OFFSET($D45,MAX($BM$14-5,0),0,MIN($BM$14+$BM$15-5,$BM$15),4))-COUNTIF(OFFSET($E45,MAX($BM$14-5,0),0,MIN($BM$14+$BM$15-5,$BM$15),1),0),0)),AND($B49=\"NA\",COUNTA($D49:$G49)=0,IF($BM$14<5,COUNTIF(OFFSET($B40,$BM$14,0,MIN(5-$BM$14,$BM$15),1),\"NA\"),0)+IF($BM$14+$BM$15>5,COUNTIF(OFFSET($B45,MAX($BM$14-5,0),0,MIN($BM$14+$BM$15-5,$BM$15),1),\"NA\"),0)<>$BM$15)),\"NA\",IF($B49=\"\",\"missing\",IF(AND($B49<>\"NA\",COUNTA($D49,$F49:$G49)+COUNTIF($E49,\"<>0\")),UPPER($B49),\"!error\"))),\"\")","v":""},"",{"$f":"IF(BV44=\"\",\"\",IF(BV44=\"NA\",\"NA\",IF(ISBLANK($D49),\"missing\",IF(AND(BW44=1,ISNUMBER($D49),$D49>4),4,IF(AND(ISNUMBER($D49),$D49>=0),$D49,IF(AND(ISTEXT($D49),$D49=\"ND\"),\"ND\",\"!error\"))))))","v":""},{"$f":"IF(BV44=\"\",\"\",IF(BV44=\"NA\",\"NA\",IF(ISBLANK($E49),\"missing\",IF(OR(AND(ISBLANK($B49),COUNT(BX44,CA44:CB44)=0,ISNUMBER($E49),$E49=0),AND(ISNUMBER($E49),$E49>0),AND(ISTEXT($E49),$E49=\"ND\")),$E49,\"!error\"))))","v":""},{"$f":"IF(BV44=\"\",\"\",IF(AY44=0,\"NA\",IF(OR($BM$12=\"!error\",$BM$13=\"!error\",BY44=\"!error\"),\"!error\",IF(BV44=\"NA\",\"NA\",IF(AND(ISNUMBER(BY44),BY44=0),0,IF(AND(ISNUMBER($BM$12),ISNUMBER($BM$13),ISNUMBER(BY44)),$BM$13*$BM$12/BY44,IF(BY44=\"ND\",\"ND\",\"missing\")))))))","v":""},{"$f":"IF(BV44=\"\",\"\",IF(BV44=\"NA\",\"NA\",IF(ISBLANK($F49),\"missing\",IF(OR(ISNUMBER($F49),$F49=\"ND\"),$F49,\"!error\"))))","v":""},{"$f":"IF(BV44=\"\",\"\",IF(BV44=\"NA\",\"NA\",IF(ISBLANK($G49),\"missing\",IF(OR(AND(ISNUMBER($G49),$G49>=0,$G49<=14),$G49=\"ND\"),$G49,\"!error\"))))","v":""},"",{"$f":"IF(BV44=\"\",\"\",IF(AY44=0,\"NA\",IF(CX44=\"ND\",\"ND\",IF(OR($BN$12=\"!error\",BV44=\"!error\",AND(BV44=\"missing\",ISNUMBER(BX44)),IF(BW44=1,BX44=\"!error\",0),CA44=\"!error\",CB44=\"!error\"),\"!error\",IF(OR(BV44=\"NA\",AND(ISNUMBER($BN$12),$BN$12=0),AND(BW44<>0,ISNUMBER(CC44),CC44=0),AND(BW44=1,ISNUMBER(CB44),CB44>9),AND(BW44>1,ISNUMBER(CB44),OR(CB44<6,CB44>=9.5))),\"NA\",IF(AND(ISNUMBER($BN$12),BW44<>0,IF(BW44=1,ISNUMBER(BX44),1),ISNUMBER(CA44),ISNUMBER(CB44)),CT_Giardia(BW44,$BN$12,CA44,CB44,IF(BW44=1,BX44,)),IF(COUNTIF(BW44,\"<>0\")+COUNT(BX44,BY44,CA44,CB44)=5,\"!error\",\"missing\")))))))","v":""},{"$f":"IF(BV44=\"\",\"\",IF(OR(AY44=0,AND(ISNUMBER($BN$12),$BN$12=0)),\"NA\",IF(CX44=\"ND\",\"ND\",IF(OR(CC44=\"!error\",CD44=\"!error\",CF44=\"!error\"),\"!error\",IF(BV44=\"NA\",\"NA\",IF(CD44=\"NA\",0,IF(AND(ISNUMBER(CC44),ISNUMBER(CD44)),CC44/CD44,IF(AND(BW44=99,CF44=0.5),CF44/$BN$12,\"missing\"))))))))","v":""},{"$f":"IF(BV44=\"\",\"\",IF(AY44=0,\"NA\",IF(CX44=\"ND\",\"ND\",IF(OR(BV44=\"!error\",AND(BV44=\"missing\",ISNUMBER(BX44)),BX44=\"!error\",BZ44=\"!error\",CA44=\"!error\",CB44=\"!error\"),\"!error\",IF(BV44=\"NA\",\"NA\",IF(OR(AND(BW44<>0,ISNUMBER(CC44),CC44=0),AND(BW44=1,ISNUMBER(CB44),CB44>9),AND(BW44>1,ISNUMBER(CB44),OR(CB44<6,CB44>=9.5))),0,IF(AND(ISNUMBER($BN$12),BW44<>0,ISNUMBER(BX44),ISNUMBER(BZ44),ISNUMBER(CA44),ISNUMBER(CB44)),log_Giardia(BW44,$BN$12,CA44,CB44,BX44,BZ44),IF(COUNTIF(BW44,\"<>0\")+COUNT(BX44,BY44,CA44,CB44)=5,\"!error\",\"missing\"))))))))","v":""},{"$f":"IF(BV44=\"\",\"\",IF(AY44=0,\"NA\",IF(CX44=\"ND\",\"ND\",IF(OR($BP$12=\"!error\",BV44=\"!error\",AND(BV44=\"missing\",ISNUMBER(BX44)),CA44=\"!error\",CB44=\"!error\"),\"!error\",IF(OR(BV44=\"NA\",AND(ISNUMBER($BP$12),$BP$12=0),AND(BW44<>0,ISNUMBER(CC44),CC44=0),AND(BW44=1,ISNUMBER(CB44),OR(CB44<5.5,CB44>=10.5)),AND(OR(BW44=2,BW44=4),ISNUMBER(CB44),OR(CB44<6,CB44>=9.5)),AND(BW44=3,ISNUMBER(CB44),OR(CB44<6,CB44>9))),\"NA\",IF(AND(ISNUMBER($BP$12),BW44<>0,ISNUMBER(CA44),ISNUMBER(CB44)),CT_Virus(BW44,$BP$12,CA44,CB44),IF(COUNTIF(BW44,\"<>0\")+COUNT(BX44,BY44,CA44,CB44)=5,\"!error\",\"missing\")))))))","v":""},{"$f":"IF(BV44=\"\",\"\",IF(OR(AY44=0,AND(ISNUMBER($BP$12),$BP$12=0)),\"NA\",IF(CX44=\"ND\",\"ND\",IF(OR(CC44=\"!error\",CG44=\"!error\",CI44=\"!error\"),\"!error\",IF(BV44=\"NA\",\"NA\",IF(CG44=\"NA\",0,IF(AND(ISNUMBER(CC44),ISNUMBER(CG44)),CC44/CG44,IF(AND(BW44=99,CI44=1),CI44/$BP$12,\"missing\"))))))))","v":""},{"$f":"IF(BV44=\"\",\"\",IF(AY44=0,\"NA\",IF(CX44=\"ND\",\"ND\",IF(OR(BV44=\"!error\",AND(BV44=\"missing\",ISNUMBER(BX44)),BX44=\"!error\",BZ44=\"!error\",CA44=\"!error\",CB44=\"!error\"),\"!error\",IF(BV44=\"NA\",\"NA\",IF(OR(AND(BW44<>0,ISNUMBER(CC44),CC44=0),AND(BW44=1,ISNUMBER(CB44),OR(CB44<5.5,CB44>=10.5)),AND(OR(BW44=2,BW44=4),ISNUMBER(CB44),OR(CB44<6,CB44>=9.5)),AND(BW44=3,ISNUMBER(CB44),OR(CB44<6,CB44>9))),0,IF(AND(ISNUMBER($BP$12),BW44<>0,ISNUMBER(BX44),ISNUMBER(BZ44),ISNUMBER(CA44),ISNUMBER(CB44)),Log_Virus(BW44,$BP$12,CA44,CB44,BX44,BZ44),IF(COUNTIF(BW44,\"<>0\")+COUNT(BX44,BY44,CA44,CB44)=5,\"!error\",\"missing\"))))))))","v":""},null,null,null,null,null,null,null,null,null,null,null,null,null,{"$f":"IF(OR(BF44=\"ND\",BG44=\"ND\",BI44=\"ND\",BJ44=\"ND\"),\"ND\",\"data\")","v":"data"},{"$f":"IF(OR(BX44=\"ND\",BY44=\"ND\",CA44=\"ND\",CB44=\"ND\"),\"ND\",\"data\")","v":"data"}]
[null," ",{"$f":"$H$15","v":6},null,null,null,null,{"$f":"IF($CD40=\"!error\",\"!error\",$CC40)","v":""},{"$f":"$CD40","v":""},{"$f":"$CG40","v":""},{"$f":"$CF40","v":""},{"$f":"$CI40","v":""},null,null,null,null,{"$f":"IF(AND(BW40=1,D45>4,D45<>\"ND\"),\"Note: The inactivation credit in zone D\" & C45 & \" was restricted due to elevated free chlorine levels.\",\"\")","v":""},null,null,null,null,null,null,null,null,null,null,null,null,null,null,null,null,null,null,null,null,null,null,null,null,null,null,null,null,null,null,null,null,null,null,null,null,null,null,null,null,null,null,null,null,null,null,null,null,null,null,null,null,null,null,null,null,null,null,null,null,null,null,null,null,null,null,null,null,null,null,null," Not representative of total log inactivation for all disinfection zones."]
[null," ",{"$f":"$I$15","v":7},null,null,null,null,{"$f":"IF($CD41=\"!error\",\"!error\",$CC41)","v":""},{"$f":"$CD41","v":""},{"$f":"$CG41","v":""},{"$f":"$CF41","v":""},{"$f":"$CI41","v":""},null,null,null,null,{"$f":"IF(AND(BW41=1,D46>4,D46<>\"ND\"),\"Note: The inactivation credit in zone D\" & C46 & \" was restricted due to elevated free chlorine levels.\",\"\")","v":""},null,null,null,null,null,null,null,null,null,null,null,null,null,null,null,null,null,null,null,null,null,null,null,null,null,null,null,null,null,null,null,null,null,null,null,null,null,null,null,null,null,null,null,null,null,null,null,null,null,null,null,null,null,null,null,null,null,null,null,null,null,null,null,null,null,null,null,null,null,null,null,null,null,{"$f":"CL40=\"\"","v":true},null,null,null,{"$f":"CP40=\"\"","v":true}]
[null," ",{"$f":"$J$15","v":8},null,null,null,null,"",{"$f":"$CD42","v":""},{"$f":"$CG42","v":""},{"$f":"$CF42","v":""},{"$f":"$CI42","v":""},null,null,null,null,""]
[null," ",{"$f":"$K$15","v":9},null,null,null,null,"",{"$f":"$CD43","v":""},{"$f":"$CG43","v":""},{"$f":"$CF43","v":""},{"$f":"$CI43","v":""},null,null,null,null,""]
[null," ",{"$f":"$L$15","v":10},null,null,null,null,{"$f":"IF($CC44=\"!error\",\"!error\",$CC44)","v":""},{"$f":"$CD44","v":""},{"$f":"$CG44","v":""},{"$f":"$CF44","v":""},{"$f":"$CI44","v":""},null,null,null,null,""]
[]
[null,null,null,null,null,"DISINFECTION PROCESS DATA "]
[null,"DATE:",null,null,null,{"$f":"OR(AND(COUNTA(D56:G65)=0,C52=\"\"),IsDate(C52))","v":true},"TIME:",null,null,null,null,"Operator Initials:"]
[null,"INDIVIDUAL DISINFECTION ZONES",null,null,null,null,null,null,null,null,null,null,"PLANT TOTAL",null,null,null,null,null,null,null,null,null,null,null,null,null,null,null,null,null,null,null,null,null,null,null,null,null,null,null,null,null,null,null,null,null,null,null,null,"PUMPAGE",null,null,null,null,{"$f":"\"DISINFECTION ZONES  ( D\"&$BD$11&\" - D\"&$BH$11&\" )\"","v":"DISINFECTION ZONES  ( D1 - D5 )"},null,null,null,null,null,null,null,null,null,null,null,null,null,null,null,null,null,{"$f":"\"DISINFECTION ZONES  ( D\"&$BI$11&\" - D\"&$BM$11&\" )\"","v":"DISINFECTION ZONES  ( D6 - D10 )"},null,null,null,null,null,null,null,null,null,null,null,null,null,null,null,"DAILY DISINFECTION DATA SUMMARY"]
[null,null,null,"C","Flow","Temp",null,null,"Giardia","Virus","Giardia","Virus","Giardia","Virus","Inact.",null,null,null,null,null,null,null,null,null,null,null,null,null,null,null,null,null,null,null,null,null,null,null,null,null,null,null,null,null,null,null,null,null,null,null,"RAW",null,null,null,null,null,null,null,null,null,null,null,null,"GIARDIA","GIARDIA","GIARDIA","VIRUS","VIRUS","VIRUS",null,null,null,null,null,null,null,null,null,null,null,null,"GIARDIA","GIARDIA","GIARDIA","VIRUS","VIRUS","VIRUS",null,"GIARDIA",null,"GIARDIA",null,"VIRUS",null,"VIRUS",null,"MINIMUM",null,null,null,"NO DATA"]
[null,"Disinfectant",null,"(mg/L)","(MGD)","(oC)","pH","CTCALC","CTREQD","CTREQD","Log","Log","Log","Log","Ratio",null,null,null,null,null,null,null,null,null,null,null,null,null,null,null,null,null,null,null,null,null,null,null,null,null,null,null,null,null,null,null,null,null,null,"DATE","WATER",null,null,"AT LEAST ONE PRECEDING ZONE <> \"NA\"","DISINFECTANT",null,null,"C","FLOW","T10","TEMP","pH","CTACTUAL","CTREQD","INACT. RATIO","LOG","CTREQD","INACT. RATIO","LOG",null,null,null,"DISINFECTANT",null,null,"C","FLOW","T10","TEMP","pH","CTACTUAL","CTREQD","INACT. RATIO","LOG","CTREQD","INACT. RATIO","LOG",null,"LOG",null,"INACT. RATIO",null,"LOG",null,"INACT. RATIO",null,"INACT. RATIO",null,null,null,{"$f":"\"D\"&$BD$11&\" - D\"&$BH$11","v":"D1 - D5"},{"$f":"\"D\"&$BI$11&\" - D\"&$BM$11","v":"D6 - D10"}]
[null,null,{"$f":"$C$15","v":1},null,null,null,null,{"$f":"IF(BL56=\"!error\",\"!error\",$BK56)","v":"missing"},{"$f":"$BL56","v":"missing"},{"$f":"$BO56","v":"missing"},{"$f":"$BN56","v":"missing"},{"$f":"$BQ56","v":"missing"},{"$f":"IF($CK56=\"\",\"\",IF($CK56=\"NA\",\"NA\",IF($CK56=\"!error\",-99,IF(COUNTIF(CW56:CX60,\"ND\")=$BN$4,\"MD\",IF(ISNUMBER($CK56),FIXED($CK56,2)&IF($CL56=\"*\",\"*\",\" \"),\"\")))))","v":""},{"$f":"IF($CO56=\"\",\"\",IF($CO56=\"NA\",\"NA \",IF($CO56=\"!error\",-99,IF(COUNTIF(CW56:CX60,\"ND\")=$BN$4,\"MD\",IF(ISNUMBER($CO56),FIXED($CO56,2)&IF($CP56=\"*\",\"*\",\" \"),\"\")))))","v":""},{"$f":"IF($CS56=\"\",\"\",IF($CS56=\"NA\",\"NA\",IF($CS56=\"!error\",-99,IF(AND($CW56=\"ND\",$CW57=\"ND\",$CW58=\"ND\",$CW59=\"ND\",$CW60=\"ND\",$CX56=\"ND\",$CX57=\"ND\",$CX58=\"ND\",$CX59=\"ND\",$CX60=\"ND\"),\"ND\",IF(ISNUMBER($CS56),$CS56,\"\")))))","v":""},null,{"$f":"IF(AND(BE56=1,D56>4,D56<>\"ND\"),\"Note: The inactivation credit in zone D\" & C56 & \" was restricted due to elevated free chlorine levels.\",\"\")","v":""},null,null,null,null,null,null,null,null,null,null,null,null,null,null,null,null,null,null,null,null,null,null,null,null,null,null,null,null,null,null,null,null,1,1,{"$f":"IF($BD$14=0,0,IF(COUNTIF(OFFSET($BD56,0,0,MIN($BD$14,5),1),\"<>NA\")+IF($BD$14>5,COUNTIF(OFFSET($BV56,0,0,$BD$14-5,1),\"<>NA\"),0),1,0))","v":0},{"$f":"IF($BD$14=0,0,IF(COUNTIF(OFFSET($BD56,0,0,MIN($BD$14,5),1),\"O3\")+COUNTIF(OFFSET($BD56,0,0,MIN($BD$14,5),1),\"O3 Cell 1\")+IF($BD$14>5,COUNTIF(OFFSET($BV56,0,0,$BD$14-5,1),\"O3\"),0)+IF($BD$14>5,COUNTIF(OFFSET($BV56,0,0,$BD$14-5,1),\"O3 Cell 1\"),0),1,0))","v":0},{"$f":"IF(OR($AY56=0,AND(COUNTA(D56,F56:G56)=0,COUNTIF(E56,0))),\"NA\",\n       IF(COUNTA(D56:G56),IF(BA56,4,\n                                                                     5),\n            IF($BD$15=1,IF(BA56,4,\n                                                        IF(AZ56,5,\n                                                                         6)),\n                    IF(BD56=\"!error\",IF(BA56,4,\n                                                                        5),\n                          IF(BA56,\"5B\",\n                                            6)))))","v":6},{"$f":"$BD$11","v":1},{"$f":"IF(AND(IF($BN$4=\"missing\",10,$BN$4)>=1,$AY56<>\"\"),IF(OR($AY56=0,AND($B56=\"NA\",COUNTA($D56,$F56:$G56)=0,COUNTIF($E56,0)),AND($B56=\"NA\",COUNTA($D56:$G56)=0,IF($BD$14=0,0,COUNTIF(OFFSET($BD56,0,0,MIN($BD$14,5),1),\"NA\")+IF($BD$14>5,COUNTIF(OFFSET($BV56,0,0,$BD$14-5,1),\"NA\"),0))=$BD$14),AND($B56=\"NA\",COUNTA($D56:$G56)=0,IF($BD$14<5,COUNTA(OFFSET($D56,$BD$14,0,MIN(5-$BD$14,$BD$15),4))-COUNTIF(OFFSET($E56,$BD$14,0,MIN(5-$BD$14,$BD$15),1),0),0)+IF($BD$14+$BD$15>5,COUNTA(OFFSET($D61,MAX($BD$14-5,0),0,MIN($BD$14+$BD$15-5,$BD$15),4))-COUNTIF(OFFSET($E61,MAX($BD$14-5,0),0,MIN($BD$14+$BD$15-5,$BD$15),1),0),0)),AND($B56=\"NA\",COUNTA($D56:$G56)=0,IF($BD$14<5,COUNTIF(OFFSET($B56,$BD$14,0,MIN(5-$BD$14,$BD$15),1),\"NA\"),0)+IF($BD$14+$BD$15>5,COUNTIF(OFFSET($B61,MAX($BD$14-5,0),0,MIN($BD$14+$BD$15-5,$BD$15),1),\"NA\"),0)<>$BD$15)),\"NA\",IF($B56=\"\",\"missing\",IF(AND($B56<>\"NA\",COUNTA($D56,$F56:$G56)+COUNTIF($E56,\"<>0\")),UPPER($B56),\"!error\"))),\"\")","v":"missing"},{"$f":"IF(BD56=\"\",\"\",IF(BD56=\"FCL\",1,IF(BD56=\"CLO2\",2,IF(BD56=\"O3 Cell 1\",99,IF(BD56=\"O3\",3,IF(BD56=\"CLA\",4,0))))))","v":0},{"$f":"IF(BD56=\"\",\"\",IF(BD56=\"NA\",\"NA\",IF(ISBLANK($D56),\"missing\",IF(AND(BE56=1,ISNUMBER($D56),$D56>4),4,IF(AND(ISNUMBER($D56),$D56>=0),$D56,IF(AND(ISTEXT($D56),$D56=\"ND\"),\"ND\",\"!error\"))))))","v":"missing"},{"$f":"IF(BD56=\"\",\"\",IF(BD56=\"NA\",\"NA\",IF(ISBLANK($E56),\"missing\",IF(OR(AND(ISBLANK($B56),COUNT(BF56,BI56:BJ56)=0,ISNUMBER($E56),$E56=0),AND(ISNUMBER($E56),$E56>0),AND(ISTEXT($E56),$E56=\"ND\")),$E56,\"!error\"))))","v":"missing"},{"$f":"IF(BD56=\"\",\"\",IF(AY56=0,\"NA\",IF(OR($BD$12=\"!error\",$BD$13=\"!error\",BG56=\"!error\"),\"!error\",IF(BD56=\"NA\",\"NA\",IF(AND(ISNUMBER(BG56),BG56=0),0,IF(AND(ISNUMBER($BD$12),ISNUMBER($BD$13),ISNUMBER(BG56)),$BD$13*$BD$12/BG56,IF(BG56=\"ND\",\"ND\",\"missing\")))))))","v":"missing"},{"$f":"IF(BD56=\"\",\"\",IF(BD56=\"NA\",\"NA\",IF(ISBLANK($F56),\"missing\",IF(OR(ISNUMBER($F56),$F56=\"ND\"),$F56,\"!error\"))))","v":"missing"},{"$f":"IF(BD56=\"\",\"\",IF(BD56=\"NA\",\"NA\",IF(ISBLANK($G56),\"missing\",IF(OR(AND(ISNUMBER($G56),$G56>=0,$G56<=14),$G56=\"ND\"),$G56,\"!error\"))))","v":"missing"},{"$f":"IF(BD56=\"\",\"\",IF(AY56=0,\"NA\",IF(OR(BF56=\"!error\",BH56=\"!error\"),\"!error\",IF(BD56=\"NA\",\"NA\",IF(OR(AND(ISNUMBER(BF56),BF56=0),AND(ISNUMBER(BH56),BH56=0)),0,IF(AND(ISNUMBER(BF56),ISNUMBER(BH56)),BF56*BH56,IF(OR(BF56=\"ND\",BH56=\"ND\"),\"ND\",\"missing\")))))))","v":"missing"},{"$f":"IF(BD56=\"\",\"\",IF(AY56=0,\"NA\",IF(CW56=\"ND\",\"ND\",IF(OR($BN$12=\"!error\",BD56=\"!error\",AND(BD56=\"missing\",ISNUMBER(BF56)),IF(BE56=1,BF56=\"!error\",0),BI56=\"!error\",BJ56=\"!error\"),\"!error\",IF(OR(BD56=\"NA\",AND(ISNUMBER($BN$12),$BN$12=0),AND(BE56<>0,ISNUMBER(BK56),BK56=0),AND(BE56=1,ISNUMBER(BJ56),BJ56>9),AND(BE56=2,ISNUMBER(BJ56),OR(BJ56<6,BJ56>=9.5)),AND(OR(BE56=3,BE56=4),ISNUMBER(BJ56),OR(BJ56<5.5,BJ56>=9.5))),\"NA\",IF(AND(ISNUMBER($BN$12),BE56<>0,IF(BE56=1,ISNUMBER(BF56),1),ISNUMBER(BI56),ISNUMBER(BJ56)),CT_Giardia(BE56,$BN$12,BI56,BJ56,IF(BE56=1,BF56,)),IF(COUNTIF(BE56,\"<>0\")+COUNT(BF56,BG56,BI56,BJ56)=5,\"!error\",\"missing\")))))))","v":"missing"},{"$f":"IF(BD56=\"\",\"\",IF(OR(AY56=0,AND(ISNUMBER($BN$12),$BN$12=0)),\"NA\",IF(CW56=\"ND\",\"ND\",IF(OR(BK56=\"!error\",BL56=\"!error\",BN56=\"!error\"),\"!error\",IF(BD56=\"NA\",\"NA\",IF(BL56=\"NA\",0,IF(AND(BE56<>99,ISNUMBER(BK56),ISNUMBER(BL56)),BK56/BL56,IF(AND(BE56=99,BN56=0.5),BN56/$BN$12,\"missing\"))))))))","v":"missing"},{"$f":"IF(BD56=\"\",\"\",IF(AY56=0,\"NA\",IF(CW56=\"ND\",\"ND\",IF(OR(BD56=\"!error\",AND(BD56=\"missing\",ISNUMBER(BF56)),BF56=\"!error\",BH56=\"!error\",BI56=\"!error\",BJ56=\"!error\"),\"!error\",IF(BD56=\"NA\",\"NA\",IF(OR(AND(BE56<>0,ISNUMBER(BK56),BK56=0),AND(BE56=1,ISNUMBER(BJ56),BJ56>9),AND(BE56=2,ISNUMBER(BJ56),OR(BJ56<6,BJ56>=9.5)),AND(OR(BE56=3,BE56=4),ISNUMBER(BJ56),OR(BJ56<5.5,BJ56>=9.5))),0,IF(AND(ISNUMBER($BN$12),BE56<>0,ISNUMBER(BF56),ISNUMBER(BH56),ISNUMBER(BI56),ISNUMBER(BJ56)),log_Giardia(BE56,$BN$12,BI56,BJ56,BF56,BH56),IF(COUNTIF(BE56,\"<>0\")+COUNT(BF56,BG56,BI56,BJ56)=5,\"!error\",\"missing\"))))))))","v":"missing"},{"$f":"IF(BD56=\"\",\"\",IF(AY56=0,\"NA\",IF(CW56=\"ND\",\"ND\",IF(OR($BP$12=\"!error\",BD56=\"!error\",AND(BD56=\"missing\",ISNUMBER(BF56)),BI56=\"!error\",BJ56=\"!error\"),\"!error\",IF(OR(BD56=\"NA\",AND(ISNUMBER($BP$12),$BP$12=0),AND(BE56<>0,ISNUMBER(BK56),BK56=0),AND(BE56=1,ISNUMBER(BJ56),BJ56>=10.5),AND(BE56=2,ISNUMBER(BJ56),OR(BJ56<6,BJ56>=9.5)),AND(BE56=3,ISNUMBER(BJ56),OR(BJ56<6,BJ56>9)),AND(BE56=4,ISNUMBER(BJ56),OR(BJ56<6,BJ56>10))),\"NA\",IF(AND(ISNUMBER($BP$12),BE56<>0,ISNUMBER(BI56),ISNUMBER(BJ56)),CT_Virus(BE56,$BP$12,BI56,BJ56),IF(COUNTIF(BE56,\"<>0\")+COUNT(BF56,BG56,BI56,BJ56)=5,\"!error\",\"missing\")))))))","v":"missing"},{"$f":"IF(BD56=\"\",\"\",IF(OR(AY56=0,AND(ISNUMBER($BP$12),$BP$12=0)),\"NA\",IF(CW56=\"ND\",\"ND\",IF(OR(BK56=\"!error\",BO56=\"!error\",BQ56=\"!error\"),\"!error\",IF(BD56=\"NA\",\"NA\",IF(BO56=\"NA\",0,IF(AND(BE56<>99,ISNUMBER(BK56),ISNUMBER(BO56)),BK56/BO56,IF(AND(BE56=99,BQ56=1),BQ56/$BP$12,\"missing\"))))))))","v":"missing"},{"$f":"IF(BD56=\"\",\"\",IF(AY56=0,\"NA\",IF(CW56=\"ND\",\"ND\",IF(OR(BD56=\"!error\",AND(BD56=\"missing\",ISNUMBER(BF56)),BF56=\"!error\",BH56=\"!error\",BI56=\"!error\",BJ56=\"!error\"),\"!error\",IF(BD56=\"NA\",\"NA\",IF(OR(AND(BE56<>0,ISNUMBER(BK56),BK56=0),AND(BE56=1,ISNUMBER(BJ56),BJ56>=10.5),AND(BE56=2,ISNUMBER(BJ56),OR(BJ56<6,BJ56>=9.5)),AND(BE56=3,ISNUMBER(BJ56),OR(BJ56<6,BJ56>9)),AND(BE56=4,ISNUMBER(BJ56),OR(BJ56<6,BJ56>10))),0,IF(AND(ISNUMBER($BP$12),BE56<>0,ISNUMBER(BF56),ISNUMBER(BH56),ISNUMBER(BI56),ISNUMBER(BJ56)),Log_Virus(BE56,$BP$12,BI56,BJ56,BF56,BH56),IF(COUNTIF(BE56,\"<>0\")+COUNT(BF56,BG56,BI56,BJ56)=5,\"!error\",\"missing\"))))))))","v":"missing"},{"$f":"IF($BI$14=0,0,IF(COUNTIF(OFFSET($BD56,0,0,MIN($BI$14,5),1),\"<>NA\")+IF($BI$14>5,COUNTIF(OFFSET($BV56,0,0,$BI$14-5,1),\"<>NA\"),0),1,0))","v":1},{"$f":"IF($BI$14=0,0,IF(COUNTIF(OFFSET($BD56,0,0,MIN($BI$14,5),1),\"O3\")+COUNTIF(OFFSET($BD56,0,0,MIN($BI$14,5),1),\"O3 Cell 1\")+IF($BI$14>5,COUNTIF(OFFSET($BV56,0,0,$BI$14-5,1),\"O3\"),0)+IF($BI$14>5,COUNTIF(OFFSET($BV56,0,0,$BI$14-5,1),\"O3 Cell 1\"),0),1,0))","v":0},{"$f":"IF(OR($AY56=0,AND(COUNTA(D61,F61:G61)=0,COUNTIF(E61,0))),\"NA\",IF(COUNTA(D61:G61),IF(BS56,4,5),IF($BI$15=1,IF(BS56,4,IF(BR56,5,6)),IF(BV56=\"!error\",IF(BS56,4,5),IF(BS56,\"5B\",6)))))","v":6},{"$f":"$BI$11","v":6},{"$f":"IF(AND(IF($BN$4=\"missing\",10,$BN$4)>=6,$AY56<>\"\"),IF(OR($AY56=0,AND($B61=\"NA\",COUNTA($D61,$F61:$G61)=0,COUNTIF($E61,0)),AND($B61=\"NA\",COUNTA($D61:$G61)=0,IF($BI$14=0,0,COUNTIF(OFFSET($BD56,0,0,MIN($BI$14,5),1),\"NA\")+IF($BI$14>5,COUNTIF(OFFSET($BV56,0,0,$BI$14-5,1),\"NA\"),0))=$BI$14),AND($B61=\"NA\",COUNTA($D61:$G61)=0,IF($BI$14<5,COUNTA(OFFSET($D56,$BI$14,0,MIN(5-$BI$14,$BI$15),4))-COUNTIF(OFFSET($E56,$BI$14,0,MIN(5-$BI$14,$BI$15),1),0),0)+IF($BI$14+$BI$15>5,COUNTA(OFFSET($D61,MAX($BI$14-5,0),0,MIN($BI$14+$BI$15-5,$BI$15),4))-COUNTIF(OFFSET($E61,MAX($BI$14-5,0),0,MIN($BI$14+$BI$15-5,$BI$15),1),0),0)),AND($B61=\"NA\",COUNTA($D61:$G61)=0,IF($BI$14<5,COUNTIF(OFFSET($B56,$BI$14,0,MIN(5-$BI$14,$BI$15),1),\"NA\"),0)+IF($BI$14+$BI$15>5,COUNTIF(OFFSET($B61,MAX($BI$14-5,0),0,MIN($BI$14+$BI$15-5,$BI$15),1),\"NA\"),0)<>$BI$15)),\"NA\",IF($B61=\"\",\"missing\",IF(AND($B61<>\"NA\",COUNTA($D61,$F61:$G61)+COUNTIF($E61,\"<>0\")),UPPER($B61),\"!error\"))),\"\")","v":""},{"$f":"IF(BV56=\"\",\"\",IF(BV56=\"FCL\",1,IF(BV56=\"CLO2\",2,IF(BV56=\"O3 Cell 1\",99,IF(BV56=\"O3\",3,IF(BV56=\"CLA\",4,0))))))","v":""},{"$f":"IF(BV56=\"\",\"\",IF(BV56=\"NA\",\"NA\",IF(ISBLANK($D61),\"missing\",IF(AND(BW56=1,ISNUMBER($D61),$D61>4),4,IF(AND(ISNUMBER($D61),$D61>=0),$D61,IF(AND(ISTEXT($D61),$D61=\"ND\"),\"ND\",\"!error\"))))))","v":""},{"$f":"IF(BV56=\"\",\"\",IF(BV56=\"NA\",\"NA\",IF(ISBLANK($E61),\"missing\",IF(OR(AND(ISBLANK($B61),COUNT(BX56,CA56:CB56)=0,ISNUMBER($E61),$E61=0),AND(ISNUMBER($E61),$E61>0),AND(ISTEXT($E61),$E61=\"ND\")),$E61,\"!error\"))))","v":""},{"$f":"IF(BV56=\"\",\"\",IF(AY56=0,\"NA\",IF(OR($BI$12=\"!error\",$BI$13=\"!error\",BY56=\"!error\"),\"!error\",IF(BV56=\"NA\",\"NA\",IF(AND(ISNUMBER(BY56),BY56=0),0,IF(AND(ISNUMBER($BI$12),ISNUMBER($BI$13),ISNUMBER(BY56)),$BI$13*$BI$12/BY56,IF(BY56=\"ND\",\"ND\",\"missing\")))))))","v":""},{"$f":"IF(BV56=\"\",\"\",IF(BV56=\"NA\",\"NA\",IF(ISBLANK($F61),\"missing\",IF(OR(ISNUMBER($F61),$F61=\"ND\"),$F61,\"!error\"))))","v":""},{"$f":"IF(BV56=\"\",\"\",IF(BV56=\"NA\",\"NA\",IF(ISBLANK($G61),\"missing\",IF(OR(AND(ISNUMBER($G61),$G61>=0,$G61<=14),$G61=\"ND\"),$G61,\"!error\"))))","v":""},{"$f":"IF(BV56=\"\",\"\",IF(AY56=0,\"NA\",IF(OR(BX56=\"!error\",BZ56=\"!error\"),\"!error\",IF(BV56=\"NA\",\"NA\",IF(OR(AND(ISNUMBER(BX56),BX56=0),AND(ISNUMBER(BZ56),BZ56=0)),0,IF(AND(ISNUMBER(BX56),ISNUMBER(BZ56)),BX56*BZ56,IF(OR(BX56=\"ND\",BZ56=\"ND\"),\"ND\",\"missing\")))))))","v":""},{"$f":"IF(BV56=\"\",\"\",IF(AY56=0,\"NA\",IF(CX56=\"ND\",\"ND\",IF(OR($BN$12=\"!error\",BV56=\"!error\",AND(BV56=\"missing\",ISNUMBER(BX56)),IF(BW56=1,BX56=\"!error\",0),CA56=\"!error\",CB56=\"!error\"),\"!error\",IF(OR(BV56=\"NA\",AND(ISNUMBER($BN$12),$BN$12=0),AND(BW56<>0,ISNUMBER(CC56),CC56=0),AND(BW56=1,ISNUMBER(CB56),CB56>9),AND(BW56>1,ISNUMBER(CB56),OR(CB56<6,CB56>=9.5))),\"NA\",IF(AND(ISNUMBER($BN$12),BW56<>0,IF(BW56=1,ISNUMBER(BX56),1),ISNUMBER(CA56),ISNUMBER(CB56)),CT_Giardia(BW56,$BN$12,CA56,CB56,IF(BW56=1,BX56,)),IF(COUNTIF(BW56,\"<>0\")+COUNT(BX56,BY56,CA56,CB56)=5,\"!error\",\"missing\")))))))","v":""},{"$f":"IF(BV56=\"\",\"\",IF(OR(AY56=0,AND(ISNUMBER($BN$12),$BN$12=0)),\"NA\",IF(CX56=\"ND\",\"ND\",IF(OR(CC56=\"!error\",CD56=\"!error\",CF56=\"!error\"),\"!error\",IF(BV56=\"NA\",\"NA\",IF(CD56=\"NA\",0,IF(AND(ISNUMBER(CC56),ISNUMBER(CD56)),CC56/CD56,IF(AND(BW56=99,CF56=0.5),CF56/$BN$12,\"missing\"))))))))","v":""},{"$f":"IF(BV56=\"\",\"\",IF(AY56=0,\"NA\",IF(CX56=\"ND\",\"ND\",IF(OR(BV56=\"!error\",AND(BV56=\"missing\",ISNUMBER(BX56)),BX56=\"!error\",BZ56=\"!error\",CA56=\"!error\",CB56=\"!error\"),\"!error\",IF(BV56=\"NA\",\"NA\",IF(OR(AND(BW56<>0,ISNUMBER(CC56),CC56=0),AND(BW56=1,ISNUMBER(CB56),CB56>9),AND(BW56>1,ISNUMBER(CB56),OR(CB56<6,CB56>=9.5))),0,IF(AND(ISNUMBER($BN$12),BW56<>0,ISNUMBER(BX56),ISNUMBER(BZ56),ISNUMBER(CA56),ISNUMBER(CB56)),log_Giardia(BW56,$BN$12,CA56,CB56,BX56,BZ56),IF(COUNTIF(BW56,\"<>0\")+COUNT(BX56,BY56,CA56,CB56)=5,\"!error\",\"missing\"))))))))","v":""},{"$f":"IF(BV56=\"\",\"\",IF(AY56=0,\"NA\",IF(CX56=\"ND\",\"ND\",IF(OR($BP$12=\"!error\",BV56=\"!error\",AND(BV56=\"missing\",ISNUMBER(BX56)),CA56=\"!error\",CB56=\"!error\"),\"!error\",IF(OR(BV56=\"NA\",AND(ISNUMBER($BP$12),$BP$12=0),AND(BW56<>0,ISNUMBER(CC56),CC56=0),AND(BW56=1,ISNUMBER(CB56),OR(CB56<5.5,CB56>=10.5)),AND(OR(BW56=2,BW56=4),ISNUMBER(CB56),OR(CB56<6,CB56>=9.5)),AND(BW56=3,ISNUMBER(CB56),OR(CB56<6,CB56>9))),\"NA\",IF(AND(ISNUMBER($BP$12),BW56<>0,ISNUMBER(CA56),ISNUMBER(CB56)),CT_Virus(BW56,$BP$12,CA56,CB56),IF(COUNTIF(BW56,\"<>0\")+COUNT(BX56,BY56,CA56,CB56)=5,\"!error\",\"missing\")))))))","v":""},{"$f":"IF(BV56=\"\",\"\",IF(OR(AY56=0,AND(ISNUMBER($BP$12),$BP$12=0)),\"NA\",IF(CX56=\"ND\",\"ND\",IF(OR(CC56=\"!error\",CG56=\"!error\",CI56=\"!error\"),\"!error\",IF(BV56=\"NA\",\"NA\",IF(CG56=\"NA\",0,IF(AND(ISNUMBER(CC56),ISNUMBER(CG56)),CC56/CG56,IF(AND(BW56=99,CI56=1),CI56/$BP$12,\"missing\"))))))))","v":""},{"$f":"IF(BV56=\"\",\"\",IF(AY56=0,\"NA\",IF(CX56=\"ND\",\"ND\",IF(OR(BV56=\"!error\",AND(BV56=\"missing\",ISNUMBER(BX56)),BX56=\"!error\",BZ56=\"!error\",CA56=\"!error\",CB56=\"!error\"),\"!error\",IF(BV56=\"NA\",\"NA\",IF(OR(AND(BW56<>0,ISNUMBER(CC56),CC56=0),AND(BW56=1,ISNUMBER(CB56),OR(CB56<5.5,CB56>=10.5)),AND(OR(BW56=2,BW56=4),ISNUMBER(CB56),OR(CB56<6,CB56>=9.5)),AND(BW56=3,ISNUMBER(CB56),OR(CB56<6,CB56>9))),0,IF(AND(ISNUMBER($BP$12),BW56<>0,ISNUMBER(BX56),ISNUMBER(BZ56),ISNUMBER(CA56),ISNUMBER(CB56)),Log_Virus(BW56,$BP$12,CA56,CB56,BX56,BZ56),IF(COUNTIF(BW56,\"<>0\")+COUNT(BX56,BY56,CA56,CB56)=5,\"!error\",\"missing\"))))))))","v":""},null,{"$f":"IF(AY56=\"\",\"\",IF(AY56=0,\"NA\",IF(COUNTIF(BN56:BN60,\"!error\")+COUNTIF(CF56:CF60,\"!error\")>0,\"!error\",IF(COUNT(BN56:BN60,CF56:CF60)>0,SUMIFF(BC56:BC60,\">0\",BN56:BN60)+SUMIFF(BU56:BU60,\">0\",CF56:CF60)+MINIF(BC56:BC60,BU56:BU60,\"1?\",BN56:BN60,CF56:CF60)+MINIF(BC56:BC60,BU56:BU60,\"2?\",BN56:BN60,CF56:CF60)+MINIF(BC56:BC60,BU56:BU60,\"3?\",BN56:BN60,CF56:CF60)+MINIF(BC56:BC60,BU56:BU60,\"4?\",BN56:BN60,CF56:CF60)+MINIF(BC56:BC60,BU56:BU60,\"5?\",BN56:BN60,CF56:CF60)+MINIF(BC56:BC60,BU56:BU60,\"6?\",BN56:BN60,CF56:CF60)+MINIF(BC56:BC60,BU56:BU60,\"7?\",BN56:BN60,CF56:CF60)+MINIF(BC56:BC60,BU56:BU60,\"8?\",BN56:BN60,CF56:CF60)+MINIF(BC56:BC60,BU56:BU60,\"9?\",BN56:BN60,CF56:CF60)+MINIF(BC56:BC60,BU56:BU60,\"10?\",BN56:BN60,CF56:CF60),IF(COUNTIF(BN56:BN60,\"NA\")+COUNTIF(CF56:CF60,\"NA\")=IF($AZ$4=\"missing\",10,SUM($BD$4:$BM$4)),0,\"missing\")))))","v":"missing"},{"$f":"IF(AND(ISNUMBER(CK56),COUNT(BN56:BN60,CF56:CF60)+COUNTIF(BN56:BN60,\"NA\")+COUNTIF(CF56:CF60,\"NA\")<IF($AZ$4=\"missing\",10,SUM($BD$4:$BM$4))),\"*\",\"\")","v":""},{"$f":"IF(AY56=\"\",\"\",IF(OR(AY56=0,AND(ISNUMBER($BN$12),$BN$12=0)),\"NA\",IF(COUNTIF(BM56:BM60,\"!error\")+COUNTIF(CE56:CE60,\"!error\")>0,\"!error\",IF(COUNT(BM56:BM60,CE56:CE60)>0,SUMIFF(BC56:BC60,\">0\",BM56:BM60)+SUMIFF(BU56:BU60,\">0\",CE56:CE60)+MINIF(BC56:BC60,BU56:BU60,\"1?\",BM56:BM60,CE56:CE60)+MINIF(BC56:BC60,BU56:BU60,\"2?\",BM56:BM60,CE56:CE60)+MINIF(BC56:BC60,BU56:BU60,\"3?\",BM56:BM60,CE56:CE60)+MINIF(BC56:BC60,BU56:BU60,\"4?\",BM56:BM60,CE56:CE60)+MINIF(BC56:BC60,BU56:BU60,\"5?\",BM56:BM60,CE56:CE60)+MINIF(BC56:BC60,BU56:BU60,\"6?\",BM56:BM60,CE56:CE60)+MINIF(BC56:BC60,BU56:BU60,\"7?\",BM56:BM60,CE56:CE60)+MINIF(BC56:BC60,BU56:BU60,\"8?\",BM56:BM60,CE56:CE60)+MINIF(BC56:BC60,BU56:BU60,\"9?\",BM56:BM60,CE56:CE60)+MINIF(BC56:BC60,BU56:BU60,\"10?\",BM56:BM60,CE56:CE60),IF(COUNTIF(BM56:BM60,\"NA\")+COUNTIF(CE56:CE60,\"NA\")=IF($AZ$4=\"missing\",10,SUM($BD$4:$BM$4)),0,\"missing\")))))","v":"missing"},{"$f":"IF(AND(ISNUMBER(CM56),COUNT(BM56:BM60,CE56:CE60)+COUNTIF(BM56:BM60,\"NA\")+COUNTIF(CE56:CE60,\"NA\")<IF($AZ$4=\"missing\",10,SUM($BD$4:$BM$4))),\"*\",\"\")","v":""},{"$f":"IF(AY56=\"\",\"\",IF(AY56=0,\"NA\",IF(COUNTIF(BQ56:BQ60,\"!error\")+COUNTIF(CI56:CI60,\"!error\")>0,\"!error\",IF(COUNT(BQ56:BQ60,CI56:CI60)>0,SUMIFF(BC56:BC60,\">0\",BQ56:BQ60)+SUMIFF(BU56:BU60,\">0\",CI56:CI60)+MINIF(BC56:BC60,BU56:BU60,\"1?\",BQ56:BQ60,CI56:CI60)+MINIF(BC56:BC60,BU56:BU60,\"2?\",BQ56:BQ60,CI56:CI60)+MINIF(BC56:BC60,BU56:BU60,\"3?\",BQ56:BQ60,CI56:CI60)+MINIF(BC56:BC60,BU56:BU60,\"4?\",BQ56:BQ60,CI56:CI60)+MINIF(BC56:BC60,BU56:BU60,\"5?\",BQ56:BQ60,CI56:CI60)+MINIF(BC56:BC60,BU56:BU60,\"6?\",BQ56:BQ60,CI56:CI60)+MINIF(BC56:BC60,BU56:BU60,\"7?\",BQ56:BQ60,CI56:CI60)+MINIF(BC56:BC60,BU56:BU60,\"8?\",BQ56:BQ60,CI56:CI60)+MINIF(BC56:BC60,BU56:BU60,\"9?\",BQ56:BQ60,CI56:CI60)+MINIF(BC56:BC60,BU56:BU60,\"10?\",BQ56:BQ60,CI56:CI60),IF(COUNTIF(BQ56:BQ60,\"NA\")+COUNTIF(CI56:CI60,\"NA\")=IF($AZ$4=\"missing\",10,SUM($BD$4:$BM$4)),0,\"missing\")))))","v":"missing"},{"$f":"IF(AND(ISNUMBER(CO56),COUNT(BQ56:BQ60,CI56:CI60)+COUNTIF(BQ56:BQ60,\"NA\")+COUNTIF(CI56:CI60,\"NA\")<IF($AZ$4=\"missing\",10,SUM($BD$4:$BM$4))),\"*\",\"\")","v":""},{"$f":"IF(AY56=\"\",\"\",IF(OR(AY56=0,AND(ISNUMBER($BP$12),$BP$12=0)),\"NA\",IF(COUNTIF(BP56:BP60,\"!error\")+COUNTIF(CH56:CH60,\"!error\")>0,\"!error\",IF(COUNT(BP56:BP60,CH56:CH60)>0,SUMIFF(BC56:BC60,\">0\",BP56:BP60)+SUMIFF(BU56:BU60,\">0\",CH56:CH60)+MINIF(BC56:BC60,BU56:BU60,\"1?\",BP56:BP60,CH56:CH60)+MINIF(BC56:BC60,BU56:BU60,\"2?\",BP56:BP60,CH56:CH60)+MINIF(BC56:BC60,BU56:BU60,\"3?\",BP56:BP60,CH56:CH60)+MINIF(BC56:BC60,BU56:BU60,\"4?\",BP56:BP60,CH56:CH60)+MINIF(BC56:BC60,BU56:BU60,\"5?\",BP56:BP60,CH56:CH60)+MINIF(BC56:BC60,BU56:BU60,\"6?\",BP56:BP60,CH56:CH60)+MINIF(BC56:BC60,BU56:BU60,\"7?\",BP56:BP60,CH56:CH60)+MINIF(BC56:BC60,BU56:BU60,\"8?\",BP56:BP60,CH56:CH60)+MINIF(BC56:BC60,BU56:BU60,\"9?\",BP56:BP60,CH56:CH60)+MINIF(BC56:BC60,BU56:BU60,\"10?\",BP56:BP60,CH56:CH60),IF(COUNTIF(BP56:BP60,\"NA\")+COUNTIF(CH56:CH60,\"NA\")=IF($AZ$4=\"missing\",10,SUM($BD$4:$BM$4)),0,\"missing\")))))","v":"missing"},{"$f":"IF(AND(ISNUMBER(CQ56),COUNT(BP56:BP60,CH56:CH60)+COUNTIF(BP56:BP60,\"NA\")+COUNTIF(CH56:CH60,\"NA\")<IF($AZ$4=\"missing\",10,SUM($BD$4:$BM$4))),\"*\",\"\")","v":""},{"$f":"IF(AY56=\"\",\"\",IF(AND(CM56=\"NA\",CQ56=\"NA\"),\"NA\",IF(OR(AND(ISNUMBER(CM56),ISNUMBER(CQ56)),AND(ISNUMBER(CM56),CQ56=\"NA\"),AND(CM56=\"NA\",ISNUMBER(CQ56)),AND(ISNUMBER(CM56),CM56=0),AND(ISNUMBER(CQ56),CQ56=0)),MIN(CM56,CQ56),IF(OR(CM56=\"!error\",CQ56=\"!error\"),\"!error\",\"missing\"))))","v":"missing"},{"$f":"IF(ISNUMBER(CS56),IF(CM56<CQ56,IF(CN56=\"*\",\"*\",\"\"),IF(CQ56<CM56,IF(CR56=\"*\",\"*\",\"\"),IF(AND(CN56=\"*\",CR56=\"*\"),\"*\",\"\"))),\"\")","v":""},{"$f":"IF(ISNUMBER(CS56),IF(CM56<CQ56,\"(G)\",IF(CQ56<CM56,\"(V)\",IF(AND(CN56=\"\",CR56=\"*\"),\"(G)\",IF(AND(CN56=\"*\",CR56=\"\"),\"(V)\",\"(G/V)\")))),\"\")","v":""},null,{"$f":"IF(OR(BF56=\"ND\",BG56=\"ND\",BI56=\"ND\",BJ56=\"ND\"),\"ND\",\"data\")","v":"data"},{"$f":"IF(OR(BX56=\"ND\",BY56=\"ND\",CA56=\"ND\",CB56=\"ND\"),\"ND\",\"data\")","v":"data"}]
[null," ",{"$f":"$D$15","v":2},null,null,null,null,"missing",{"$f":"$BL57","v":"missing"},{"$f":"$BO57","v":"missing"},{"$f":"$BN57","v":"missing"},{"$f":"$BQ57","v":"missing"},null,null,null,null,{"$f":"IF(AND(BE57=1,D57>4,D57<>\"ND\"),\"Note: The inactivation credit in zone D\" & C57 & \" was restricted due to elevated free chlorine levels.\",\"\")","v":""},null,null,null,null,null,null,null,null,null,null,null,null,null,null,null,null,null,null,null,null,null,null,null,null,null,null,null,null,null,null,null,null,null,1,{"$f":"IF($BE$14=0,0,IF(COUNTIF(OFFSET($BD56,0,0,MIN($BE$14,5),1),\"<>NA\")+IF($BE$14>5,COUNTIF(OFFSET($BV56,0,0,$BE$14-5,1),\"<>NA\"),0),1,0))","v":1},{"$f":"IF($BE$14=0,0,IF(COUNTIF(OFFSET($BD56,0,0,MIN($BE$14,5),1),\"O3\")+COUNTIF(OFFSET($BD56,0,0,MIN($BE$14,5),1),\"O3 Cell 1\")+IF($BE$14>5,COUNTIF(OFFSET($BV56,0,0,$BE$14-5,1),\"O3\"),0)+IF($BE$14>5,COUNTIF(OFFSET($BV56,0,0,$BE$14-5,1),\"O3 Cell 1\"),0),1,0))","v":0},{"$f":"IF(OR($AY57=0,AND(COUNTA(D57,F57:G57)=0,COUNTIF(E57,0))),\"NA\",IF(COUNTA(D57:G57),IF(BA57,4,5),IF($BE$15=1,IF(BA57,4,IF(AZ57,5,6)),IF(BD57=\"!error\",IF(BA57,4,5),IF(BA57,\"5B\",6)))))","v":5},{"$f":"$BE$11","v":2},{"$f":"IF(AND(IF($BN$4=\"missing\",10,$BN$4)>=2,$AY57<>\"\"),IF(OR($AY57=0,AND($B57=\"NA\",COUNTA($D57,$F57:$G57)=0,COUNTIF($E57,0)),AND($B57=\"NA\",COUNTA($D57:$G57)=0,IF($BE$14=0,0,COUNTIF(OFFSET($BD56,0,0,MIN($BE$14,5),1),\"NA\")+IF($BE$14>5,COUNTIF(OFFSET($BV56,0,0,$BE$14-5,1),\"NA\"),0))=$BE$14),AND($B57=\"NA\",COUNTA($D57:$G57)=0,IF($BE$14<5,COUNTA(OFFSET($D56,$BE$14,0,MIN(5-$BE$14,$BE$15),4))-COUNTIF(OFFSET($E56,$BE$14,0,MIN(5-$BE$14,$BE$15),1),0),0)+IF($BE$14+$BE$15>5,COUNTA(OFFSET($D61,MAX($BE$14-5,0),0,MIN($BE$14+$BE$15-5,$BE$15),4))-COUNTIF(OFFSET($E61,MAX($BE$14-5,0),0,MIN($BE$14+$BE$15-5,$BE$15),1),0),0)),AND($B57=\"NA\",COUNTA($D57:$G57)=0,IF($BE$14<5,COUNTIF(OFFSET($B56,$BE$14,0,MIN(5-$BE$14,$BE$15),1),\"NA\"),0)+IF($BE$14+$BE$15>5,COUNTIF(OFFSET($B61,MAX($BE$14-5,0),0,MIN($BE$14+$BE$15-5,$BE$15),1),\"NA\"),0)<>$BE$15)),\"NA\",IF($B57=\"\",\"missing\",IF(AND($B57<>\"NA\",COUNTA($D57,$F57:$G57)+COUNTIF($E57,\"<>0\")),UPPER($B57),\"!error\"))),\"\")","v":" "},0,{"$f":"IF(BD57=\"\",\"\",IF(BD57=\"NA\",\"NA\",IF(ISBLANK($D57),\"missing\",IF(AND(BE57=1,ISNUMBER($D57),$D57>4),4,IF(AND(ISNUMBER($D57),$D57>=0),$D57,IF(AND(ISTEXT($D57),$D57=\"ND\"),\"ND\",\"!error\"))))))","v":"missing"},{"$f":"IF(BD57=\"\",\"\",IF(BD57=\"NA\",\"NA\",IF(ISBLANK($E57),\"missing\",IF(OR(AND(ISBLANK($B57),COUNT(BF57,BI57:BJ57)=0,ISNUMBER($E57),$E57=0),AND(ISNUMBER($E57),$E57>0),AND(ISTEXT($E57),$E57=\"ND\")),$E57,\"!error\"))))","v":"missing"},{"$f":"IF(BD57=\"\",\"\",IF(AY57=0,\"NA\",IF(OR($BE$12=\"!error\",$BE$13=\"!error\",BG57=\"!error\"),\"!error\",IF(BD57=\"NA\",\"NA\",IF(AND(ISNUMBER(BG57),BG57=0),0,IF(AND(ISNUMBER($BE$12),ISNUMBER($BE$13),ISNUMBER(BG57)),$BE$13*$BE$12/BG57,IF(BG57=\"ND\",\"ND\",\"missing\")))))))","v":"missing"},{"$f":"IF(BD57=\"\",\"\",IF(BD57=\"NA\",\"NA\",IF(ISBLANK($F57),\"missing\",IF(OR(ISNUMBER($F57),$F57=\"ND\"),$F57,\"!error\"))))","v":"missing"},{"$f":"IF(BD57=\"\",\"\",IF(BD57=\"NA\",\"NA\",IF(ISBLANK($G57),\"missing\",IF(OR(AND(ISNUMBER($G57),$G57>=0,$G57<=14),$G57=\"ND\"),$G57,\"!error\"))))","v":"missing"},"missing",{"$f":"IF(BD57=\"\",\"\",IF(AY57=0,\"NA\",IF(CW57=\"ND\",\"ND\",IF(OR($BN$12=\"!error\",BD57=\"!error\",AND(BD57=\"missing\",ISNUMBER(BF57)),IF(BE57=1,BF57=\"!error\",0),BI57=\"!error\",BJ57=\"!error\"),\"!error\",IF(OR(BD57=\"NA\",AND(ISNUMBER($BN$12),$BN$12=0),AND(BE57<>0,ISNUMBER(BK57),BK57=0),AND(BE57=1,ISNUMBER(BJ57),BJ57>9),AND(BE57=2,ISNUMBER(BJ57),OR(BJ57<6,BJ57>=9.5)),AND(OR(BE57=3,BE57=4),ISNUMBER(BJ57),OR(BJ57<5.5,BJ57>=9.5))),\"NA\",IF(AND(ISNUMBER($BN$12),BE57<>0,IF(BE57=1,ISNUMBER(BF57),1),ISNUMBER(BI57),ISNUMBER(BJ57)),CT_Giardia(BE57,$BN$12,BI57,BJ57,IF(BE57=1,BF57,)),IF(COUNTIF(BE57,\"<>0\")+COUNT(BF57,BG57,BI57,BJ57)=5,\"!error\",\"missing\")))))))","v":"missing"},{"$f":"IF(BD57=\"\",\"\",IF(OR(AY57=0,AND(ISNUMBER($BN$12),$BN$12=0)),\"NA\",IF(CW57=\"ND\",\"ND\",IF(OR(BK57=\"!error\",BL57=\"!error\",BN57=\"!error\"),\"!error\",IF(BD57=\"NA\",\"NA\",IF(BL57=\"NA\",0,IF(AND(BE57<>99,ISNUMBER(BK57),ISNUMBER(BL57)),BK57/BL57,IF(AND(BE57=99,BN57=0.5),BN57/$BN$12,\"missing\"))))))))","v":"missing"},{"$f":"IF(BD57=\"\",\"\",IF(AY57=0,\"NA\",IF(CW57=\"ND\",\"ND\",IF(OR(BD57=\"!error\",AND(BD57=\"missing\",ISNUMBER(BF57)),BF57=\"!error\",BH57=\"!error\",BI57=\"!error\",BJ57=\"!error\"),\"!error\",IF(BD57=\"NA\",\"NA\",IF(OR(AND(BE57<>0,ISNUMBER(BK57),BK57=0),AND(BE57=1,ISNUMBER(BJ57),BJ57>9),AND(BE57=2,ISNUMBER(BJ57),OR(BJ57<6,BJ57>=9.5)),AND(OR(BE57=3,BE57=4),ISNUMBER(BJ57),OR(BJ57<5.5,BJ57>=9.5))),0,IF(AND(ISNUMBER($BN$12),BE57<>0,ISNUMBER(BF57),ISNUMBER(BH57),ISNUMBER(BI57),ISNUMBER(BJ57)),log_Giardia(BE57,$BN$12,BI57,BJ57,BF57,BH57),IF(COUNTIF(BE57,\"<>0\")+COUNT(BF57,BG57,BI57,BJ57)=5,\"!error\",\"missing\"))))))))","v":"missing"},{"$f":"IF(BD57=\"\",\"\",IF(AY57=0,\"NA\",IF(CW57=\"ND\",\"ND\",IF(OR($BP$12=\"!error\",BD57=\"!error\",AND(BD57=\"missing\",ISNUMBER(BF57)),BI57=\"!error\",BJ57=\"!error\"),\"!error\",IF(OR(BD57=\"NA\",AND(ISNUMBER($BP$12),$BP$12=0),AND(BE57<>0,ISNUMBER(BK57),BK57=0),AND(BE57=1,ISNUMBER(BJ57),BJ57>=10.5),AND(BE57=2,ISNUMBER(BJ57),OR(BJ57<6,BJ57>=9.5)),AND(BE57=3,ISNUMBER(BJ57),OR(BJ57<6,BJ57>9)),AND(BE57=4,ISNUMBER(BJ57),OR(BJ57<6,BJ57>10))),\"NA\",IF(AND(ISNUMBER($BP$12),BE57<>0,ISNUMBER(BI57),ISNUMBER(BJ57)),CT_Virus(BE57,$BP$12,BI57,BJ57),IF(COUNTIF(BE57,\"<>0\")+COUNT(BF57,BG57,BI57,BJ57)=5,\"!error\",\"missing\")))))))","v":"missing"},{"$f":"IF(BD57=\"\",\"\",IF(OR(AY57=0,AND(ISNUMBER($BP$12),$BP$12=0)),\"NA\",IF(CW57=\"ND\",\"ND\",IF(OR(BK57=\"!error\",BO57=\"!error\",BQ57=\"!error\"),\"!error\",IF(BD57=\"NA\",\"NA\",IF(BO57=\"NA\",0,IF(AND(BE57<>99,ISNUMBER(BK57),ISNUMBER(BO57)),BK57/BO57,IF(AND(BE57=99,BQ57=1),BQ57/$BP$12,\"missing\"))))))))","v":"missing"},{"$f":"IF(BD57=\"\",\"\",IF(AY57=0,\"NA\",IF(CW57=\"ND\",\"ND\",IF(OR(BD57=\"!error\",AND(BD57=\"missing\",ISNUMBER(BF57)),BF57=\"!error\",BH57=\"!error\",BI57=\"!error\",BJ57=\"!error\"),\"!error\",IF(BD57=\"NA\",\"NA\",IF(OR(AND(BE57<>0,ISNUMBER(BK57),BK57=0),AND(BE57=1,ISNUMBER(BJ57),BJ57>=10.5),AND(BE57=2,ISNUMBER(BJ57),OR(BJ57<6,BJ57>=9.5)),AND(BE57=3,ISNUMBER(BJ57),OR(BJ57<6,BJ57>9)),AND(BE57=4,ISNUMBER(BJ57),OR(BJ57<6,BJ57>10))),0,IF(AND(ISNUMBER($BP$12),BE57<>0,ISNUMBER(BF57),ISNUMBER(BH57),ISNUMBER(BI57),ISNUMBER(BJ57)),Log_Virus(BE57,$BP$12,BI57,BJ57,BF57,BH57),IF(COUNTIF(BE57,\"<>0\")+COUNT(BF57,BG57,BI57,BJ57)=5,\"!error\",\"missing\"))))))))","v":"missing"},{"$f":"IF($BJ$14=0,0,IF(COUNTIF(OFFSET($BD56,0,0,MIN($BJ$14,5),1),\"<>NA\")+IF($BJ$14>5,COUNTIF(OFFSET($BV56,0,0,$BJ$14-5,1),\"<>NA\"),0),1,0))","v":1},{"$f":"IF($BJ$14=0,0,IF(COUNTIF(OFFSET($BD56,0,0,MIN($BJ$14,5),1),\"O3\")+COUNTIF(OFFSET($BD56,0,0,MIN($BJ$14,5),1),\"O3 Cell 1\")+IF($BJ$14>5,COUNTIF(OFFSET($BV56,0,0,$BJ$14-5,1),\"O3\"),0)+IF($BJ$14>5,COUNTIF(OFFSET($BV56,0,0,$BJ$14-5,1),\"O3 Cell 1\"),0),1,0))","v":0},{"$f":"IF(OR($AY57=0,AND(COUNTA(D62,F62:G62)=0,COUNTIF(E62,0))),\"NA\",IF(COUNTA(D62:G62),IF(BS57,4,5),IF($BJ$15=1,IF(BS57,4,IF(BR57,5,6)),IF(BV57=\"!error\",IF(BS57,4,5),IF(BS57,\"5B\",6)))))","v":6},{"$f":"$BJ$11","v":7},{"$f":"IF(AND(IF($BN$4=\"missing\",10,$BN$4)>=7,$AY57<>\"\"),IF(OR($AY57=0,AND($B62=\"NA\",COUNTA($D62,$F62:$G62)=0,COUNTIF($E62,0)),AND($B62=\"NA\",COUNTA($D62:$G62)=0,IF($BJ$14=0,0,COUNTIF(OFFSET($BD56,0,0,MIN($BJ$14,5),1),\"NA\")+IF($BJ$14>5,COUNTIF(OFFSET($BV56,0,0,$BJ$14-5,1),\"NA\"),0))=$BJ$14),AND($B62=\"NA\",COUNTA($D62:$G62)=0,IF($BJ$14<5,COUNTA(OFFSET($D56,$BJ$14,0,MIN(5-$BJ$14,$BJ$15),4))-COUNTIF(OFFSET($E56,$BJ$14,0,MIN(5-$BJ$14,$BJ$15),1),0),0)+IF($BJ$14+$BJ$15>5,COUNTA(OFFSET($D61,MAX($BJ$14-5,0),0,MIN($BJ$14+$BJ$15-5,$BJ$15),4))-COUNTIF(OFFSET($E61,MAX($BJ$14-5,0),0,MIN($BJ$14+$BJ$15-5,$BJ$15),1),0),0)),AND($B62=\"NA\",COUNTA($D62:$G62)=0,IF($BJ$14<5,COUNTIF(OFFSET($B56,$BJ$14,0,MIN(5-$BJ$14,$BJ$15),1),\"NA\"),0)+IF($BJ$14+$BJ$15>5,COUNTIF(OFFSET($B61,MAX($BJ$14-5,0),0,MIN($BJ$14+$BJ$15-5,$BJ$15),1),\"NA\"),0)<>$BJ$15)),\"NA\",IF($B62=\"\",\"missing\",IF(AND($B62<>\"NA\",COUNTA($D62,$F62:$G62)+COUNTIF($E62,\"<>0\")),UPPER($B62),\"!error\"))),\"\")","v":""},"",{"$f":"IF(BV57=\"\",\"\",IF(BV57=\"NA\",\"NA\",IF(ISBLANK($D62),\"missing\",IF(AND(BW57=1,ISNUMBER($D62),$D62>4),4,IF(AND(ISNUMBER($D62),$D62>=0),$D62,IF(AND(ISTEXT($D62),$D62=\"ND\"),\"ND\",\"!error\"))))))","v":""},{"$f":"IF(BV57=\"\",\"\",IF(BV57=\"NA\",\"NA\",IF(ISBLANK($E62),\"missing\",IF(OR(AND(ISBLANK($B62),COUNT(BX57,CA57:CB57)=0,ISNUMBER($E62),$E62=0),AND(ISNUMBER($E62),$E62>0),AND(ISTEXT($E62),$E62=\"ND\")),$E62,\"!error\"))))","v":""},{"$f":"IF(BV57=\"\",\"\",IF(AY57=0,\"NA\",IF(OR($BJ$12=\"!error\",$BJ$13=\"!error\",BY57=\"!error\"),\"!error\",IF(BV57=\"NA\",\"NA\",IF(AND(ISNUMBER(BY57),BY57=0),0,IF(AND(ISNUMBER($BJ$12),ISNUMBER($BJ$13),ISNUMBER(BY57)),$BJ$13*$BJ$12/BY57,IF(BY57=\"ND\",\"ND\",\"missing\")))))))","v":""},{"$f":"IF(BV57=\"\",\"\",IF(BV57=\"NA\",\"NA\",IF(ISBLANK($F62),\"missing\",IF(OR(ISNUMBER($F62),$F62=\"ND\"),$F62,\"!error\"))))","v":""},{"$f":"IF(BV57=\"\",\"\",IF(BV57=\"NA\",\"NA\",IF(ISBLANK($G62),\"missing\",IF(OR(AND(ISNUMBER($G62),$G62>=0,$G62<=14),$G62=\"ND\"),$G62,\"!error\"))))","v":""},"",{"$f":"IF(BV57=\"\",\"\",IF(AY57=0,\"NA\",IF(CX57=\"ND\",\"ND\",IF(OR($BN$12=\"!error\",BV57=\"!error\",AND(BV57=\"missing\",ISNUMBER(BX57)),IF(BW57=1,BX57=\"!error\",0),CA57=\"!error\",CB57=\"!error\"),\"!error\",IF(OR(BV57=\"NA\",AND(ISNUMBER($BN$12),$BN$12=0),AND(BW57<>0,ISNUMBER(CC57),CC57=0),AND(BW57=1,ISNUMBER(CB57),CB57>9),AND(BW57>1,ISNUMBER(CB57),OR(CB57<6,CB57>=9.5))),\"NA\",IF(AND(ISNUMBER($BN$12),BW57<>0,IF(BW57=1,ISNUMBER(BX57),1),ISNUMBER(CA57),ISNUMBER(CB57)),CT_Giardia(BW57,$BN$12,CA57,CB57,IF(BW57=1,BX57,)),IF(COUNTIF(BW57,\"<>0\")+COUNT(BX57,BY57,CA57,CB57)=5,\"!error\",\"missing\")))))))","v":""},{"$f":"IF(BV57=\"\",\"\",IF(OR(AY57=0,AND(ISNUMBER($BN$12),$BN$12=0)),\"NA\",IF(CX57=\"ND\",\"ND\",IF(OR(CC57=\"!error\",CD57=\"!error\",CF57=\"!error\"),\"!error\",IF(BV57=\"NA\",\"NA\",IF(CD57=\"NA\",0,IF(AND(ISNUMBER(CC57),ISNUMBER(CD57)),CC57/CD57,IF(AND(BW57=99,CF57=0.5),CF57/$BN$12,\"missing\"))))))))","v":""},{"$f":"IF(BV57=\"\",\"\",IF(AY57=0,\"NA\",IF(CX57=\"ND\",\"ND\",IF(OR(BV57=\"!error\",AND(BV57=\"missing\",ISNUMBER(BX57)),BX57=\"!error\",BZ57=\"!error\",CA57=\"!error\",CB57=\"!error\"),\"!error\",IF(BV57=\"NA\",\"NA\",IF(OR(AND(BW57<>0,ISNUMBER(CC57),CC57=0),AND(BW57=1,ISNUMBER(CB57),CB57>9),AND(BW57>1,ISNUMBER(CB57),OR(CB57<6,CB57>=9.5))),0,IF(AND(ISNUMBER($BN$12),BW57<>0,ISNUMBER(BX57),ISNUMBER(BZ57),ISNUMBER(CA57),ISNUMBER(CB57)),log_Giardia(BW57,$BN$12,CA57,CB57,BX57,BZ57),IF(COUNTIF(BW57,\"<>0\")+COUNT(BX57,BY57,CA57,CB57)=5,\"!error\",\"missing\"))))))))","v":""},{"$f":"IF(BV57=\"\",\"\",IF(AY57=0,\"NA\",IF(CX57=\"ND\",\"ND\",IF(OR($BP$12=\"!error\",BV57=\"!error\",AND(BV57=\"missing\",ISNUMBER(BX57)),CA57=\"!error\",CB57=\"!error\"),\"!error\",IF(OR(BV57=\"NA\",AND(ISNUMBER($BP$12),$BP$12=0),AND(BW57<>0,ISNUMBER(CC57),CC57=0),AND(BW57=1,ISNUMBER(CB57),OR(CB57<5.5,CB57>=10.5)),AND(OR(BW57=2,BW57=4),ISNUMBER(CB57),OR(CB57<6,CB57>=9.5)),AND(BW57=3,ISNUMBER(CB57),OR(CB57<6,CB57>9))),\"NA\",IF(AND(ISNUMBER($BP$12),BW57<>0,ISNUMBER(CA57),ISNUMBER(CB57)),CT_Virus(BW57,$BP$12,CA57,CB57),IF(COUNTIF(BW57,\"<>0\")+COUNT(BX57,BY57,CA57,CB57)=5,\"!error\",\"missing\")))))))","v":""},{"$f":"IF(BV57=\"\",\"\",IF(OR(AY57=0,AND(ISNUMBER($BP$12),$BP$12=0)),\"NA\",IF(CX57=\"ND\",\"ND\",IF(OR(CC57=\"!error\",CG57=\"!error\",CI57=\"!error\"),\"!error\",IF(BV57=\"NA\",\"NA\",IF(CG57=\"NA\",0,IF(AND(ISNUMBER(CC57),ISNUMBER(CG57)),CC57/CG57,IF(AND(BW57=99,CI57=1),CI57/$BP$12,\"missing\"))))))))","v":""},{"$f":"IF(BV57=\"\",\"\",IF(AY57=0,\"NA\",IF(CX57=\"ND\",\"ND\",IF(OR(BV57=\"!error\",AND(BV57=\"missing\",ISNUMBER(BX57)),BX57=\"!error\",BZ57=\"!error\",CA57=\"!error\",CB57=\"!error\"),\"!error\",IF(BV57=\"NA\",\"NA\",IF(OR(AND(BW57<>0,ISNUMBER(CC57),CC57=0),AND(BW57=1,ISNUMBER(CB57),OR(CB57<5.5,CB57>=10.5)),AND(OR(BW57=2,BW57=4),ISNUMBER(CB57),OR(CB57<6,CB57>=9.5)),AND(BW57=3,ISNUMBER(CB57),OR(CB57<6,CB57>9))),0,IF(AND(ISNUMBER($BP$12),BW57<>0,ISNUMBER(BX57),ISNUMBER(BZ57),ISNUMBER(CA57),ISNUMBER(CB57)),Log_Virus(BW57,$BP$12,CA57,CB57,BX57,BZ57),IF(COUNTIF(BW57,\"<>0\")+COUNT(BX57,BY57,CA57,CB57)=5,\"!error\",\"missing\"))))))))","v":""},null,null,null,null,null,null,null,null,null,null,null,null,null,{"$f":"IF(OR(BF57=\"ND\",BG57=\"ND\",BI57=\"ND\",BJ57=\"ND\"),\"ND\",\"data\")","v":"data"},{"$f":"IF(OR(BX57=\"ND\",BY57=\"ND\",CA57=\"ND\",CB57=\"ND\"),\"ND\",\"data\")","v":"data"}]
[null," ",{"$f":"$E$15","v":3},null,null,null,null,{"$f":"IF(BL58=\"!error\",\"!error\",$BK58)","v":"missing"},"missing","missing","missing","missing",null,null,null,null,"",null,null,null,null,null,null,null,null,null,null,null,null,null,null,null,null,null,null,null,null,null,null,null,null,null,null,null,null,null,null,null,null,null,1,{"$f":"IF($BF$14=0,0,IF(COUNTIF(OFFSET($BD56,0,0,MIN($BF$14,5),1),\"<>NA\")+IF($BF$14>5,COUNTIF(OFFSET($BV56,0,0,$BF$14-5,1),\"<>NA\"),0),1,0))","v":1},{"$f":"IF($BF$14=0,0,IF(COUNTIF(OFFSET($BD56,0,0,MIN($BF$14,5),1),\"O3\")+COUNTIF(OFFSET($BD56,0,0,MIN($BF$14,5),1),\"O3 Cell 1\")+IF($BF$14>5,COUNTIF(OFFSET($BV56,0,0,$BF$14-5,1),\"O3\"),0)+IF($BF$14>5,COUNTIF(OFFSET($BV56,0,0,$BF$14-5,1),\"O3 Cell 1\"),0),1,0))","v":0},{"$f":"IF(OR($AY58=0,AND(COUNTA(D58,F58:G58)=0,COUNTIF(E58,0))),\"NA\",IF(COUNTA(D58:G58),IF(BA58,4,5),IF($BF$15=1,IF(BA58,4,IF(AZ58,5,6)),IF(BD58=\"!error\",IF(BA58,4,5),IF(BA58,\"5B\",6)))))","v":5},{"$f":"$BF$11","v":3},{"$f":"IF(AND(IF($BN$4=\"missing\",10,$BN$4)>=3,$AY58<>\"\"),IF(OR($AY58=0,AND($B58=\"NA\",COUNTA($D58,$F58:$G58)=0,COUNTIF($E58,0)),AND($B58=\"NA\",COUNTA($D58:$G58)=0,IF($BF$14=0,0,COUNTIF(OFFSET($BD56,0,0,MIN($BF$14,5),1),\"NA\")+IF($BF$14>5,COUNTIF(OFFSET($BV56,0,0,$BF$14-5,1),\"NA\"),0))=$BF$14),AND($B58=\"NA\",COUNTA($D58:$G58)=0,IF($BF$14<5,COUNTA(OFFSET($D56,$BF$14,0,MIN(5-$BF$14,$BF$15),4))-COUNTIF(OFFSET($E56,$BF$14,0,MIN(5-$BF$14,$BF$15),1),0),0)+IF($BF$14+$BF$15>5,COUNTA(OFFSET($D61,MAX($BF$14-5,0),0,MIN($BF$14+$BF$15-5,$BF$15),4))-COUNTIF(OFFSET($E61,MAX($BF$14-5,0),0,MIN($BF$14+$BF$15-5,$BF$15),1),0),0)),AND($B58=\"NA\",COUNTA($D58:$G58)=0,IF($BF$14<5,COUNTIF(OFFSET($B56,$BF$14,0,MIN(5-$BF$14,$BF$15),1),\"NA\"),0)+IF($BF$14+$BF$15>5,COUNTIF(OFFSET($B61,MAX($BF$14-5,0),0,MIN($BF$14+$BF$15-5,$BF$15),1),\"NA\"),0)<>$BF$15)),\"NA\",IF($B58=\"\",\"missing\",IF(AND($B58<>\"NA\",COUNTA($D58,$F58:$G58)+COUNTIF($E58,\"<>0\")),UPPER($B58),\"!error\"))),\"\")","v":" "},0,"missing","missing",{"$f":"IF(BD58=\"\",\"\",IF(AY58=0,\"NA\",IF(OR($BF$12=\"!error\",$BF$13=\"!error\",BG58=\"!error\"),\"!error\",IF(BD58=\"NA\",\"NA\",IF(AND(ISNUMBER(BG58),BG58=0),0,IF(AND(ISNUMBER($BF$12),ISNUMBER($BF$13),ISNUMBER(BG58)),$BF$13*$BF$12/BG58,IF(BG58=\"ND\",\"ND\",\"missing\")))))))","v":"missing"},"missing","missing","missing",{"$f":"IF(BD58=\"\",\"\",IF(AY58=0,\"NA\",IF(CW58=\"ND\",\"ND\",IF(OR($BN$12=\"!error\",BD58=\"!error\",AND(BD58=\"missing\",ISNUMBER(BF58)),IF(BE58=1,BF58=\"!error\",0),BI58=\"!error\",BJ58=\"!error\"),\"!error\",IF(OR(BD58=\"NA\",AND(ISNUMBER($BN$12),$BN$12=0),AND(BE58<>0,ISNUMBER(BK58),BK58=0),AND(BE58=1,ISNUMBER(BJ58),BJ58>9),AND(BE58=2,ISNUMBER(BJ58),OR(BJ58<6,BJ58>=9.5)),AND(OR(BE58=3,BE58=4),ISNUMBER(BJ58),OR(BJ58<5.5,BJ58>=9.5))),\"NA\",IF(AND(ISNUMBER($BN$12),BE58<>0,IF(BE58=1,ISNUMBER(BF58),1),ISNUMBER(BI58),ISNUMBER(BJ58)),CT_Giardia(BE58,$BN$12,BI58,BJ58,IF(BE58=1,BF58,)),IF(COUNTIF(BE58,\"<>0\")+COUNT(BF58,BG58,BI58,BJ58)=5,\"!error\",\"missing\")))))))","v":"missing"},{"$f":"IF(BD58=\"\",\"\",IF(OR(AY58=0,AND(ISNUMBER($BN$12),$BN$12=0)),\"NA\",IF(CW58=\"ND\",\"ND\",IF(OR(BK58=\"!error\",BL58=\"!error\",BN58=\"!error\"),\"!error\",IF(BD58=\"NA\",\"NA\",IF(BL58=\"NA\",0,IF(AND(BE58<>99,ISNUMBER(BK58),ISNUMBER(BL58)),BK58/BL58,IF(AND(BE58=99,BN58=0.5),BN58/$BN$12,\"missing\"))))))))","v":"missing"},{"$f":"IF(BD58=\"\",\"\",IF(AY58=0,\"NA\",IF(CW58=\"ND\",\"ND\",IF(OR(BD58=\"!error\",AND(BD58=\"missing\",ISNUMBER(BF58)),BF58=\"!error\",BH58=\"!error\",BI58=\"!error\",BJ58=\"!error\"),\"!error\",IF(BD58=\"NA\",\"NA\",IF(OR(AND(BE58<>0,ISNUMBER(BK58),BK58=0),AND(BE58=1,ISNUMBER(BJ58),BJ58>9),AND(BE58=2,ISNUMBER(BJ58),OR(BJ58<6,BJ58>=9.5)),AND(OR(BE58=3,BE58=4),ISNUMBER(BJ58),OR(BJ58<5.5,BJ58>=9.5))),0,IF(AND(ISNUMBER($BN$12),BE58<>0,ISNUMBER(BF58),ISNUMBER(BH58),ISNUMBER(BI58),ISNUMBER(BJ58)),log_Giardia(BE58,$BN$12,BI58,BJ58,BF58,BH58),IF(COUNTIF(BE58,\"<>0\")+COUNT(BF58,BG58,BI58,BJ58)=5,\"!error\",\"missing\"))))))))","v":"missing"},{"$f":"IF(BD58=\"\",\"\",IF(AY58=0,\"NA\",IF(CW58=\"ND\",\"ND\",IF(OR($BP$12=\"!error\",BD58=\"!error\",AND(BD58=\"missing\",ISNUMBER(BF58)),BI58=\"!error\",BJ58=\"!error\"),\"!error\",IF(OR(BD58=\"NA\",AND(ISNUMBER($BP$12),$BP$12=0),AND(BE58<>0,ISNUMBER(BK58),BK58=0),AND(BE58=1,ISNUMBER(BJ58),BJ58>=10.5),AND(BE58=2,ISNUMBER(BJ58),OR(BJ58<6,BJ58>=9.5)),AND(BE58=3,ISNUMBER(BJ58),OR(BJ58<6,BJ58>9)),AND(BE58=4,ISNUMBER(BJ58),OR(BJ58<6,BJ58>10))),\"NA\",IF(AND(ISNUMBER($BP$12),BE58<>0,ISNUMBER(BI58),ISNUMBER(BJ58)),CT_Virus(BE58,$BP$12,BI58,BJ58),IF(COUNTIF(BE58,\"<>0\")+COUNT(BF58,BG58,BI58,BJ58)=5,\"!error\",\"missing\")))))))","v":"missing"},{"$f":"IF(BD58=\"\",\"\",IF(OR(AY58=0,AND(ISNUMBER($BP$12),$BP$12=0)),\"NA\",IF(CW58=\"ND\",\"ND\",IF(OR(BK58=\"!error\",BO58=\"!error\",BQ58=\"!error\"),\"!error\",IF(BD58=\"NA\",\"NA\",IF(BO58=\"NA\",0,IF(AND(BE58<>99,ISNUMBER(BK58),ISNUMBER(BO58)),BK58/BO58,IF(AND(BE58=99,BQ58=1),BQ58/$BP$12,\"missing\"))))))))","v":"missing"},{"$f":"IF(BD58=\"\",\"\",IF(AY58=0,\"NA\",IF(CW58=\"ND\",\"ND\",IF(OR(BD58=\"!error\",AND(BD58=\"missing\",ISNUMBER(BF58)),BF58=\"!error\",BH58=\"!error\",BI58=\"!error\",BJ58=\"!error\"),\"!error\",IF(BD58=\"NA\",\"NA\",IF(OR(AND(BE58<>0,ISNUMBER(BK58),BK58=0),AND(BE58=1,ISNUMBER(BJ58),BJ58>=10.5),AND(BE58=2,ISNUMBER(BJ58),OR(BJ58<6,BJ58>=9.5)),AND(BE58=3,ISNUMBER(BJ58),OR(BJ58<6,BJ58>9)),AND(BE58=4,ISNUMBER(BJ58),OR(BJ58<6,BJ58>10))),0,IF(AND(ISNUMBER($BP$12),BE58<>0,ISNUMBER(BF58),ISNUMBER(BH58),ISNUMBER(BI58),ISNUMBER(BJ58)),Log_Virus(BE58,$BP$12,BI58,BJ58,BF58,BH58),IF(COUNTIF(BE58,\"<>0\")+COUNT(BF58,BG58,BI58,BJ58)=5,\"!error\",\"missing\"))))))))","v":"missing"},{"$f":"IF($BK$14=0,0,IF(COUNTIF(OFFSET($BD56,0,0,MIN($BK$14,5),1),\"<>NA\")+IF($BK$14>5,COUNTIF(OFFSET($BV56,0,0,$BK$14-5,1),\"<>NA\"),0),1,0))","v":1},{"$f":"IF($BK$14=0,0,IF(COUNTIF(OFFSET($BD56,0,0,MIN($BK$14,5),1),\"O3\")+COUNTIF(OFFSET($BD56,0,0,MIN($BK$14,5),1),\"O3 Cell 1\")+IF($BK$14>5,COUNTIF(OFFSET($BV56,0,0,$BK$14-5,1),\"O3\"),0)+IF($BK$14>5,COUNTIF(OFFSET($BV56,0,0,$BK$14-5,1),\"O3 Cell 1\"),0),1,0))","v":0},{"$f":"IF(OR($AY58=0,AND(COUNTA(D63,F63:G63)=0,COUNTIF(E63,0))),\"NA\",IF(COUNTA(D63:G63),IF(BS58,4,5),IF($BK$15=1,IF(BS58,4,IF(BR58,5,6)),IF(BV58=\"!error\",IF(BS58,4,5),IF(BS58,\"5B\",6)))))","v":6},{"$f":"$BK$11","v":8},{"$f":"IF(AND(IF($BN$4=\"missing\",10,$BN$4)>=8,$AY58<>\"\"),IF(OR($AY58=0,AND($B63=\"NA\",COUNTA($D63,$F63:$G63)=0,COUNTIF($E63,0)),AND($B63=\"NA\",COUNTA($D63:$G63)=0,IF($BK$14=0,0,COUNTIF(OFFSET($BD56,0,0,MIN($BK$14,5),1),\"NA\")+IF($BK$14>5,COUNTIF(OFFSET($BV56,0,0,$BK$14-5,1),\"NA\"),0))=$BK$14),AND($B63=\"NA\",COUNTA($D63:$G63)=0,IF($BK$14<5,COUNTA(OFFSET($D56,$BK$14,0,MIN(5-$BK$14,$BK$15),4))-COUNTIF(OFFSET($E56,$BK$14,0,MIN(5-$BK$14,$BK$15),1),0),0)+IF($BK$14+$BK$15>5,COUNTA(OFFSET($D61,MAX($BK$14-5,0),0,MIN($BK$14+$BK$15-5,$BK$15),4))-COUNTIF(OFFSET($E61,MAX($BK$14-5,0),0,MIN($BK$14+$BK$15-5,$BK$15),1),0),0)),AND($B63=\"NA\",COUNTA($D63:$G63)=0,IF($BK$14<5,COUNTIF(OFFSET($B56,$BK$14,0,MIN(5-$BK$14,$BK$15),1),\"NA\"),0)+IF($BK$14+$BK$15>5,COUNTIF(OFFSET($B61,MAX($BK$14-5,0),0,MIN($BK$14+$BK$15-5,$BK$15),1),\"NA\"),0)<>$BK$15)),\"NA\",IF($B63=\"\",\"missing\",IF(AND($B63<>\"NA\",COUNTA($D63,$F63:$G63)+COUNTIF($E63,\"<>0\")),UPPER($B63),\"!error\"))),\"\")","v":""},"",{"$f":"IF(BV58=\"\",\"\",IF(BV58=\"NA\",\"NA\",IF(ISBLANK($D63),\"missing\",IF(AND(BW58=1,ISNUMBER($D63),$D63>4),4,IF(AND(ISNUMBER($D63),$D63>=0),$D63,IF(AND(ISTEXT($D63),$D63=\"ND\"),\"ND\",\"!error\"))))))","v":""},{"$f":"IF(BV58=\"\",\"\",IF(BV58=\"NA\",\"NA\",IF(ISBLANK($E63),\"missing\",IF(OR(AND(ISBLANK($B63),COUNT(BX58,CA58:CB58)=0,ISNUMBER($E63),$E63=0),AND(ISNUMBER($E63),$E63>0),AND(ISTEXT($E63),$E63=\"ND\")),$E63,\"!error\"))))","v":""},{"$f":"IF(BV58=\"\",\"\",IF(AY58=0,\"NA\",IF(OR($BK$12=\"!error\",$BK$13=\"!error\",BY58=\"!error\"),\"!error\",IF(BV58=\"NA\",\"NA\",IF(AND(ISNUMBER(BY58),BY58=0),0,IF(AND(ISNUMBER($BK$12),ISNUMBER($BK$13),ISNUMBER(BY58)),$BK$13*$BK$12/BY58,IF(BY58=\"ND\",\"ND\",\"missing\")))))))","v":""},{"$f":"IF(BV58=\"\",\"\",IF(BV58=\"NA\",\"NA\",IF(ISBLANK($F63),\"missing\",IF(OR(ISNUMBER($F63),$F63=\"ND\"),$F63,\"!error\"))))","v":""},{"$f":"IF(BV58=\"\",\"\",IF(BV58=\"NA\",\"NA\",IF(ISBLANK($G63),\"missing\",IF(OR(AND(ISNUMBER($G63),$G63>=0,$G63<=14),$G63=\"ND\"),$G63,\"!error\"))))","v":""},"",{"$f":"IF(BV58=\"\",\"\",IF(AY58=0,\"NA\",IF(CX58=\"ND\",\"ND\",IF(OR($BN$12=\"!error\",BV58=\"!error\",AND(BV58=\"missing\",ISNUMBER(BX58)),IF(BW58=1,BX58=\"!error\",0),CA58=\"!error\",CB58=\"!error\"),\"!error\",IF(OR(BV58=\"NA\",AND(ISNUMBER($BN$12),$BN$12=0),AND(BW58<>0,ISNUMBER(CC58),CC58=0),AND(BW58=1,ISNUMBER(CB58),CB58>9),AND(BW58>1,ISNUMBER(CB58),OR(CB58<6,CB58>=9.5))),\"NA\",IF(AND(ISNUMBER($BN$12),BW58<>0,IF(BW58=1,ISNUMBER(BX58),1),ISNUMBER(CA58),ISNUMBER(CB58)),CT_Giardia(BW58,$BN$12,CA58,CB58,IF(BW58=1,BX58,)),IF(COUNTIF(BW58,\"<>0\")+COUNT(BX58,BY58,CA58,CB58)=5,\"!error\",\"missing\")))))))","v":""},{"$f":"IF(BV58=\"\",\"\",IF(OR(AY58=0,AND(ISNUMBER($BN$12),$BN$12=0)),\"NA\",IF(CX58=\"ND\",\"ND\",IF(OR(CC58=\"!error\",CD58=\"!error\",CF58=\"!error\"),\"!error\",IF(BV58=\"NA\",\"NA\",IF(CD58=\"NA\",0,IF(AND(ISNUMBER(CC58),ISNUMBER(CD58)),CC58/CD58,IF(AND(BW58=99,CF58=0.5),CF58/$BN$12,\"missing\"))))))))","v":""},{"$f":"IF(BV58=\"\",\"\",IF(AY58=0,\"NA\",IF(CX58=\"ND\",\"ND\",IF(OR(BV58=\"!error\",AND(BV58=\"missing\",ISNUMBER(BX58)),BX58=\"!error\",BZ58=\"!error\",CA58=\"!error\",CB58=\"!error\"),\"!error\",IF(BV58=\"NA\",\"NA\",IF(OR(AND(BW58<>0,ISNUMBER(CC58),CC58=0),AND(BW58=1,ISNUMBER(CB58),CB58>9),AND(BW58>1,ISNUMBER(CB58),OR(CB58<6,CB58>=9.5))),0,IF(AND(ISNUMBER($BN$12),BW58<>0,ISNUMBER(BX58),ISNUMBER(BZ58),ISNUMBER(CA58),ISNUMBER(CB58)),log_Giardia(BW58,$BN$12,CA58,CB58,BX58,BZ58),IF(COUNTIF(BW58,\"<>0\")+COUNT(BX58,BY58,CA58,CB58)=5,\"!error\",\"missing\"))))))))","v":""},{"$f":"IF(BV58=\"\",\"\",IF(AY58=0,\"NA\",IF(CX58=\"ND\",\"ND\",IF(OR($BP$12=\"!error\",BV58=\"!error\",AND(BV58=\"missing\",ISNUMBER(BX58)),CA58=\"!error\",CB58=\"!error\"),\"!error\",IF(OR(BV58=\"NA\",AND(ISNUMBER($BP$12),$BP$12=0),AND(BW58<>0,ISNUMBER(CC58),CC58=0),AND(BW58=1,ISNUMBER(CB58),OR(CB58<5.5,CB58>=10.5)),AND(OR(BW58=2,BW58=4),ISNUMBER(CB58),OR(CB58<6,CB58>=9.5)),AND(BW58=3,ISNUMBER(CB58),OR(CB58<6,CB58>9))),\"NA\",IF(AND(ISNUMBER($BP$12),BW58<>0,ISNUMBER(CA58),ISNUMBER(CB58)),CT_Virus(BW58,$BP$12,CA58,CB58),IF(COUNTIF(BW58,\"<>0\")+COUNT(BX58,BY58,CA58,CB58)=5,\"!error\",\"missing\")))))))","v":""},{"$f":"IF(BV58=\"\",\"\",IF(OR(AY58=0,AND(ISNUMBER($BP$12),$BP$12=0)),\"NA\",IF(CX58=\"ND\",\"ND\",IF(OR(CC58=\"!error\",CG58=\"!error\",CI58=\"!error\"),\"!error\",IF(BV58=\"NA\",\"NA\",IF(CG58=\"NA\",0,IF(AND(ISNUMBER(CC58),ISNUMBER(CG58)),CC58/CG58,IF(AND(BW58=99,CI58=1),CI58/$BP$12,\"missing\"))))))))","v":""},{"$f":"IF(BV58=\"\",\"\",IF(AY58=0,\"NA\",IF(CX58=\"ND\",\"ND\",IF(OR(BV58=\"!error\",AND(BV58=\"missing\",ISNUMBER(BX58)),BX58=\"!error\",BZ58=\"!error\",CA58=\"!error\",CB58=\"!error\"),\"!error\",IF(BV58=\"NA\",\"NA\",IF(OR(AND(BW58<>0,ISNUMBER(CC58),CC58=0),AND(BW58=1,ISNUMBER(CB58),OR(CB58<5.5,CB58>=10.5)),AND(OR(BW58=2,BW58=4),ISNUMBER(CB58),OR(CB58<6,CB58>=9.5)),AND(BW58=3,ISNUMBER(CB58),OR(CB58<6,CB58>9))),0,IF(AND(ISNUMBER($BP$12),BW58<>0,ISNUMBER(BX58),ISNUMBER(BZ58),ISNUMBER(CA58),ISNUMBER(CB58)),Log_Virus(BW58,$BP$12,CA58,CB58,BX58,BZ58),IF(COUNTIF(BW58,\"<>0\")+COUNT(BX58,BY58,CA58,CB58)=5,\"!error\",\"missing\"))))))))","v":""},null,null,null,null,null,null,null,null,null,null,null,null,null,"data","data"]
[null," ",{"$f":"$F$15","v":4},null,null,null,null,{"$f":"IF(BL59=\"!error\",\"!error\",$BK59)","v":""},"","","","",null,null,null,null,"",null,null,null,null,null,null,null,null,null,null,null,null,null,null,null,null,null,null,null,null,null,null,null,null,null,null,null,null,null,null,null,null,null,1,{"$f":"IF($BG$14=0,0,IF(COUNTIF(OFFSET($BD56,0,0,MIN($BG$14,5),1),\"<>NA\")+IF($BG$14>5,COUNTIF(OFFSET($BV56,0,0,$BG$14-5,1),\"<>NA\"),0),1,0))","v":1},{"$f":"IF($BG$14=0,0,IF(COUNTIF(OFFSET($BD56,0,0,MIN($BG$14,5),1),\"O3\")+COUNTIF(OFFSET($BD56,0,0,MIN($BG$14,5),1),\"O3 Cell 1\")+IF($BG$14>5,COUNTIF(OFFSET($BV56,0,0,$BG$14-5,1),\"O3\"),0)+IF($BG$14>5,COUNTIF(OFFSET($BV56,0,0,$BG$14-5,1),\"O3 Cell 1\"),0),1,0))","v":0},{"$f":"IF(OR($AY59=0,AND(COUNTA(D59,F59:G59)=0,COUNTIF(E59,0))),\"NA\",IF(COUNTA(D59:G59),IF(BA59,4,5),IF($BG$15=1,IF(BA59,4,IF(AZ59,5,6)),IF(BD59=\"!error\",IF(BA59,4,5),IF(BA59,\"5B\",6)))))","v":6},{"$f":"$BG$11","v":4},{"$f":"IF(AND(IF($BN$4=\"missing\",10,$BN$4)>=4,$AY59<>\"\"),IF(OR($AY59=0,AND($B59=\"NA\",COUNTA($D59,$F59:$G59)=0,COUNTIF($E59,0)),AND($B59=\"NA\",COUNTA($D59:$G59)=0,IF($BG$14=0,0,COUNTIF(OFFSET($BD56,0,0,MIN($BG$14,5),1),\"NA\")+IF($BG$14>5,COUNTIF(OFFSET($BV56,0,0,$BG$14-5,1),\"NA\"),0))=$BG$14),AND($B59=\"NA\",COUNTA($D59:$G59)=0,IF($BG$14<5,COUNTA(OFFSET($D56,$BG$14,0,MIN(5-$BG$14,$BG$15),4))-COUNTIF(OFFSET($E56,$BG$14,0,MIN(5-$BG$14,$BG$15),1),0),0)+IF($BG$14+$BG$15>5,COUNTA(OFFSET($D61,MAX($BG$14-5,0),0,MIN($BG$14+$BG$15-5,$BG$15),4))-COUNTIF(OFFSET($E61,MAX($BG$14-5,0),0,MIN($BG$14+$BG$15-5,$BG$15),1),0),0)),AND($B59=\"NA\",COUNTA($D59:$G59)=0,IF($BG$14<5,COUNTIF(OFFSET($B56,$BG$14,0,MIN(5-$BG$14,$BG$15),1),\"NA\"),0)+IF($BG$14+$BG$15>5,COUNTIF(OFFSET($B61,MAX($BG$14-5,0),0,MIN($BG$14+$BG$15-5,$BG$15),1),\"NA\"),0)<>$BG$15)),\"NA\",IF($B59=\"\",\"missing\",IF(AND($B59<>\"NA\",COUNTA($D59,$F59:$G59)+COUNTIF($E59,\"<>0\")),UPPER($B59),\"!error\"))),\"\")","v":""},"","","",{"$f":"IF(BD59=\"\",\"\",IF(AY59=0,\"NA\",IF(OR($BG$12=\"!error\",$BG$13=\"!error\",BG59=\"!error\"),\"!error\",IF(BD59=\"NA\",\"NA\",IF(AND(ISNUMBER(BG59),BG59=0),0,IF(AND(ISNUMBER($BG$12),ISNUMBER($BG$13),ISNUMBER(BG59)),$BG$13*$BG$12/BG59,IF(BG59=\"ND\",\"ND\",\"missing\")))))))","v":""},"","","",{"$f":"IF(BD59=\"\",\"\",IF(AY59=0,\"NA\",IF(CW59=\"ND\",\"ND\",IF(OR($BN$12=\"!error\",BD59=\"!error\",AND(BD59=\"missing\",ISNUMBER(BF59)),IF(BE59=1,BF59=\"!error\",0),BI59=\"!error\",BJ59=\"!error\"),\"!error\",IF(OR(BD59=\"NA\",AND(ISNUMBER($BN$12),$BN$12=0),AND(BE59<>0,ISNUMBER(BK59),BK59=0),AND(BE59=1,ISNUMBER(BJ59),BJ59>9),AND(BE59=2,ISNUMBER(BJ59),OR(BJ59<6,BJ59>=9.5)),AND(OR(BE59=3,BE59=4),ISNUMBER(BJ59),OR(BJ59<5.5,BJ59>=9.5))),\"NA\",IF(AND(ISNUMBER($BN$12),BE59<>0,IF(BE59=1,ISNUMBER(BF59),1),ISNUMBER(BI59),ISNUMBER(BJ59)),CT_Giardia(BE59,$BN$12,BI59,BJ59,IF(BE59=1,BF59,)),IF(COUNTIF(BE59,\"<>0\")+COUNT(BF59,BG59,BI59,BJ59)=5,\"!error\",\"missing\")))))))","v":""},{"$f":"IF(BD59=\"\",\"\",IF(OR(AY59=0,AND(ISNUMBER($BN$12),$BN$12=0)),\"NA\",IF(CW59=\"ND\",\"ND\",IF(OR(BK59=\"!error\",BL59=\"!error\",BN59=\"!error\"),\"!error\",IF(BD59=\"NA\",\"NA\",IF(BL59=\"NA\",0,IF(AND(BE59<>99,ISNUMBER(BK59),ISNUMBER(BL59)),BK59/BL59,IF(AND(BE59=99,BN59=0.5),BN59/$BN$12,\"missing\"))))))))","v":""},{"$f":"IF(BD59=\"\",\"\",IF(AY59=0,\"NA\",IF(CW59=\"ND\",\"ND\",IF(OR(BD59=\"!error\",AND(BD59=\"missing\",ISNUMBER(BF59)),BF59=\"!error\",BH59=\"!error\",BI59=\"!error\",BJ59=\"!error\"),\"!error\",IF(BD59=\"NA\",\"NA\",IF(OR(AND(BE59<>0,ISNUMBER(BK59),BK59=0),AND(BE59=1,ISNUMBER(BJ59),BJ59>9),AND(BE59=2,ISNUMBER(BJ59),OR(BJ59<6,BJ59>=9.5)),AND(OR(BE59=3,BE59=4),ISNUMBER(BJ59),OR(BJ59<5.5,BJ59>=9.5))),0,IF(AND(ISNUMBER($BN$12),BE59<>0,ISNUMBER(BF59),ISNUMBER(BH59),ISNUMBER(BI59),ISNUMBER(BJ59)),log_Giardia(BE59,$BN$12,BI59,BJ59,BF59,BH59),IF(COUNTIF(BE59,\"<>0\")+COUNT(BF59,BG59,BI59,BJ59)=5,\"!error\",\"missing\"))))))))","v":""},{"$f":"IF(BD59=\"\",\"\",IF(AY59=0,\"NA\",IF(CW59=\"ND\",\"ND\",IF(OR($BP$12=\"!error\",BD59=\"!error\",AND(BD59=\"missing\",ISNUMBER(BF59)),BI59=\"!error\",BJ59=\"!error\"),\"!error\",IF(OR(BD59=\"NA\",AND(ISNUMBER($BP$12),$BP$12=0),AND(BE59<>0,ISNUMBER(BK59),BK59=0),AND(BE59=1,ISNUMBER(BJ59),BJ59>=10.5),AND(BE59=2,ISNUMBER(BJ59),OR(BJ59<6,BJ59>=9.5)),AND(BE59=3,ISNUMBER(BJ59),OR(BJ59<6,BJ59>9)),AND(BE59=4,ISNUMBER(BJ59),OR(BJ59<6,BJ59>10))),\"NA\",IF(AND(ISNUMBER($BP$12),BE59<>0,ISNUMBER(BI59),ISNUMBER(BJ59)),CT_Virus(BE59,$BP$12,BI59,BJ59),IF(COUNTIF(BE59,\"<>0\")+COUNT(BF59,BG59,BI59,BJ59)=5,\"!error\",\"missing\")))))))","v":""},{"$f":"IF(BD59=\"\",\"\",IF(OR(AY59=0,AND(ISNUMBER($BP$12),$BP$12=0)),\"NA\",IF(CW59=\"ND\",\"ND\",IF(OR(BK59=\"!error\",BO59=\"!error\",BQ59=\"!error\"),\"!error\",IF(BD59=\"NA\",\"NA\",IF(BO59=\"NA\",0,IF(AND(BE59<>99,ISNUMBER(BK59),ISNUMBER(BO59)),BK59/BO59,IF(AND(BE59=99,BQ59=1),BQ59/$BP$12,\"missing\"))))))))","v":""},{"$f":"IF(BD59=\"\",\"\",IF(AY59=0,\"NA\",IF(CW59=\"ND\",\"ND\",IF(OR(BD59=\"!error\",AND(BD59=\"missing\",ISNUMBER(BF59)),BF59=\"!error\",BH59=\"!error\",BI59=\"!error\",BJ59=\"!error\"),\"!error\",IF(BD59=\"NA\",\"NA\",IF(OR(AND(BE59<>0,ISNUMBER(BK59),BK59=0),AND(BE59=1,ISNUMBER(BJ59),BJ59>=10.5),AND(BE59=2,ISNUMBER(BJ59),OR(BJ59<6,BJ59>=9.5)),AND(BE59=3,ISNUMBER(BJ59),OR(BJ59<6,BJ59>9)),AND(BE59=4,ISNUMBER(BJ59),OR(BJ59<6,BJ59>10))),0,IF(AND(ISNUMBER($BP$12),BE59<>0,ISNUMBER(BF59),ISNUMBER(BH59),ISNUMBER(BI59),ISNUMBER(BJ59)),Log_Virus(BE59,$BP$12,BI59,BJ59,BF59,BH59),IF(COUNTIF(BE59,\"<>0\")+COUNT(BF59,BG59,BI59,BJ59)=5,\"!error\",\"missing\"))))))))","v":""},{"$f":"IF($BL$14=0,0,IF(COUNTIF(OFFSET($BD56,0,0,MIN($BL$14,5),1),\"<>NA\")+IF($BL$14>5,COUNTIF(OFFSET($BV56,0,0,$BL$14-5,1),\"<>NA\"),0),1,0))","v":1},{"$f":"IF($BL$14=0,0,IF(COUNTIF(OFFSET($BD56,0,0,MIN($BL$14,5),1),\"O3\")+COUNTIF(OFFSET($BD56,0,0,MIN($BL$14,5),1),\"O3 Cell 1\")+IF($BL$14>5,COUNTIF(OFFSET($BV56,0,0,$BL$14-5,1),\"O3\"),0)+IF($BL$14>5,COUNTIF(OFFSET($BV56,0,0,$BL$14-5,1),\"O3 Cell 1\"),0),1,0))","v":0},{"$f":"IF(OR($AY59=0,AND(COUNTA(D64,F64:G64)=0,COUNTIF(E64,0))),\"NA\",IF(COUNTA(D64:G64),IF(BS59,4,5),IF($BL$15=1,IF(BS59,4,IF(BR59,5,6)),IF(BV59=\"!error\",IF(BS59,4,5),IF(BS59,\"5B\",6)))))","v":6},{"$f":"$BL$11","v":9},{"$f":"IF(AND(IF($BN$4=\"missing\",10,$BN$4)>=9,$AY59<>\"\"),IF(OR($AY59=0,AND($B64=\"NA\",COUNTA($D64,$F64:$G64)=0,COUNTIF($E64,0)),AND($B64=\"NA\",COUNTA($D64:$G64)=0,IF($BL$14=0,0,COUNTIF(OFFSET($BD56,0,0,MIN($BL$14,5),1),\"NA\")+IF($BL$14>5,COUNTIF(OFFSET($BV56,0,0,$BL$14-5,1),\"NA\"),0))=$BL$14),AND($B64=\"NA\",COUNTA($D64:$G64)=0,IF($BL$14<5,COUNTA(OFFSET($D56,$BL$14,0,MIN(5-$BL$14,$BL$15),4))-COUNTIF(OFFSET($E56,$BL$14,0,MIN(5-$BL$14,$BL$15),1),0),0)+IF($BL$14+$BL$15>5,COUNTA(OFFSET($D61,MAX($BL$14-5,0),0,MIN($BL$14+$BL$15-5,$BL$15),4))-COUNTIF(OFFSET($E61,MAX($BL$14-5,0),0,MIN($BL$14+$BL$15-5,$BL$15),1),0),0)),AND($B64=\"NA\",COUNTA($D64:$G64)=0,IF($BL$14<5,COUNTIF(OFFSET($B56,$BL$14,0,MIN(5-$BL$14,$BL$15),1),\"NA\"),0)+IF($BL$14+$BL$15>5,COUNTIF(OFFSET($B61,MAX($BL$14-5,0),0,MIN($BL$14+$BL$15-5,$BL$15),1),\"NA\"),0)<>$BL$15)),\"NA\",IF($B64=\"\",\"missing\",IF(AND($B64<>\"NA\",COUNTA($D64,$F64:$G64)+COUNTIF($E64,\"<>0\")),UPPER($B64),\"!error\"))),\"\")","v":""},"",{"$f":"IF(BV59=\"\",\"\",IF(BV59=\"NA\",\"NA\",IF(ISBLANK($D64),\"missing\",IF(AND(BW59=1,ISNUMBER($D64),$D64>4),4,IF(AND(ISNUMBER($D64),$D64>=0),$D64,IF(AND(ISTEXT($D64),$D64=\"ND\"),\"ND\",\"!error\"))))))","v":""},{"$f":"IF(BV59=\"\",\"\",IF(BV59=\"NA\",\"NA\",IF(ISBLANK($E64),\"missing\",IF(OR(AND(ISBLANK($B64),COUNT(BX59,CA59:CB59)=0,ISNUMBER($E64),$E64=0),AND(ISNUMBER($E64),$E64>0),AND(ISTEXT($E64),$E64=\"ND\")),$E64,\"!error\"))))","v":""},{"$f":"IF(BV59=\"\",\"\",IF(AY59=0,\"NA\",IF(OR($BL$12=\"!error\",$BL$13=\"!error\",BY59=\"!error\"),\"!error\",IF(BV59=\"NA\",\"NA\",IF(AND(ISNUMBER(BY59),BY59=0),0,IF(AND(ISNUMBER($BL$12),ISNUMBER($BL$13),ISNUMBER(BY59)),$BL$13*$BL$12/BY59,IF(BY59=\"ND\",\"ND\",\"missing\")))))))","v":""},{"$f":"IF(BV59=\"\",\"\",IF(BV59=\"NA\",\"NA\",IF(ISBLANK($F64),\"missing\",IF(OR(ISNUMBER($F64),$F64=\"ND\"),$F64,\"!error\"))))","v":""},{"$f":"IF(BV59=\"\",\"\",IF(BV59=\"NA\",\"NA\",IF(ISBLANK($G64),\"missing\",IF(OR(AND(ISNUMBER($G64),$G64>=0,$G64<=14),$G64=\"ND\"),$G64,\"!error\"))))","v":""},"",{"$f":"IF(BV59=\"\",\"\",IF(AY59=0,\"NA\",IF(CX59=\"ND\",\"ND\",IF(OR($BN$12=\"!error\",BV59=\"!error\",AND(BV59=\"missing\",ISNUMBER(BX59)),IF(BW59=1,BX59=\"!error\",0),CA59=\"!error\",CB59=\"!error\"),\"!error\",IF(OR(BV59=\"NA\",AND(ISNUMBER($BN$12),$BN$12=0),AND(BW59<>0,ISNUMBER(CC59),CC59=0),AND(BW59=1,ISNUMBER(CB59),CB59>9),AND(BW59>1,ISNUMBER(CB59),OR(CB59<6,CB59>=9.5))),\"NA\",IF(AND(ISNUMBER($BN$12),BW59<>0,IF(BW59=1,ISNUMBER(BX59),1),ISNUMBER(CA59),ISNUMBER(CB59)),CT_Giardia(BW59,$BN$12,CA59,CB59,IF(BW59=1,BX59,)),IF(COUNTIF(BW59,\"<>0\")+COUNT(BX59,BY59,CA59,CB59)=5,\"!error\",\"missing\")))))))","v":""},{"$f":"IF(BV59=\"\",\"\",IF(OR(AY59=0,AND(ISNUMBER($BN$12),$BN$12=0)),\"NA\",IF(CX59=\"ND\",\"ND\",IF(OR(CC59=\"!error\",CD59=\"!error\",CF59=\"!error\"),\"!error\",IF(BV59=\"NA\",\"NA\",IF(CD59=\"NA\",0,IF(AND(ISNUMBER(CC59),ISNUMBER(CD59)),CC59/CD59,IF(AND(BW59=99,CF59=0.5),CF59/$BN$12,\"missing\"))))))))","v":""},{"$f":"IF(BV59=\"\",\"\",IF(AY59=0,\"NA\",IF(CX59=\"ND\",\"ND\",IF(OR(BV59=\"!error\",AND(BV59=\"missing\",ISNUMBER(BX59)),BX59=\"!error\",BZ59=\"!error\",CA59=\"!error\",CB59=\"!error\"),\"!error\",IF(BV59=\"NA\",\"NA\",IF(OR(AND(BW59<>0,ISNUMBER(CC59),CC59=0),AND(BW59=1,ISNUMBER(CB59),CB59>9),AND(BW59>1,ISNUMBER(CB59),OR(CB59<6,CB59>=9.5))),0,IF(AND(ISNUMBER($BN$12),BW59<>0,ISNUMBER(BX59),ISNUMBER(BZ59),ISNUMBER(CA59),ISNUMBER(CB59)),log_Giardia(BW59,$BN$12,CA59,CB59,BX59,BZ59),IF(COUNTIF(BW59,\"<>0\")+COUNT(BX59,BY59,CA59,CB59)=5,\"!error\",\"missing\"))))))))","v":""},{"$f":"IF(BV59=\"\",\"\",IF(AY59=0,\"NA\",IF(CX59=\"ND\",\"ND\",IF(OR($BP$12=\"!error\",BV59=\"!error\",AND(BV59=\"missing\",ISNUMBER(BX59)),CA59=\"!error\",CB59=\"!error\"),\"!error\",IF(OR(BV59=\"NA\",AND(ISNUMBER($BP$12),$BP$12=0),AND(BW59<>0,ISNUMBER(CC59),CC59=0),AND(BW59=1,ISNUMBER(CB59),OR(CB59<5.5,CB59>=10.5)),AND(OR(BW59=2,BW59=4),ISNUMBER(CB59),OR(CB59<6,CB59>=9.5)),AND(BW59=3,ISNUMBER(CB59),OR(CB59<6,CB59>9))),\"NA\",IF(AND(ISNUMBER($BP$12),BW59<>0,ISNUMBER(CA59),ISNUMBER(CB59)),CT_Virus(BW59,$BP$12,CA59,CB59),IF(COUNTIF(BW59,\"<>0\")+COUNT(BX59,BY59,CA59,CB59)=5,\"!error\",\"missing\")))))))","v":""},{"$f":"IF(BV59=\"\",\"\",IF(OR(AY59=0,AND(ISNUMBER($BP$12),$BP$12=0)),\"NA\",IF(CX59=\"ND\",\"ND\",IF(OR(CC59=\"!error\",CG59=\"!error\",CI59=\"!error\"),\"!error\",IF(BV59=\"NA\",\"NA\",IF(CG59=\"NA\",0,IF(AND(ISNUMBER(CC59),ISNUMBER(CG59)),CC59/CG59,IF(AND(BW59=99,CI59=1),CI59/$BP$12,\"missing\"))))))))","v":""},{"$f":"IF(BV59=\"\",\"\",IF(AY59=0,\"NA\",IF(CX59=\"ND\",\"ND\",IF(OR(BV59=\"!error\",AND(BV59=\"missing\",ISNUMBER(BX59)),BX59=\"!error\",BZ59=\"!error\",CA59=\"!error\",CB59=\"!error\"),\"!error\",IF(BV59=\"NA\",\"NA\",IF(OR(AND(BW59<>0,ISNUMBER(CC59),CC59=0),AND(BW59=1,ISNUMBER(CB59),OR(CB59<5.5,CB59>=10.5)),AND(OR(BW59=2,BW59=4),ISNUMBER(CB59),OR(CB59<6,CB59>=9.5)),AND(BW59=3,ISNUMBER(CB59),OR(CB59<6,CB59>9))),0,IF(AND(ISNUMBER($BP$12),BW59<>0,ISNUMBER(BX59),ISNUMBER(BZ59),ISNUMBER(CA59),ISNUMBER(CB59)),Log_Virus(BW59,$BP$12,CA59,CB59,BX59,BZ59),IF(COUNTIF(BW59,\"<>0\")+COUNT(BX59,BY59,CA59,CB59)=5,\"!error\",\"missing\"))))))))","v":""},null,null,null,null,null,null,null,null,null,null,null,null,null,"data","data"]
[null," ",{"$f":"$G$15","v":5},null,null,null,null,"","","","","",null,null,null,null,"",null,null,null,null,null,null,null,null,null,null,null,null,null,null,null,null,null,null,null,null,null,null,null,null,null,null,null,null,null,null,null,null,null,1,{"$f":"IF($BH$14=0,0,IF(COUNTIF(OFFSET($BD56,0,0,MIN($BH$14,5),1),\"<>NA\")+IF($BH$14>5,COUNTIF(OFFSET($BV56,0,0,$BH$14-5,1),\"<>NA\"),0),1,0))","v":1},{"$f":"IF($BH$14=0,0,IF(COUNTIF(OFFSET($BD56,0,0,MIN($BH$14,5),1),\"O3\")+COUNTIF(OFFSET($BD56,0,0,MIN($BH$14,5),1),\"O3 Cell 1\")+IF($BH$14>5,COUNTIF(OFFSET($BV56,0,0,$BH$14-5,1),\"O3\"),0)+IF($BH$14>5,COUNTIF(OFFSET($BV56,0,0,$BH$14-5,1),\"O3 Cell 1\"),0),1,0))","v":0},{"$f":"IF(OR($AY60=0,AND(COUNTA(D60,F60:G60)=0,COUNTIF(E60,0))),\"NA\",IF(COUNTA(D60:G60),IF(BA60,4,5),IF($BH$15=1,IF(BA60,4,IF(AZ60,5,6)),IF(BD60=\"!error\",IF(BA60,4,5),IF(BA60,\"5B\",6)))))","v":6},{"$f":"$BH$11","v":5},{"$f":"IF(AND(IF($BN$4=\"missing\",10,$BN$4)>=5,$AY60<>\"\"),IF(OR($AY60=0,AND($B60=\"NA\",COUNTA($D60,$F60:$G60)=0,COUNTIF($E60,0)),AND($B60=\"NA\",COUNTA($D60:$G60)=0,IF($BH$14=0,0,COUNTIF(OFFSET($BD56,0,0,MIN($BH$14,5),1),\"NA\")+IF($BH$14>5,COUNTIF(OFFSET($BV56,0,0,$BH$14-5,1),\"NA\"),0))=$BH$14),AND($B60=\"NA\",COUNTA($D60:$G60)=0,IF($BH$14<5,COUNTA(OFFSET($D56,$BH$14,0,MIN(5-$BH$14,$BH$15),4))-COUNTIF(OFFSET($E56,$BH$14,0,MIN(5-$BH$14,$BH$15),1),0),0)+IF($BH$14+$BH$15>5,COUNTA(OFFSET($D61,MAX($BH$14-5,0),0,MIN($BH$14+$BH$15-5,$BH$15),4))-COUNTIF(OFFSET($E61,MAX($BH$14-5,0),0,MIN($BH$14+$BH$15-5,$BH$15),1),0),0)),AND($B60=\"NA\",COUNTA($D60:$G60)=0,IF($BH$14<5,COUNTIF(OFFSET($B56,$BH$14,0,MIN(5-$BH$14,$BH$15),1),\"NA\"),0)+IF($BH$14+$BH$15>5,COUNTIF(OFFSET($B61,MAX($BH$14-5,0),0,MIN($BH$14+$BH$15-5,$BH$15),1),\"NA\"),0)<>$BH$15)),\"NA\",IF($B60=\"\",\"missing\",IF(AND($B60<>\"NA\",COUNTA($D60,$F60:$G60)+COUNTIF($E60,\"<>0\")),UPPER($B60),\"!error\"))),\"\")","v":""},"","","",{"$f":"IF(BD60=\"\",\"\",IF(AY60=0,\"NA\",IF(OR($BH$12=\"!error\",$BH$13=\"!error\",BG60=\"!error\"),\"!error\",IF(BD60=\"NA\",\"NA\",IF(AND(ISNUMBER(BG60),BG60=0),0,IF(AND(ISNUMBER($BH$12),ISNUMBER($BH$13),ISNUMBER(BG60)),$BH$13*$BH$12/BG60,IF(BG60=\"ND\",\"ND\",\"missing\")))))))","v":""},"","","",{"$f":"IF(BD60=\"\",\"\",IF(AY60=0,\"NA\",IF(CW60=\"ND\",\"ND\",IF(OR($BN$12=\"!error\",BD60=\"!error\",AND(BD60=\"missing\",ISNUMBER(BF60)),IF(BE60=1,BF60=\"!error\",0),BI60=\"!error\",BJ60=\"!error\"),\"!error\",IF(OR(BD60=\"NA\",AND(ISNUMBER($BN$12),$BN$12=0),AND(BE60<>0,ISNUMBER(BK60),BK60=0),AND(BE60=1,ISNUMBER(BJ60),BJ60>9),AND(BE60=2,ISNUMBER(BJ60),OR(BJ60<6,BJ60>=9.5)),AND(OR(BE60=3,BE60=4),ISNUMBER(BJ60),OR(BJ60<5.5,BJ60>=9.5))),\"NA\",IF(AND(ISNUMBER($BN$12),BE60<>0,IF(BE60=1,ISNUMBER(BF60),1),ISNUMBER(BI60),ISNUMBER(BJ60)),CT_Giardia(BE60,$BN$12,BI60,BJ60,IF(BE60=1,BF60,)),IF(COUNTIF(BE60,\"<>0\")+COUNT(BF60,BG60,BI60,BJ60)=5,\"!error\",\"missing\")))))))","v":""},{"$f":"IF(BD60=\"\",\"\",IF(OR(AY60=0,AND(ISNUMBER($BN$12),$BN$12=0)),\"NA\",IF(CW60=\"ND\",\"ND\",IF(OR(BK60=\"!error\",BL60=\"!error\",BN60=\"!error\"),\"!error\",IF(BD60=\"NA\",\"NA\",IF(BL60=\"NA\",0,IF(AND(BE60<>99,ISNUMBER(BK60),ISNUMBER(BL60)),BK60/BL60,IF(AND(BE60=99,BN60=0.5),BN60/$BN$12,\"missing\"))))))))","v":""},{"$f":"IF(BD60=\"\",\"\",IF(AY60=0,\"NA\",IF(CW60=\"ND\",\"ND\",IF(OR(BD60=\"!error\",AND(BD60=\"missing\",ISNUMBER(BF60)),BF60=\"!error\",BH60=\"!error\",BI60=\"!error\",BJ60=\"!error\"),\"!error\",IF(BD60=\"NA\",\"NA\",IF(OR(AND(BE60<>0,ISNUMBER(BK60),BK60=0),AND(BE60=1,ISNUMBER(BJ60),BJ60>9),AND(BE60=2,ISNUMBER(BJ60),OR(BJ60<6,BJ60>=9.5)),AND(OR(BE60=3,BE60=4),ISNUMBER(BJ60),OR(BJ60<5.5,BJ60>=9.5))),0,IF(AND(ISNUMBER($BN$12),BE60<>0,ISNUMBER(BF60),ISNUMBER(BH60),ISNUMBER(BI60),ISNUMBER(BJ60)),log_Giardia(BE60,$BN$12,BI60,BJ60,BF60,BH60),IF(COUNTIF(BE60,\"<>0\")+COUNT(BF60,BG60,BI60,BJ60)=5,\"!error\",\"missing\"))))))))","v":""},{"$f":"IF(BD60=\"\",\"\",IF(AY60=0,\"NA\",IF(CW60=\"ND\",\"ND\",IF(OR($BP$12=\"!error\",BD60=\"!error\",AND(BD60=\"missing\",ISNUMBER(BF60)),BI60=\"!error\",BJ60=\"!error\"),\"!error\",IF(OR(BD60=\"NA\",AND(ISNUMBER($BP$12),$BP$12=0),AND(BE60<>0,ISNUMBER(BK60),BK60=0),AND(BE60=1,ISNUMBER(BJ60),BJ60>=10.5),AND(BE60=2,ISNUMBER(BJ60),OR(BJ60<6,BJ60>=9.5)),AND(BE60=3,ISNUMBER(BJ60),OR(BJ60<6,BJ60>9)),AND(BE60=4,ISNUMBER(BJ60),OR(BJ60<6,BJ60>10))),\"NA\",IF(AND(ISNUMBER($BP$12),BE60<>0,ISNUMBER(BI60),ISNUMBER(BJ60)),CT_Virus(BE60,$BP$12,BI60,BJ60),IF(COUNTIF(BE60,\"<>0\")+COUNT(BF60,BG60,BI60,BJ60)=5,\"!error\",\"missing\")))))))","v":""},{"$f":"IF(BD60=\"\",\"\",IF(OR(AY60=0,AND(ISNUMBER($BP$12),$BP$12=0)),\"NA\",IF(CW60=\"ND\",\"ND\",IF(OR(BK60=\"!error\",BO60=\"!error\",BQ60=\"!error\"),\"!error\",IF(BD60=\"NA\",\"NA\",IF(BO60=\"NA\",0,IF(AND(BE60<>99,ISNUMBER(BK60),ISNUMBER(BO60)),BK60/BO60,IF(AND(BE60=99,BQ60=1),BQ60/$BP$12,\"missing\"))))))))","v":""},{"$f":"IF(BD60=\"\",\"\",IF(AY60=0,\"NA\",IF(CW60=\"ND\",\"ND\",IF(OR(BD60=\"!error\",AND(BD60=\"missing\",ISNUMBER(BF60)),BF60=\"!error\",BH60=\"!error\",BI60=\"!error\",BJ60=\"!error\"),\"!error\",IF(BD60=\"NA\",\"NA\",IF(OR(AND(BE60<>0,ISNUMBER(BK60),BK60=0),AND(BE60=1,ISNUMBER(BJ60),BJ60>=10.5),AND(BE60=2,ISNUMBER(BJ60),OR(BJ60<6,BJ60>=9.5)),AND(BE60=3,ISNUMBER(BJ60),OR(BJ60<6,BJ60>9)),AND(BE60=4,ISNUMBER(BJ60),OR(BJ60<6,BJ60>10))),0,IF(AND(ISNUMBER($BP$12),BE60<>0,ISNUMBER(BF60),ISNUMBER(BH60),ISNUMBER(BI60),ISNUMBER(BJ60)),Log_Virus(BE60,$BP$12,BI60,BJ60,BF60,BH60),IF(COUNTIF(BE60,\"<>0\")+COUNT(BF60,BG60,BI60,BJ60)=5,\"!error\",\"missing\"))))))))","v":""},{"$f":"IF($BM$14=0,0,IF(COUNTIF(OFFSET($BD56,0,0,MIN($BM$14,5),1),\"<>NA\")+IF($BM$14>5,COUNTIF(OFFSET($BV56,0,0,$BM$14-5,1),\"<>NA\"),0),1,0))","v":1},{"$f":"IF($BK$14=0,0,IF(COUNTIF(OFFSET($BD56,0,0,MIN($BK$14,5),1),\"O3\")+COUNTIF(OFFSET($BD56,0,0,MIN($BK$14,5),1),\"O3 Cell 1\")+IF($BK$14>5,COUNTIF(OFFSET($BV56,0,0,$BK$14-5,1),\"O3\"),0)+IF($BK$14>5,COUNTIF(OFFSET($BV56,0,0,$BK$14-5,1),\"O3 Cell 1\"),0),1,0))","v":0},{"$f":"IF(OR($AY60=0,AND(COUNTA(D65,F65:G65)=0,COUNTIF(E65,0))),\"NA\",IF(COUNTA(D65:G65),IF(BS60,4,5),IF($BM$15=1,IF(BS60,4,IF(BR60,5,6)),IF(BV60=\"!error\",IF(BS60,4,5),IF(BS60,\"5B\",6)))))","v":6},{"$f":"$BM$11","v":10},{"$f":"IF(AND(IF($BN$4=\"missing\",10,$BN$4)>=10,$AY60<>\"\"),IF(OR($AY60=0,AND($B65=\"NA\",COUNTA($D65,$F65:$G65)=0,COUNTIF($E65,0)),AND($B65=\"NA\",COUNTA($D65:$G65)=0,IF($BM$14=0,0,COUNTIF(OFFSET($BD56,0,0,MIN($BM$14,5),1),\"NA\")+IF($BM$14>5,COUNTIF(OFFSET($BV56,0,0,$BM$14-5,1),\"NA\"),0))=$BM$14),AND($B65=\"NA\",COUNTA($D65:$G65)=0,IF($BM$14<5,COUNTA(OFFSET($D56,$BM$14,0,MIN(5-$BM$14,$BM$15),4))-COUNTIF(OFFSET($E56,$BM$14,0,MIN(5-$BM$14,$BM$15),1),0),0)+IF($BM$14+$BM$15>5,COUNTA(OFFSET($D61,MAX($BM$14-5,0),0,MIN($BM$14+$BM$15-5,$BM$15),4))-COUNTIF(OFFSET($E61,MAX($BM$14-5,0),0,MIN($BM$14+$BM$15-5,$BM$15),1),0),0)),AND($B65=\"NA\",COUNTA($D65:$G65)=0,IF($BM$14<5,COUNTIF(OFFSET($B56,$BM$14,0,MIN(5-$BM$14,$BM$15),1),\"NA\"),0)+IF($BM$14+$BM$15>5,COUNTIF(OFFSET($B61,MAX($BM$14-5,0),0,MIN($BM$14+$BM$15-5,$BM$15),1),\"NA\"),0)<>$BM$15)),\"NA\",IF($B65=\"\",\"missing\",IF(AND($B65<>\"NA\",COUNTA($D65,$F65:$G65)+COUNTIF($E65,\"<>0\")),UPPER($B65),\"!error\"))),\"\")","v":""},"",{"$f":"IF(BV60=\"\",\"\",IF(BV60=\"NA\",\"NA\",IF(ISBLANK($D65),\"missing\",IF(AND(BW60=1,ISNUMBER($D65),$D65>4),4,IF(AND(ISNUMBER($D65),$D65>=0),$D65,IF(AND(ISTEXT($D65),$D65=\"ND\"),\"ND\",\"!error\"))))))","v":""},{"$f":"IF(BV60=\"\",\"\",IF(BV60=\"NA\",\"NA\",IF(ISBLANK($E65),\"missing\",IF(OR(AND(ISBLANK($B65),COUNT(BX60,CA60:CB60)=0,ISNUMBER($E65),$E65=0),AND(ISNUMBER($E65),$E65>0),AND(ISTEXT($E65),$E65=\"ND\")),$E65,\"!error\"))))","v":""},{"$f":"IF(BV60=\"\",\"\",IF(AY60=0,\"NA\",IF(OR($BM$12=\"!error\",$BM$13=\"!error\",BY60=\"!error\"),\"!error\",IF(BV60=\"NA\",\"NA\",IF(AND(ISNUMBER(BY60),BY60=0),0,IF(AND(ISNUMBER($BM$12),ISNUMBER($BM$13),ISNUMBER(BY60)),$BM$13*$BM$12/BY60,IF(BY60=\"ND\",\"ND\",\"missing\")))))))","v":""},{"$f":"IF(BV60=\"\",\"\",IF(BV60=\"NA\",\"NA\",IF(ISBLANK($F65),\"missing\",IF(OR(ISNUMBER($F65),$F65=\"ND\"),$F65,\"!error\"))))","v":""},{"$f":"IF(BV60=\"\",\"\",IF(BV60=\"NA\",\"NA\",IF(ISBLANK($G65),\"missing\",IF(OR(AND(ISNUMBER($G65),$G65>=0,$G65<=14),$G65=\"ND\"),$G65,\"!error\"))))","v":""},"",{"$f":"IF(BV60=\"\",\"\",IF(AY60=0,\"NA\",IF(CX60=\"ND\",\"ND\",IF(OR($BN$12=\"!error\",BV60=\"!error\",AND(BV60=\"missing\",ISNUMBER(BX60)),IF(BW60=1,BX60=\"!error\",0),CA60=\"!error\",CB60=\"!error\"),\"!error\",IF(OR(BV60=\"NA\",AND(ISNUMBER($BN$12),$BN$12=0),AND(BW60<>0,ISNUMBER(CC60),CC60=0),AND(BW60=1,ISNUMBER(CB60),CB60>9),AND(BW60>1,ISNUMBER(CB60),OR(CB60<6,CB60>=9.5))),\"NA\",IF(AND(ISNUMBER($BN$12),BW60<>0,IF(BW60=1,ISNUMBER(BX60),1),ISNUMBER(CA60),ISNUMBER(CB60)),CT_Giardia(BW60,$BN$12,CA60,CB60,IF(BW60=1,BX60,)),IF(COUNTIF(BW60,\"<>0\")+COUNT(BX60,BY60,CA60,CB60)=5,\"!error\",\"missing\")))))))","v":""},{"$f":"IF(BV60=\"\",\"\",IF(OR(AY60=0,AND(ISNUMBER($BN$12),$BN$12=0)),\"NA\",IF(CX60=\"ND\",\"ND\",IF(OR(CC60=\"!error\",CD60=\"!error\",CF60=\"!error\"),\"!error\",IF(BV60=\"NA\",\"NA\",IF(CD60=\"NA\",0,IF(AND(ISNUMBER(CC60),ISNUMBER(CD60)),CC60/CD60,IF(AND(BW60=99,CF60=0.5),CF60/$BN$12,\"missing\"))))))))","v":""},{"$f":"IF(BV60=\"\",\"\",IF(AY60=0,\"NA\",IF(CX60=\"ND\",\"ND\",IF(OR(BV60=\"!error\",AND(BV60=\"missing\",ISNUMBER(BX60)),BX60=\"!error\",BZ60=\"!error\",CA60=\"!error\",CB60=\"!error\"),\"!error\",IF(BV60=\"NA\",\"NA\",IF(OR(AND(BW60<>0,ISNUMBER(CC60),CC60=0),AND(BW60=1,ISNUMBER(CB60),CB60>9),AND(BW60>1,ISNUMBER(CB60),OR(CB60<6,CB60>=9.5))),0,IF(AND(ISNUMBER($BN$12),BW60<>0,ISNUMBER(BX60),ISNUMBER(BZ60),ISNUMBER(CA60),ISNUMBER(CB60)),log_Giardia(BW60,$BN$12,CA60,CB60,BX60,BZ60),IF(COUNTIF(BW60,\"<>0\")+COUNT(BX60,BY60,CA60,CB60)=5,\"!error\",\"missing\"))))))))","v":""},{"$f":"IF(BV60=\"\",\"\",IF(AY60=0,\"NA\",IF(CX60=\"ND\",\"ND\",IF(OR($BP$12=\"!error\",BV60=\"!error\",AND(BV60=\"missing\",ISNUMBER(BX60)),CA60=\"!error\",CB60=\"!error\"),\"!error\",IF(OR(BV60=\"NA\",AND(ISNUMBER($BP$12),$BP$12=0),AND(BW60<>0,ISNUMBER(CC60),CC60=0),AND(BW60=1,ISNUMBER(CB60),OR(CB60<5.5,CB60>=10.5)),AND(OR(BW60=2,BW60=4),ISNUMBER(CB60),OR(CB60<6,CB60>=9.5)),AND(BW60=3,ISNUMBER(CB60),OR(CB60<6,CB60>9))),\"NA\",IF(AND(ISNUMBER($BP$12),BW60<>0,ISNUMBER(CA60),ISNUMBER(CB60)),CT_Virus(BW60,$BP$12,CA60,CB60),IF(COUNTIF(BW60,\"<>0\")+COUNT(BX60,BY60,CA60,CB60)=5,\"!error\",\"missing\")))))))","v":""},{"$f":"IF(BV60=\"\",\"\",IF(OR(AY60=0,AND(ISNUMBER($BP$12),$BP$12=0)),\"NA\",IF(CX60=\"ND\",\"ND\",IF(OR(CC60=\"!error\",CG60=\"!error\",CI60=\"!error\"),\"!error\",IF(BV60=\"NA\",\"NA\",IF(CG60=\"NA\",0,IF(AND(ISNUMBER(CC60),ISNUMBER(CG60)),CC60/CG60,IF(AND(BW60=99,CI60=1),CI60/$BP$12,\"missing\"))))))))","v":""},{"$f":"IF(BV60=\"\",\"\",IF(AY60=0,\"NA\",IF(CX60=\"ND\",\"ND\",IF(OR(BV60=\"!error\",AND(BV60=\"missing\",ISNUMBER(BX60)),BX60=\"!error\",BZ60=\"!error\",CA60=\"!error\",CB60=\"!error\"),\"!error\",IF(BV60=\"NA\",\"NA\",IF(OR(AND(BW60<>0,ISNUMBER(CC60),CC60=0),AND(BW60=1,ISNUMBER(CB60),OR(CB60<5.5,CB60>=10.5)),AND(OR(BW60=2,BW60=4),ISNUMBER(CB60),OR(CB60<6,CB60>=9.5)),AND(BW60=3,ISNUMBER(CB60),OR(CB60<6,CB60>9))),0,IF(AND(ISNUMBER($BP$12),BW60<>0,ISNUMBER(BX60),ISNUMBER(BZ60),ISNUMBER(CA60),ISNUMBER(CB60)),Log_Virus(BW60,$BP$12,CA60,CB60,BX60,BZ60),IF(COUNTIF(BW60,\"<>0\")+COUNT(BX60,BY60,CA60,CB60)=5,\"!error\",\"missing\"))))))))","v":""},null,null,null,null,null,null,null,null,null,null,null,null,null,{"$f":"IF(OR(BF60=\"ND\",BG60=\"ND\",BI60=\"ND\",BJ60=\"ND\"),\"ND\",\"data\")","v":"data"},{"$f":"IF(OR(BX60=\"ND\",BY60=\"ND\",CA60=\"ND\",CB60=\"ND\"),\"ND\",\"data\")","v":"data"}]
[null," ",{"$f":"$H$15","v":6},null,null,null,null,{"$f":"IF($CD56=\"!error\",\"!error\",$CC56)","v":""},{"$f":"$CD56","v":""},{"$f":"$CG56","v":""},{"$f":"$CF56","v":""},{"$f":"$CI56","v":""},null,null,null,null,{"$f":"IF(AND(BW56=1,D61>4,D61<>\"ND\"),\"Note: The inactivation credit in zone D\" & C61 & \" was restricted due to elevated free chlorine levels.\",\"\")","v":""},null,null,null,null,null,null,null,null,null,null,null,null,null,null,null,null,null,null,null,null,null,null,null,null,null,null,null,null,null,null,null,null,null,null,null,null,null,null,null,null,null,null,null,null,null,null,null,null,null,null,null,null,null,null,null,null,null,null,null,null,null,null,null,null,null,null,null,null,null,null,null," Not representative of total log inactivation for all disinfection zones."]
[null," ",{"$f":"$I$15","v":7},null,null,null,null,{"$f":"IF($CD57=\"!error\",\"!error\",$CC57)","v":""},{"$f":"$CD57","v":""},{"$f":"$CG57","v":""},{"$f":"$CF57","v":""},{"$f":"$CI57","v":""},null,null,null,null,{"$f":"IF(AND(BW57=1,D62>4,D62<>\"ND\"),\"Note: The inactivation credit in zone D\" & C62 & \" was restricted due to elevated free chlorine levels.\",\"\")","v":""},null,null,null,null,null,null,null,null,null,null,null,null,null,null,null,null,null,null,null,null,null,null,null,null,null,null,null,null,null,null,null,null,null,null,null,null,null,null,null,null,null,null,null,null,null,null,null,null,null,null,null,null,null,null,null,null,null,null,null,null,null,null,null,null,null,null,null,null,null,null,null,null,null,{"$f":"CL56=\"\"","v":true},null,null,null,{"$f":"CP56=\"\"","v":true}]
[null," ",{"$f":"$J$15","v":8},null,null,null,null,"",{"$f":"$CD58","v":""},{"$f":"$CG58","v":""},{"$f":"$CF58","v":""},{"$f":"$CI58","v":""},null,null,null,null,""]
[null," ",{"$f":"$K$15","v":9},null,null,null,null,"",{"$f":"$CD59","v":""},{"$f":"$CG59","v":""},{"$f":"$CF59","v":""},{"$f":"$CI59","v":""},null,null,null,null,""]
[null," ",{"$f":"$L$15","v":10},null,null,null,null,{"$f":"IF($CC60=\"!error\",\"!error\",$CC60)","v":""},{"$f":"$CD60","v":""},{"$f":"$CG60","v":""},{"$f":"$CF60","v":""},{"$f":"$CI60","v":""},null,null,null,null,""]
[]
[null,null,null,null,null,"DISINFECTION PROCESS DATA "]
[null,"DATE:",null,null,null,{"$f":"OR(AND(COUNTA(D72:G81)=0,C68=\"\"),IsDate(C68))","v":true},"TIME:",null,null,null,null,"Operator Initials:"]
[null,"INDIVIDUAL DISINFECTION ZONES",null,null,null,null,null,null,null,null,null,null,"PLANT TOTAL",null,null,null,null,null,null,null,null,null,null,null,null,null,null,null,null,null,null,null,null,null,null,null,null,null,null,null,null,null,null,null,null,null,null,null,null,"PUMPAGE",null,null,null,null,{"$f":"\"DISINFECTION ZONES  ( D\"&$BD$11&\" - D\"&$BH$11&\" )\"","v":"DISINFECTION ZONES  ( D1 - D5 )"},null,null,null,null,null,null,null,null,null,null,null,null,null,null,null,null,null,{"$f":"\"DISINFECTION ZONES  ( D\"&$BI$11&\" - D\"&$BM$11&\" )\"","v":"DISINFECTION ZONES  ( D6 - D10 )"},null,null,null,null,null,null,null,null,null,null,null,null,null,null,null,"DAILY DISINFECTION DATA SUMMARY"]
[null,null,null,"C","Flow","Temp",null,null,"Giardia","Virus","Giardia","Virus","Giardia","Virus","Inact.",null,null,null,null,null,null,null,null,null,null,null,null,null,null,null,null,null,null,null,null,null,null,null,null,null,null,null,null,null,null,null,null,null,null,null,"RAW",null,null,null,null,null,null,null,null,null,null,null,null,"GIARDIA","GIARDIA","GIARDIA","VIRUS","VIRUS","VIRUS",null,null,null,null,null,null,null,null,null,null,null,null,"GIARDIA","GIARDIA","GIARDIA","VIRUS","VIRUS","VIRUS",null,"GIARDIA",null,"GIARDIA",null,"VIRUS",null,"VIRUS",null,"MINIMUM",null,null,null,"NO DATA"]
[null,"Disinfectant",null,"(mg/L)","(MGD)","(oC)","pH","CTCALC","CTREQD","CTREQD","Log","Log","Log","Log","Ratio",null,null,null,null,null,null,null,null,null,null,null,null,null,null,null,null,null,null,null,null,null,null,null,null,null,null,null,null,null,null,null,null,null,null,"DATE","WATER",null,null,"AT LEAST ONE PRECEDING ZONE <> \"NA\"","DISINFECTANT",null,null,"C","FLOW","T10","TEMP","pH","CTACTUAL","CTREQD","INACT. RATIO","LOG","CTREQD","INACT. RATIO","LOG",null,null,null,"DISINFECTANT",null,null,"C","FLOW","T10","TEMP","pH","CTACTUAL","CTREQD","INACT. RATIO","LOG","CTREQD","INACT. RATIO","LOG",null,"LOG",null,"INACT. RATIO",null,"LOG",null,"INACT. RATIO",null,"INACT. RATIO",null,null,null,{"$f":"\"D\"&$BD$11&\" - D\"&$BH$11","v":"D1 - D5"},{"$f":"\"D\"&$BI$11&\" - D\"&$BM$11","v":"D6 - D10"}]
[null,null,{"$f":"$C$15","v":1},null,null,null,null,{"$f":"IF(BL72=\"!error\",\"!error\",$BK72)","v":"missing"},{"$f":"$BL72","v":"missing"},{"$f":"$BO72","v":"missing"},{"$f":"$BN72","v":"missing"},{"$f":"$BQ72","v":"missing"},{"$f":"IF($CK72=\"\",\"\",IF($CK72=\"NA\",\"NA\",IF($CK72=\"!error\",-99,IF(COUNTIF(CW72:CX76,\"ND\")=$BN$4,\"MD\",IF(ISNUMBER($CK72),FIXED($CK72,2)&IF($CL72=\"*\",\"*\",\" \"),\"\")))))","v":""},{"$f":"IF($CO72=\"\",\"\",IF($CO72=\"NA\",\"NA \",IF($CO72=\"!error\",-99,IF(COUNTIF(CW72:CX76,\"ND\")=$BN$4,\"MD\",IF(ISNUMBER($CO72),FIXED($CO72,2)&IF($CP72=\"*\",\"*\",\" \"),\"\")))))","v":""},{"$f":"IF($CS72=\"\",\"\",IF($CS72=\"NA\",\"NA\",IF($CS72=\"!error\",-99,IF(AND($CW72=\"ND\",$CW73=\"ND\",$CW74=\"ND\",$CW75=\"ND\",$CW76=\"ND\",$CX72=\"ND\",$CX73=\"ND\",$CX74=\"ND\",$CX75=\"ND\",$CX76=\"ND\"),\"ND\",IF(ISNUMBER($CS72),$CS72,\"\")))))","v":""},null,{"$f":"IF(AND(BE72=1,D72>4,D72<>\"ND\"),\"Note: The inactivation credit in zone D\" & C72 & \" was restricted due to elevated free chlorine levels.\",\"\")","v":""},null,null,null,null,null,null,null,null,null,null,null,null,null,null,null,null,null,null,null,null,null,null,null,null,null,null,null,null,null,null,null,null,1,1,{"$f":"IF($BD$14=0,0,IF(COUNTIF(OFFSET($BD72,0,0,MIN($BD$14,5),1),\"<>NA\")+IF($BD$14>5,COUNTIF(OFFSET($BV72,0,0,$BD$14-5,1),\"<>NA\"),0),1,0))","v":0},{"$f":"IF($BD$14=0,0,IF(COUNTIF(OFFSET($BD72,0,0,MIN($BD$14,5),1),\"O3\")+COUNTIF(OFFSET($BD72,0,0,MIN($BD$14,5),1),\"O3 Cell 1\")+IF($BD$14>5,COUNTIF(OFFSET($BV72,0,0,$BD$14-5,1),\"O3\"),0)+IF($BD$14>5,COUNTIF(OFFSET($BV72,0,0,$BD$14-5,1),\"O3 Cell 1\"),0),1,0))","v":0},{"$f":"IF(OR($AY72=0,AND(COUNTA(D72,F72:G72)=0,COUNTIF(E72,0))),\"NA\",\n       IF(COUNTA(D72:G72),IF(BA72,4,\n                                                                     5),\n            IF($BD$15=1,IF(BA72,4,\n                                                        IF(AZ72,5,\n                                                                         6)),\n                    IF(BD72=\"!error\",IF(BA72,4,\n                                                                        5),\n                          IF(BA72,\"5B\",\n                                            6)))))","v":6},{"$f":"$BD$11","v":1},{"$f":"IF(AND(IF($BN$4=\"missing\",10,$BN$4)>=1,$AY72<>\"\"),IF(OR($AY72=0,AND($B72=\"NA\",COUNTA($D72,$F72:$G72)=0,COUNTIF($E72,0)),AND($B72=\"NA\",COUNTA($D72:$G72)=0,IF($BD$14=0,0,COUNTIF(OFFSET($BD72,0,0,MIN($BD$14,5),1),\"NA\")+IF($BD$14>5,COUNTIF(OFFSET($BV72,0,0,$BD$14-5,1),\"NA\"),0))=$BD$14),AND($B72=\"NA\",COUNTA($D72:$G72)=0,IF($BD$14<5,COUNTA(OFFSET($D72,$BD$14,0,MIN(5-$BD$14,$BD$15),4))-COUNTIF(OFFSET($E72,$BD$14,0,MIN(5-$BD$14,$BD$15),1),0),0)+IF($BD$14+$BD$15>5,COUNTA(OFFSET($D77,MAX($BD$14-5,0),0,MIN($BD$14+$BD$15-5,$BD$15),4))-COUNTIF(OFFSET($E77,MAX($BD$14-5,0),0,MIN($BD$14+$BD$15-5,$BD$15),1),0),0)),AND($B72=\"NA\",COUNTA($D72:$G72)=0,IF($BD$14<5,COUNTIF(OFFSET($B72,$BD$14,0,MIN(5-$BD$14,$BD$15),1),\"NA\"),0)+IF($BD$14+$BD$15>5,COUNTIF(OFFSET($B77,MAX($BD$14-5,0),0,MIN($BD$14+$BD$15-5,$BD$15),1),\"NA\"),0)<>$BD$15)),\"NA\",IF($B72=\"\",\"missing\",IF(AND($B72<>\"NA\",COUNTA($D72,$F72:$G72)+COUNTIF($E72,\"<>0\")),UPPER($B72),\"!error\"))),\"\")","v":"missing"},{"$f":"IF(BD72=\"\",\"\",IF(BD72=\"FCL\",1,IF(BD72=\"CLO2\",2,IF(BD72=\"O3 Cell 1\",99,IF(BD72=\"O3\",3,IF(BD72=\"CLA\",4,0))))))","v":0},{"$f":"IF(BD72=\"\",\"\",IF(BD72=\"NA\",\"NA\",IF(ISBLANK($D72),\"missing\",IF(AND(BE72=1,ISNUMBER($D72),$D72>4),4,IF(AND(ISNUMBER($D72),$D72>=0),$D72,IF(AND(ISTEXT($D72),$D72=\"ND\"),\"ND\",\"!error\"))))))","v":"missing"},{"$f":"IF(BD72=\"\",\"\",IF(BD72=\"NA\",\"NA\",IF(ISBLANK($E72),\"missing\",IF(OR(AND(ISBLANK($B72),COUNT(BF72,BI72:BJ72)=0,ISNUMBER($E72),$E72=0),AND(ISNUMBER($E72),$E72>0),AND(ISTEXT($E72),$E72=\"ND\")),$E72,\"!error\"))))","v":"missing"},{"$f":"IF(BD72=\"\",\"\",IF(AY72=0,\"NA\",IF(OR($BD$12=\"!error\",$BD$13=\"!error\",BG72=\"!error\"),\"!error\",IF(BD72=\"NA\",\"NA\",IF(AND(ISNUMBER(BG72),BG72=0),0,IF(AND(ISNUMBER($BD$12),ISNUMBER($BD$13),ISNUMBER(BG72)),$BD$13*$BD$12/BG72,IF(BG72=\"ND\",\"ND\",\"missing\")))))))","v":"missing"},{"$f":"IF(BD72=\"\",\"\",IF(BD72=\"NA\",\"NA\",IF(ISBLANK($F72),\"missing\",IF(OR(ISNUMBER($F72),$F72=\"ND\"),$F72,\"!error\"))))","v":"missing"},{"$f":"IF(BD72=\"\",\"\",IF(BD72=\"NA\",\"NA\",IF(ISBLANK($G72),\"missing\",IF(OR(AND(ISNUMBER($G72),$G72>=0,$G72<=14),$G72=\"ND\"),$G72,\"!error\"))))","v":"missing"},{"$f":"IF(BD72=\"\",\"\",IF(AY72=0,\"NA\",IF(OR(BF72=\"!error\",BH72=\"!error\"),\"!error\",IF(BD72=\"NA\",\"NA\",IF(OR(AND(ISNUMBER(BF72),BF72=0),AND(ISNUMBER(BH72),BH72=0)),0,IF(AND(ISNUMBER(BF72),ISNUMBER(BH72)),BF72*BH72,IF(OR(BF72=\"ND\",BH72=\"ND\"),\"ND\",\"missing\")))))))","v":"missing"},{"$f":"IF(BD72=\"\",\"\",IF(AY72=0,\"NA\",IF(CW72=\"ND\",\"ND\",IF(OR($BN$12=\"!error\",BD72=\"!error\",AND(BD72=\"missing\",ISNUMBER(BF72)),IF(BE72=1,BF72=\"!error\",0),BI72=\"!error\",BJ72=\"!error\"),\"!error\",IF(OR(BD72=\"NA\",AND(ISNUMBER($BN$12),$BN$12=0),AND(BE72<>0,ISNUMBER(BK72),BK72=0),AND(BE72=1,ISNUMBER(BJ72),BJ72>9),AND(BE72=2,ISNUMBER(BJ72),OR(BJ72<6,BJ72>=9.5)),AND(OR(BE72=3,BE72=4),ISNUMBER(BJ72),OR(BJ72<5.5,BJ72>=9.5))),\"NA\",IF(AND(ISNUMBER($BN$12),BE72<>0,IF(BE72=1,ISNUMBER(BF72),1),ISNUMBER(BI72),ISNUMBER(BJ72)),CT_Giardia(BE72,$BN$12,BI72,BJ72,IF(BE72=1,BF72,)),IF(COUNTIF(BE72,\"<>0\")+COUNT(BF72,BG72,BI72,BJ72)=5,\"!error\",\"missing\")))))))","v":"missing"},{"$f":"IF(BD72=\"\",\"\",IF(OR(AY72=0,AND(ISNUMBER($BN$12),$BN$12=0)),\"NA\",IF(CW72=\"ND\",\"ND\",IF(OR(BK72=\"!error\",BL72=\"!error\",BN72=\"!error\"),\"!error\",IF(BD72=\"NA\",\"NA\",IF(BL72=\"NA\",0,IF(AND(BE72<>99,ISNUMBER(BK72),ISNUMBER(BL72)),BK72/BL72,IF(AND(BE72=99,BN72=0.5),BN72/$BN$12,\"missing\"))))))))","v":"missing"},{"$f":"IF(BD72=\"\",\"\",IF(AY72=0,\"NA\",IF(CW72=\"ND\",\"ND\",IF(OR(BD72=\"!error\",AND(BD72=\"missing\",ISNUMBER(BF72)),BF72=\"!error\",BH72=\"!error\",BI72=\"!error\",BJ72=\"!error\"),\"!error\",IF(BD72=\"NA\",\"NA\",IF(OR(AND(BE72<>0,ISNUMBER(BK72),BK72=0),AND(BE72=1,ISNUMBER(BJ72),BJ72>9),AND(BE72=2,ISNUMBER(BJ72),OR(BJ72<6,BJ72>=9.5)),AND(OR(BE72=3,BE72=4),ISNUMBER(BJ72),OR(BJ72<5.5,BJ72>=9.5))),0,IF(AND(ISNUMBER($BN$12),BE72<>0,ISNUMBER(BF72),ISNUMBER(BH72),ISNUMBER(BI72),ISNUMBER(BJ72)),log_Giardia(BE72,$BN$12,BI72,BJ72,BF72,BH72),IF(COUNTIF(BE72,\"<>0\")+COUNT(BF72,BG72,BI72,BJ72)=5,\"!error\",\"missing\"))))))))","v":"missing"},{"$f":"IF(BD72=\"\",\"\",IF(AY72=0,\"NA\",IF(CW72=\"ND\",\"ND\",IF(OR($BP$12=\"!error\",BD72=\"!error\",AND(BD72=\"missing\",ISNUMBER(BF72)),BI72=\"!error\",BJ72=\"!error\"),\"!error\",IF(OR(BD72=\"NA\",AND(ISNUMBER($BP$12),$BP$12=0),AND(BE72<>0,ISNUMBER(BK72),BK72=0),AND(BE72=1,ISNUMBER(BJ72),BJ72>=10.5),AND(BE72=2,ISNUMBER(BJ72),OR(BJ72<6,BJ72>=9.5)),AND(BE72=3,ISNUMBER(BJ72),OR(BJ72<6,BJ72>9)),AND(BE72=4,ISNUMBER(BJ72),OR(BJ72<6,BJ72>10))),\"NA\",IF(AND(ISNUMBER($BP$12),BE72<>0,ISNUMBER(BI72),ISNUMBER(BJ72)),CT_Virus(BE72,$BP$12,BI72,BJ72),IF(COUNTIF(BE72,\"<>0\")+COUNT(BF72,BG72,BI72,BJ72)=5,\"!error\",\"missing\")))))))","v":"missing"},{"$f":"IF(BD72=\"\",\"\",IF(OR(AY72=0,AND(ISNUMBER($BP$12),$BP$12=0)),\"NA\",IF(CW72=\"ND\",\"ND\",IF(OR(BK72=\"!error\",BO72=\"!error\",BQ72=\"!error\"),\"!error\",IF(BD72=\"NA\",\"NA\",IF(BO72=\"NA\",0,IF(AND(BE72<>99,ISNUMBER(BK72),ISNUMBER(BO72)),BK72/BO72,IF(AND(BE72=99,BQ72=1),BQ72/$BP$12,\"missing\"))))))))","v":"missing"},{"$f":"IF(BD72=\"\",\"\",IF(AY72=0,\"NA\",IF(CW72=\"ND\",\"ND\",IF(OR(BD72=\"!error\",AND(BD72=\"missing\",ISNUMBER(BF72)),BF72=\"!error\",BH72=\"!error\",BI72=\"!error\",BJ72=\"!error\"),\"!error\",IF(BD72=\"NA\",\"NA\",IF(OR(AND(BE72<>0,ISNUMBER(BK72),BK72=0),AND(BE72=1,ISNUMBER(BJ72),BJ72>=10.5),AND(BE72=2,ISNUMBER(BJ72),OR(BJ72<6,BJ72>=9.5)),AND(BE72=3,ISNUMBER(BJ72),OR(BJ72<6,BJ72>9)),AND(BE72=4,ISNUMBER(BJ72),OR(BJ72<6,BJ72>10))),0,IF(AND(ISNUMBER($BP$12),BE72<>0,ISNUMBER(BF72),ISNUMBER(BH72),ISNUMBER(BI72),ISNUMBER(BJ72)),Log_Virus(BE72,$BP$12,BI72,BJ72,BF72,BH72),IF(COUNTIF(BE72,\"<>0\")+COUNT(BF72,BG72,BI72,BJ72)=5,\"!error\",\"missing\"))))))))","v":"missing"},{"$f":"IF($BI$14=0,0,IF(COUNTIF(OFFSET($BD72,0,0,MIN($BI$14,5),1),\"<>NA\")+IF($BI$14>5,COUNTIF(OFFSET($BV72,0,0,$BI$14-5,1),\"<>NA\"),0),1,0))","v":1},{"$f":"IF($BI$14=0,0,IF(COUNTIF(OFFSET($BD72,0,0,MIN($BI$14,5),1),\"O3\")+COUNTIF(OFFSET($BD72,0,0,MIN($BI$14,5),1),\"O3 Cell 1\")+IF($BI$14>5,COUNTIF(OFFSET($BV72,0,0,$BI$14-5,1),\"O3\"),0)+IF($BI$14>5,COUNTIF(OFFSET($BV72,0,0,$BI$14-5,1),\"O3 Cell 1\"),0),1,0))","v":0},{"$f":"IF(OR($AY72=0,AND(COUNTA(D77,F77:G77)=0,COUNTIF(E77,0))),\"NA\",IF(COUNTA(D77:G77),IF(BS72,4,5),IF($BI$15=1,IF(BS72,4,IF(BR72,5,6)),IF(BV72=\"!error\",IF(BS72,4,5),IF(BS72,\"5B\",6)))))","v":6},{"$f":"$BI$11","v":6},{"$f":"IF(AND(IF($BN$4=\"missing\",10,$BN$4)>=6,$AY72<>\"\"),IF(OR($AY72=0,AND($B77=\"NA\",COUNTA($D77,$F77:$G77)=0,COUNTIF($E77,0)),AND($B77=\"NA\",COUNTA($D77:$G77)=0,IF($BI$14=0,0,COUNTIF(OFFSET($BD72,0,0,MIN($BI$14,5),1),\"NA\")+IF($BI$14>5,COUNTIF(OFFSET($BV72,0,0,$BI$14-5,1),\"NA\"),0))=$BI$14),AND($B77=\"NA\",COUNTA($D77:$G77)=0,IF($BI$14<5,COUNTA(OFFSET($D72,$BI$14,0,MIN(5-$BI$14,$BI$15),4))-COUNTIF(OFFSET($E72,$BI$14,0,MIN(5-$BI$14,$BI$15),1),0),0)+IF($BI$14+$BI$15>5,COUNTA(OFFSET($D77,MAX($BI$14-5,0),0,MIN($BI$14+$BI$15-5,$BI$15),4))-COUNTIF(OFFSET($E77,MAX($BI$14-5,0),0,MIN($BI$14+$BI$15-5,$BI$15),1),0),0)),AND($B77=\"NA\",COUNTA($D77:$G77)=0,IF($BI$14<5,COUNTIF(OFFSET($B72,$BI$14,0,MIN(5-$BI$14,$BI$15),1),\"NA\"),0)+IF($BI$14+$BI$15>5,COUNTIF(OFFSET($B77,MAX($BI$14-5,0),0,MIN($BI$14+$BI$15-5,$BI$15),1),\"NA\"),0)<>$BI$15)),\"NA\",IF($B77=\"\",\"missing\",IF(AND($B77<>\"NA\",COUNTA($D77,$F77:$G77)+COUNTIF($E77,\"<>0\")),UPPER($B77),\"!error\"))),\"\")","v":""},{"$f":"IF(BV72=\"\",\"\",IF(BV72=\"FCL\",1,IF(BV72=\"CLO2\",2,IF(BV72=\"O3 Cell 1\",99,IF(BV72=\"O3\",3,IF(BV72=\"CLA\",4,0))))))","v":""},{"$f":"IF(BV72=\"\",\"\",IF(BV72=\"NA\",\"NA\",IF(ISBLANK($D77),\"missing\",IF(AND(BW72=1,ISNUMBER($D77),$D77>4),4,IF(AND(ISNUMBER($D77),$D77>=0),$D77,IF(AND(ISTEXT($D77),$D77=\"ND\"),\"ND\",\"!error\"))))))","v":""},{"$f":"IF(BV72=\"\",\"\",IF(BV72=\"NA\",\"NA\",IF(ISBLANK($E77),\"missing\",IF(OR(AND(ISBLANK($B77),COUNT(BX72,CA72:CB72)=0,ISNUMBER($E77),$E77=0),AND(ISNUMBER($E77),$E77>0),AND(ISTEXT($E77),$E77=\"ND\")),$E77,\"!error\"))))","v":""},{"$f":"IF(BV72=\"\",\"\",IF(AY72=0,\"NA\",IF(OR($BI$12=\"!error\",$BI$13=\"!error\",BY72=\"!error\"),\"!error\",IF(BV72=\"NA\",\"NA\",IF(AND(ISNUMBER(BY72),BY72=0),0,IF(AND(ISNUMBER($BI$12),ISNUMBER($BI$13),ISNUMBER(BY72)),$BI$13*$BI$12/BY72,IF(BY72=\"ND\",\"ND\",\"missing\")))))))","v":""},{"$f":"IF(BV72=\"\",\"\",IF(BV72=\"NA\",\"NA\",IF(ISBLANK($F77),\"missing\",IF(OR(ISNUMBER($F77),$F77=\"ND\"),$F77,\"!error\"))))","v":""},{"$f":"IF(BV72=\"\",\"\",IF(BV72=\"NA\",\"NA\",IF(ISBLANK($G77),\"missing\",IF(OR(AND(ISNUMBER($G77),$G77>=0,$G77<=14),$G77=\"ND\"),$G77,\"!error\"))))","v":""},{"$f":"IF(BV72=\"\",\"\",IF(AY72=0,\"NA\",IF(OR(BX72=\"!error\",BZ72=\"!error\"),\"!error\",IF(BV72=\"NA\",\"NA\",IF(OR(AND(ISNUMBER(BX72),BX72=0),AND(ISNUMBER(BZ72),BZ72=0)),0,IF(AND(ISNUMBER(BX72),ISNUMBER(BZ72)),BX72*BZ72,IF(OR(BX72=\"ND\",BZ72=\"ND\"),\"ND\",\"missing\")))))))","v":""},{"$f":"IF(BV72=\"\",\"\",IF(AY72=0,\"NA\",IF(CX72=\"ND\",\"ND\",IF(OR($BN$12=\"!error\",BV72=\"!error\",AND(BV72=\"missing\",ISNUMBER(BX72)),IF(BW72=1,BX72=\"!error\",0),CA72=\"!error\",CB72=\"!error\"),\"!error\",IF(OR(BV72=\"NA\",AND(ISNUMBER($BN$12),$BN$12=0),AND(BW72<>0,ISNUMBER(CC72),CC72=0),AND(BW72=1,ISNUMBER(CB72),CB72>9),AND(BW72>1,ISNUMBER(CB72),OR(CB72<6,CB72>=9.5))),\"NA\",IF(AND(ISNUMBER($BN$12),BW72<>0,IF(BW72=1,ISNUMBER(BX72),1),ISNUMBER(CA72),ISNUMBER(CB72)),CT_Giardia(BW72,$BN$12,CA72,CB72,IF(BW72=1,BX72,)),IF(COUNTIF(BW72,\"<>0\")+COUNT(BX72,BY72,CA72,CB72)=5,\"!error\",\"missing\")))))))","v":""},{"$f":"IF(BV72=\"\",\"\",IF(OR(AY72=0,AND(ISNUMBER($BN$12),$BN$12=0)),\"NA\",IF(CX72=\"ND\",\"ND\",IF(OR(CC72=\"!error\",CD72=\"!error\",CF72=\"!error\"),\"!error\",IF(BV72=\"NA\",\"NA\",IF(CD72=\"NA\",0,IF(AND(ISNUMBER(CC72),ISNUMBER(CD72)),CC72/CD72,IF(AND(BW72=99,CF72=0.5),CF72/$BN$12,\"missing\"))))))))","v":""},{"$f":"IF(BV72=\"\",\"\",IF(AY72=0,\"NA\",IF(CX72=\"ND\",\"ND\",IF(OR(BV72=\"!error\",AND(BV72=\"missing\",ISNUMBER(BX72)),BX72=\"!error\",BZ72=\"!error\",CA72=\"!error\",CB72=\"!error\"),\"!error\",IF(BV72=\"NA\",\"NA\",IF(OR(AND(BW72<>0,ISNUMBER(CC72),CC72=0),AND(BW72=1,ISNUMBER(CB72),CB72>9),AND(BW72>1,ISNUMBER(CB72),OR(CB72<6,CB72>=9.5))),0,IF(AND(ISNUMBER($BN$12),BW72<>0,ISNUMBER(BX72),ISNUMBER(BZ72),ISNUMBER(CA72),ISNUMBER(CB72)),log_Giardia(BW72,$BN$12,CA72,CB72,BX72,BZ72),IF(COUNTIF(BW72,\"<>0\")+COUNT(BX72,BY72,CA72,CB72)=5,\"!error\",\"missing\"))))))))","v":""},{"$f":"IF(BV72=\"\",\"\",IF(AY72=0,\"NA\",IF(CX72=\"ND\",\"ND\",IF(OR($BP$12=\"!error\",BV72=\"!error\",AND(BV72=\"missing\",ISNUMBER(BX72)),CA72=\"!error\",CB72=\"!error\"),\"!error\",IF(OR(BV72=\"NA\",AND(ISNUMBER($BP$12),$BP$12=0),AND(BW72<>0,ISNUMBER(CC72),CC72=0),AND(BW72=1,ISNUMBER(CB72),OR(CB72<5.5,CB72>=10.5)),AND(OR(BW72=2,BW72=4),ISNUMBER(CB72),OR(CB72<6,CB72>=9.5)),AND(BW72=3,ISNUMBER(CB72),OR(CB72<6,CB72>9))),\"NA\",IF(AND(ISNUMBER($BP$12),BW72<>0,ISNUMBER(CA72),ISNUMBER(CB72)),CT_Virus(BW72,$BP$12,CA72,CB72),IF(COUNTIF(BW72,\"<>0\")+COUNT(BX72,BY72,CA72,CB72)=5,\"!error\",\"missing\")))))))","v":""},{"$f":"IF(BV72=\"\",\"\",IF(OR(AY72=0,AND(ISNUMBER($BP$12),$BP$12=0)),\"NA\",IF(CX72=\"ND\",\"ND\",IF(OR(CC72=\"!error\",CG72=\"!error\",CI72=\"!error\"),\"!error\",IF(BV72=\"NA\",\"NA\",IF(CG72=\"NA\",0,IF(AND(ISNUMBER(CC72),ISNUMBER(CG72)),CC72/CG72,IF(AND(BW72=99,CI72=1),CI72/$BP$12,\"missing\"))))))))","v":""},{"$f":"IF(BV72=\"\",\"\",IF(AY72=0,\"NA\",IF(CX72=\"ND\",\"ND\",IF(OR(BV72=\"!error\",AND(BV72=\"missing\",ISNUMBER(BX72)),BX72=\"!error\",BZ72=\"!error\",CA72=\"!error\",CB72=\"!error\"),\"!error\",IF(BV72=\"NA\",\"NA\",IF(OR(AND(BW72<>0,ISNUMBER(CC72),CC72=0),AND(BW72=1,ISNUMBER(CB72),OR(CB72<5.5,CB72>=10.5)),AND(OR(BW72=2,BW72=4),ISNUMBER(CB72),OR(CB72<6,CB72>=9.5)),AND(BW72=3,ISNUMBER(CB72),OR(CB72<6,CB72>9))),0,IF(AND(ISNUMBER($BP$12),BW72<>0,ISNUMBER(BX72),ISNUMBER(BZ72),ISNUMBER(CA72),ISNUMBER(CB72)),Log_Virus(BW72,$BP$12,CA72,CB72,BX72,BZ72),IF(COUNTIF(BW72,\"<>0\")+COUNT(BX72,BY72,CA72,CB72)=5,\"!error\",\"missing\"))))))))","v":""},null,{"$f":"IF(AY72=\"\",\"\",IF(AY72=0,\"NA\",IF(COUNTIF(BN72:BN76,\"!error\")+COUNTIF(CF72:CF76,\"!error\")>0,\"!error\",IF(COUNT(BN72:BN76,CF72:CF76)>0,SUMIFF(BC72:BC76,\">0\",BN72:BN76)+SUMIFF(BU72:BU76,\">0\",CF72:CF76)+MINIF(BC72:BC76,BU72:BU76,\"1?\",BN72:BN76,CF72:CF76)+MINIF(BC72:BC76,BU72:BU76,\"2?\",BN72:BN76,CF72:CF76)+MINIF(BC72:BC76,BU72:BU76,\"3?\",BN72:BN76,CF72:CF76)+MINIF(BC72:BC76,BU72:BU76,\"4?\",BN72:BN76,CF72:CF76)+MINIF(BC72:BC76,BU72:BU76,\"5?\",BN72:BN76,CF72:CF76)+MINIF(BC72:BC76,BU72:BU76,\"6?\",BN72:BN76,CF72:CF76)+MINIF(BC72:BC76,BU72:BU76,\"7?\",BN72:BN76,CF72:CF76)+MINIF(BC72:BC76,BU72:BU76,\"8?\",BN72:BN76,CF72:CF76)+MINIF(BC72:BC76,BU72:BU76,\"9?\",BN72:BN76,CF72:CF76)+MINIF(BC72:BC76,BU72:BU76,\"10?\",BN72:BN76,CF72:CF76),IF(COUNTIF(BN72:BN76,\"NA\")+COUNTIF(CF72:CF76,\"NA\")=IF($AZ$4=\"missing\",10,SUM($BD$4:$BM$4)),0,\"missing\")))))","v":"missing"},{"$f":"IF(AND(ISNUMBER(CK72),COUNT(BN72:BN76,CF72:CF76)+COUNTIF(BN72:BN76,\"NA\")+COUNTIF(CF72:CF76,\"NA\")<IF($AZ$4=\"missing\",10,SUM($BD$4:$BM$4))),\"*\",\"\")","v":""},{"$f":"IF(AY72=\"\",\"\",IF(OR(AY72=0,AND(ISNUMBER($BN$12),$BN$12=0)),\"NA\",IF(COUNTIF(BM72:BM76,\"!error\")+COUNTIF(CE72:CE76,\"!error\")>0,\"!error\",IF(COUNT(BM72:BM76,CE72:CE76)>0,SUMIFF(BC72:BC76,\">0\",BM72:BM76)+SUMIFF(BU72:BU76,\">0\",CE72:CE76)+MINIF(BC72:BC76,BU72:BU76,\"1?\",BM72:BM76,CE72:CE76)+MINIF(BC72:BC76,BU72:BU76,\"2?\",BM72:BM76,CE72:CE76)+MINIF(BC72:BC76,BU72:BU76,\"3?\",BM72:BM76,CE72:CE76)+MINIF(BC72:BC76,BU72:BU76,\"4?\",BM72:BM76,CE72:CE76)+MINIF(BC72:BC76,BU72:BU76,\"5?\",BM72:BM76,CE72:CE76)+MINIF(BC72:BC76,BU72:BU76,\"6?\",BM72:BM76,CE72:CE76)+MINIF(BC72:BC76,BU72:BU76,\"7?\",BM72:BM76,CE72:CE76)+MINIF(BC72:BC76,BU72:BU76,\"8?\",BM72:BM76,CE72:CE76)+MINIF(BC72:BC76,BU72:BU76,\"9?\",BM72:BM76,CE72:CE76)+MINIF(BC72:BC76,BU72:BU76,\"10?\",BM72:BM76,CE72:CE76),IF(COUNTIF(BM72:BM76,\"NA\")+COUNTIF(CE72:CE76,\"NA\")=IF($AZ$4=\"missing\",10,SUM($BD$4:$BM$4)),0,\"missing\")))))","v":"missing"},{"$f":"IF(AND(ISNUMBER(CM72),COUNT(BM72:BM76,CE72:CE76)+COUNTIF(BM72:BM76,\"NA\")+COUNTIF(CE72:CE76,\"NA\")<IF($AZ$4=\"missing\",10,SUM($BD$4:$BM$4))),\"*\",\"\")","v":""},{"$f":"IF(AY72=\"\",\"\",IF(AY72=0,\"NA\",IF(COUNTIF(BQ72:BQ76,\"!error\")+COUNTIF(CI72:CI76,\"!error\")>0,\"!error\",IF(COUNT(BQ72:BQ76,CI72:CI76)>0,SUMIFF(BC72:BC76,\">0\",BQ72:BQ76)+SUMIFF(BU72:BU76,\">0\",CI72:CI76)+MINIF(BC72:BC76,BU72:BU76,\"1?\",BQ72:BQ76,CI72:CI76)+MINIF(BC72:BC76,BU72:BU76,\"2?\",BQ72:BQ76,CI72:CI76)+MINIF(BC72:BC76,BU72:BU76,\"3?\",BQ72:BQ76,CI72:CI76)+MINIF(BC72:BC76,BU72:BU76,\"4?\",BQ72:BQ76,CI72:CI76)+MINIF(BC72:BC76,BU72:BU76,\"5?\",BQ72:BQ76,CI72:CI76)+MINIF(BC72:BC76,BU72:BU76,\"6?\",BQ72:BQ76,CI72:CI76)+MINIF(BC72:BC76,BU72:BU76,\"7?\",BQ72:BQ76,CI72:CI76)+MINIF(BC72:BC76,BU72:BU76,\"8?\",BQ72:BQ76,CI72:CI76)+MINIF(BC72:BC76,BU72:BU76,\"9?\",BQ72:BQ76,CI72:CI76)+MINIF(BC72:BC76,BU72:BU76,\"10?\",BQ72:BQ76,CI72:CI76),IF(COUNTIF(BQ72:BQ76,\"NA\")+COUNTIF(CI72:CI76,\"NA\")=IF($AZ$4=\"missing\",10,SUM($BD$4:$BM$4)),0,\"missing\")))))","v":"missing"},{"$f":"IF(AND(ISNUMBER(CO72),COUNT(BQ72:BQ76,CI72:CI76)+COUNTIF(BQ72:BQ76,\"NA\")+COUNTIF(CI72:CI76,\"NA\")<IF($AZ$4=\"missing\",10,SUM($BD$4:$BM$4))),\"*\",\"\")","v":""},{"$f":"IF(AY72=\"\",\"\",IF(OR(AY72=0,AND(ISNUMBER($BP$12),$BP$12=0)),\"NA\",IF(COUNTIF(BP72:BP76,\"!error\")+COUNTIF(CH72:CH76,\"!error\")>0,\"!error\",IF(COUNT(BP72:BP76,CH72:CH76)>0,SUMIFF(BC72:BC76,\">0\",BP72:BP76)+SUMIFF(BU72:BU76,\">0\",CH72:CH76)+MINIF(BC72:BC76,BU72:BU76,\"1?\",BP72:BP76,CH72:CH76)+MINIF(BC72:BC76,BU72:BU76,\"2?\",BP72:BP76,CH72:CH76)+MINIF(BC72:BC76,BU72:BU76,\"3?\",BP72:BP76,CH72:CH76)+MINIF(BC72:BC76,BU72:BU76,\"4?\",BP72:BP76,CH72:CH76)+MINIF(BC72:BC76,BU72:BU76,\"5?\",BP72:BP76,CH72:CH76)+MINIF(BC72:BC76,BU72:BU76,\"6?\",BP72:BP76,CH72:CH76)+MINIF(BC72:BC76,BU72:BU76,\"7?\",BP72:BP76,CH72:CH76)+MINIF(BC72:BC76,BU72:BU76,\"8?\",BP72:BP76,CH72:CH76)+MINIF(BC72:BC76,BU72:BU76,\"9?\",BP72:BP76,CH72:CH76)+MINIF(BC72:BC76,BU72:BU76,\"10?\",BP72:BP76,CH72:CH76),IF(COUNTIF(BP72:BP76,\"NA\")+COUNTIF(CH72:CH76,\"NA\")=IF($AZ$4=\"missing\",10,SUM($BD$4:$BM$4)),0,\"missing\")))))","v":"missing"},{"$f":"IF(AND(ISNUMBER(CQ72),COUNT(BP72:BP76,CH72:CH76)+COUNTIF(BP72:BP76,\"NA\")+COUNTIF(CH72:CH76,\"NA\")<IF($AZ$4=\"missing\",10,SUM($BD$4:$BM$4))),\"*\",\"\")","v":""},{"$f":"IF(AY72=\"\",\"\",IF(AND(CM72=\"NA\",CQ72=\"NA\"),\"NA\",IF(OR(AND(ISNUMBER(CM72),ISNUMBER(CQ72)),AND(ISNUMBER(CM72),CQ72=\"NA\"),AND(CM72=\"NA\",ISNUMBER(CQ72)),AND(ISNUMBER(CM72),CM72=0),AND(ISNUMBER(CQ72),CQ72=0)),MIN(CM72,CQ72),IF(OR(CM72=\"!error\",CQ72=\"!error\"),\"!error\",\"missing\"))))","v":"missing"},{"$f":"IF(ISNUMBER(CS72),IF(CM72<CQ72,IF(CN72=\"*\",\"*\",\"\"),IF(CQ72<CM72,IF(CR72=\"*\",\"*\",\"\"),IF(AND(CN72=\"*\",CR72=\"*\"),\"*\",\"\"))),\"\")","v":""},{"$f":"IF(ISNUMBER(CS72),IF(CM72<CQ72,\"(G)\",IF(CQ72<CM72,\"(V)\",IF(AND(CN72=\"\",CR72=\"*\"),\"(G)\",IF(AND(CN72=\"*\",CR72=\"\"),\"(V)\",\"(G/V)\")))),\"\")","v":""},null,{"$f":"IF(OR(BF72=\"ND\",BG72=\"ND\",BI72=\"ND\",BJ72=\"ND\"),\"ND\",\"data\")","v":"data"},{"$f":"IF(OR(BX72=\"ND\",BY72=\"ND\",CA72=\"ND\",CB72=\"ND\"),\"ND\",\"data\")","v":"data"}]
[null," ",{"$f":"$D$15","v":2},null,null,null,null,"missing",{"$f":"$BL73","v":"missing"},{"$f":"$BO73","v":"missing"},{"$f":"$BN73","v":"missing"},{"$f":"$BQ73","v":"missing"},null,null,null,null,{"$f":"IF(AND(BE73=1,D73>4,D73<>\"ND\"),\"Note: The inactivation credit in zone D\" & C73 & \" was restricted due to elevated free chlorine levels.\",\"\")","v":""},null,null,null,null,null,null,null,null,null,null,null,null,null,null,null,null,null,null,null,null,null,null,null,null,null,null,null,null,null,null,null,null,null,1,{"$f":"IF($BE$14=0,0,IF(COUNTIF(OFFSET($BD72,0,0,MIN($BE$14,5),1),\"<>NA\")+IF($BE$14>5,COUNTIF(OFFSET($BV72,0,0,$BE$14-5,1),\"<>NA\"),0),1,0))","v":1},{"$f":"IF($BE$14=0,0,IF(COUNTIF(OFFSET($BD72,0,0,MIN($BE$14,5),1),\"O3\")+COUNTIF(OFFSET($BD72,0,0,MIN($BE$14,5),1),\"O3 Cell 1\")+IF($BE$14>5,COUNTIF(OFFSET($BV72,0,0,$BE$14-5,1),\"O3\"),0)+IF($BE$14>5,COUNTIF(OFFSET($BV72,0,0,$BE$14-5,1),\"O3 Cell 1\"),0),1,0))","v":0},{"$f":"IF(OR($AY73=0,AND(COUNTA(D73,F73:G73)=0,COUNTIF(E73,0))),\"NA\",IF(COUNTA(D73:G73),IF(BA73,4,5),IF($BE$15=1,IF(BA73,4,IF(AZ73,5,6)),IF(BD73=\"!error\",IF(BA73,4,5),IF(BA73,\"5B\",6)))))","v":5},{"$f":"$BE$11","v":2},{"$f":"IF(AND(IF($BN$4=\"missing\",10,$BN$4)>=2,$AY73<>\"\"),IF(OR($AY73=0,AND($B73=\"NA\",COUNTA($D73,$F73:$G73)=0,COUNTIF($E73,0)),AND($B73=\"NA\",COUNTA($D73:$G73)=0,IF($BE$14=0,0,COUNTIF(OFFSET($BD72,0,0,MIN($BE$14,5),1),\"NA\")+IF($BE$14>5,COUNTIF(OFFSET($BV72,0,0,$BE$14-5,1),\"NA\"),0))=$BE$14),AND($B73=\"NA\",COUNTA($D73:$G73)=0,IF($BE$14<5,COUNTA(OFFSET($D72,$BE$14,0,MIN(5-$BE$14,$BE$15),4))-COUNTIF(OFFSET($E72,$BE$14,0,MIN(5-$BE$14,$BE$15),1),0),0)+IF($BE$14+$BE$15>5,COUNTA(OFFSET($D77,MAX($BE$14-5,0),0,MIN($BE$14+$BE$15-5,$BE$15),4))-COUNTIF(OFFSET($E77,MAX($BE$14-5,0),0,MIN($BE$14+$BE$15-5,$BE$15),1),0),0)),AND($B73=\"NA\",COUNTA($D73:$G73)=0,IF($BE$14<5,COUNTIF(OFFSET($B72,$BE$14,0,MIN(5-$BE$14,$BE$15),1),\"NA\"),0)+IF($BE$14+$BE$15>5,COUNTIF(OFFSET($B77,MAX($BE$14-5,0),0,MIN($BE$14+$BE$15-5,$BE$15),1),\"NA\"),0)<>$BE$15)),\"NA\",IF($B73=\"\",\"missing\",IF(AND($B73<>\"NA\",COUNTA($D73,$F73:$G73)+COUNTIF($E73,\"<>0\")),UPPER($B73),\"!error\"))),\"\")","v":" "},0,{"$f":"IF(BD73=\"\",\"\",IF(BD73=\"NA\",\"NA\",IF(ISBLANK($D73),\"missing\",IF(AND(BE73=1,ISNUMBER($D73),$D73>4),4,IF(AND(ISNUMBER($D73),$D73>=0),$D73,IF(AND(ISTEXT($D73),$D73=\"ND\"),\"ND\",\"!error\"))))))","v":"missing"},{"$f":"IF(BD73=\"\",\"\",IF(BD73=\"NA\",\"NA\",IF(ISBLANK($E73),\"missing\",IF(OR(AND(ISBLANK($B73),COUNT(BF73,BI73:BJ73)=0,ISNUMBER($E73),$E73=0),AND(ISNUMBER($E73),$E73>0),AND(ISTEXT($E73),$E73=\"ND\")),$E73,\"!error\"))))","v":"missing"},{"$f":"IF(BD73=\"\",\"\",IF(AY73=0,\"NA\",IF(OR($BE$12=\"!error\",$BE$13=\"!error\",BG73=\"!error\"),\"!error\",IF(BD73=\"NA\",\"NA\",IF(AND(ISNUMBER(BG73),BG73=0),0,IF(AND(ISNUMBER($BE$12),ISNUMBER($BE$13),ISNUMBER(BG73)),$BE$13*$BE$12/BG73,IF(BG73=\"ND\",\"ND\",\"missing\")))))))","v":"missing"},{"$f":"IF(BD73=\"\",\"\",IF(BD73=\"NA\",\"NA\",IF(ISBLANK($F73),\"missing\",IF(OR(ISNUMBER($F73),$F73=\"ND\"),$F73,\"!error\"))))","v":"missing"},{"$f":"IF(BD73=\"\",\"\",IF(BD73=\"NA\",\"NA\",IF(ISBLANK($G73),\"missing\",IF(OR(AND(ISNUMBER($G73),$G73>=0,$G73<=14),$G73=\"ND\"),$G73,\"!error\"))))","v":"missing"},"missing",{"$f":"IF(BD73=\"\",\"\",IF(AY73=0,\"NA\",IF(CW73=\"ND\",\"ND\",IF(OR($BN$12=\"!error\",BD73=\"!error\",AND(BD73=\"missing\",ISNUMBER(BF73)),IF(BE73=1,BF73=\"!error\",0),BI73=\"!error\",BJ73=\"!error\"),\"!error\",IF(OR(BD73=\"NA\",AND(ISNUMBER($BN$12),$BN$12=0),AND(BE73<>0,ISNUMBER(BK73),BK73=0),AND(BE73=1,ISNUMBER(BJ73),BJ73>9),AND(BE73=2,ISNUMBER(BJ73),OR(BJ73<6,BJ73>=9.5)),AND(OR(BE73=3,BE73=4),ISNUMBER(BJ73),OR(BJ73<5.5,BJ73>=9.5))),\"NA\",IF(AND(ISNUMBER($BN$12),BE73<>0,IF(BE73=1,ISNUMBER(BF73),1),ISNUMBER(BI73),ISNUMBER(BJ73)),CT_Giardia(BE73,$BN$12,BI73,BJ73,IF(BE73=1,BF73,)),IF(COUNTIF(BE73,\"<>0\")+COUNT(BF73,BG73,BI73,BJ73)=5,\"!error\",\"missing\")))))))","v":"missing"},{"$f":"IF(BD73=\"\",\"\",IF(OR(AY73=0,AND(ISNUMBER($BN$12),$BN$12=0)),\"NA\",IF(CW73=\"ND\",\"ND\",IF(OR(BK73=\"!error\",BL73=\"!error\",BN73=\"!error\"),\"!error\",IF(BD73=\"NA\",\"NA\",IF(BL73=\"NA\",0,IF(AND(BE73<>99,ISNUMBER(BK73),ISNUMBER(BL73)),BK73/BL73,IF(AND(BE73=99,BN73=0.5),BN73/$BN$12,\"missing\"))))))))","v":"missing"},{"$f":"IF(BD73=\"\",\"\",IF(AY73=0,\"NA\",IF(CW73=\"ND\",\"ND\",IF(OR(BD73=\"!error\",AND(BD73=\"missing\",ISNUMBER(BF73)),BF73=\"!error\",BH73=\"!error\",BI73=\"!error\",BJ73=\"!error\"),\"!error\",IF(BD73=\"NA\",\"NA\",IF(OR(AND(BE73<>0,ISNUMBER(BK73),BK73=0),AND(BE73=1,ISNUMBER(BJ73),BJ73>9),AND(BE73=2,ISNUMBER(BJ73),OR(BJ73<6,BJ73>=9.5)),AND(OR(BE73=3,BE73=4),ISNUMBER(BJ73),OR(BJ73<5.5,BJ73>=9.5))),0,IF(AND(ISNUMBER($BN$12),BE73<>0,ISNUMBER(BF73),ISNUMBER(BH73),ISNUMBER(BI73),ISNUMBER(BJ73)),log_Giardia(BE73,$BN$12,BI73,BJ73,BF73,BH73),IF(COUNTIF(BE73,\"<>0\")+COUNT(BF73,BG73,BI73,BJ73)=5,\"!error\",\"missing\"))))))))","v":"missing"},{"$f":"IF(BD73=\"\",\"\",IF(AY73=0,\"NA\",IF(CW73=\"ND\",\"ND\",IF(OR($BP$12=\"!error\",BD73=\"!error\",AND(BD73=\"missing\",ISNUMBER(BF73)),BI73=\"!error\",BJ73=\"!error\"),\"!error\",IF(OR(BD73=\"NA\",AND(ISNUMBER($BP$12),$BP$12=0),AND(BE73<>0,ISNUMBER(BK73),BK73=0),AND(BE73=1,ISNUMBER(BJ73),BJ73>=10.5),AND(BE73=2,ISNUMBER(BJ73),OR(BJ73<6,BJ73>=9.5)),AND(BE73=3,ISNUMBER(BJ73),OR(BJ73<6,BJ73>9)),AND(BE73=4,ISNUMBER(BJ73),OR(BJ73<6,BJ73>10))),\"NA\",IF(AND(ISNUMBER($BP$12),BE73<>0,ISNUMBER(BI73),ISNUMBER(BJ73)),CT_Virus(BE73,$BP$12,BI73,BJ73),IF(COUNTIF(BE73,\"<>0\")+COUNT(BF73,BG73,BI73,BJ73)=5,\"!error\",\"missing\")))))))","v":"missing"},{"$f":"IF(BD73=\"\",\"\",IF(OR(AY73=0,AND(ISNUMBER($BP$12),$BP$12=0)),\"NA\",IF(CW73=\"ND\",\"ND\",IF(OR(BK73=\"!error\",BO73=\"!error\",BQ73=\"!error\"),\"!error\",IF(BD73=\"NA\",\"NA\",IF(BO73=\"NA\",0,IF(AND(BE73<>99,ISNUMBER(BK73),ISNUMBER(BO73)),BK73/BO73,IF(AND(BE73=99,BQ73=1),BQ73/$BP$12,\"missing\"))))))))","v":"missing"},{"$f":"IF(BD73=\"\",\"\",IF(AY73=0,\"NA\",IF(CW73=\"ND\",\"ND\",IF(OR(BD73=\"!error\",AND(BD73=\"missing\",ISNUMBER(BF73)),BF73=\"!error\",BH73=\"!error\",BI73=\"!error\",BJ73=\"!error\"),\"!error\",IF(BD73=\"NA\",\"NA\",IF(OR(AND(BE73<>0,ISNUMBER(BK73),BK73=0),AND(BE73=1,ISNUMBER(BJ73),BJ73>=10.5),AND(BE73=2,ISNUMBER(BJ73),OR(BJ73<6,BJ73>=9.5)),AND(BE73=3,ISNUMBER(BJ73),OR(BJ73<6,BJ73>9)),AND(BE73=4,ISNUMBER(BJ73),OR(BJ73<6,BJ73>10))),0,IF(AND(ISNUMBER($BP$12),BE73<>0,ISNUMBER(BF73),ISNUMBER(BH73),ISNUMBER(BI73),ISNUMBER(BJ73)),Log_Virus(BE73,$BP$12,BI73,BJ73,BF73,BH73),IF(COUNTIF(BE73,\"<>0\")+COUNT(BF73,BG73,BI73,BJ73)=5,\"!error\",\"missing\"))))))))","v":"missing"},{"$f":"IF($BJ$14=0,0,IF(COUNTIF(OFFSET($BD72,0,0,MIN($BJ$14,5),1),\"<>NA\")+IF($BJ$14>5,COUNTIF(OFFSET($BV72,0,0,$BJ$14-5,1),\"<>NA\"),0),1,0))","v":1},{"$f":"IF($BJ$14=0,0,IF(COUNTIF(OFFSET($BD72,0,0,MIN($BJ$14,5),1),\"O3\")+COUNTIF(OFFSET($BD72,0,0,MIN($BJ$14,5),1),\"O3 Cell 1\")+IF($BJ$14>5,COUNTIF(OFFSET($BV72,0,0,$BJ$14-5,1),\"O3\"),0)+IF($BJ$14>5,COUNTIF(OFFSET($BV72,0,0,$BJ$14-5,1),\"O3 Cell 1\"),0),1,0))","v":0},{"$f":"IF(OR($AY73=0,AND(COUNTA(D78,F78:G78)=0,COUNTIF(E78,0))),\"NA\",IF(COUNTA(D78:G78),IF(BS73,4,5),IF($BJ$15=1,IF(BS73,4,IF(BR73,5,6)),IF(BV73=\"!error\",IF(BS73,4,5),IF(BS73,\"5B\",6)))))","v":6},{"$f":"$BJ$11","v":7},{"$f":"IF(AND(IF($BN$4=\"missing\",10,$BN$4)>=7,$AY73<>\"\"),IF(OR($AY73=0,AND($B78=\"NA\",COUNTA($D78,$F78:$G78)=0,COUNTIF($E78,0)),AND($B78=\"NA\",COUNTA($D78:$G78)=0,IF($BJ$14=0,0,COUNTIF(OFFSET($BD72,0,0,MIN($BJ$14,5),1),\"NA\")+IF($BJ$14>5,COUNTIF(OFFSET($BV72,0,0,$BJ$14-5,1),\"NA\"),0))=$BJ$14),AND($B78=\"NA\",COUNTA($D78:$G78)=0,IF($BJ$14<5,COUNTA(OFFSET($D72,$BJ$14,0,MIN(5-$BJ$14,$BJ$15),4))-COUNTIF(OFFSET($E72,$BJ$14,0,MIN(5-$BJ$14,$BJ$15),1),0),0)+IF($BJ$14+$BJ$15>5,COUNTA(OFFSET($D77,MAX($BJ$14-5,0),0,MIN($BJ$14+$BJ$15-5,$BJ$15),4))-COUNTIF(OFFSET($E77,MAX($BJ$14-5,0),0,MIN($BJ$14+$BJ$15-5,$BJ$15),1),0),0)),AND($B78=\"NA\",COUNTA($D78:$G78)=0,IF($BJ$14<5,COUNTIF(OFFSET($B72,$BJ$14,0,MIN(5-$BJ$14,$BJ$15),1),\"NA\"),0)+IF($BJ$14+$BJ$15>5,COUNTIF(OFFSET($B77,MAX($BJ$14-5,0),0,MIN($BJ$14+$BJ$15-5,$BJ$15),1),\"NA\"),0)<>$BJ$15)),\"NA\",IF($B78=\"\",\"missing\",IF(AND($B78<>\"NA\",COUNTA($D78,$F78:$G78)+COUNTIF($E78,\"<>0\")),UPPER($B78),\"!error\"))),\"\")","v":""},"",{"$f":"IF(BV73=\"\",\"\",IF(BV73=\"NA\",\"NA\",IF(ISBLANK($D78),\"missing\",IF(AND(BW73=1,ISNUMBER($D78),$D78>4),4,IF(AND(ISNUMBER($D78),$D78>=0),$D78,IF(AND(ISTEXT($D78),$D78=\"ND\"),\"ND\",\"!error\"))))))","v":""},{"$f":"IF(BV73=\"\",\"\",IF(BV73=\"NA\",\"NA\",IF(ISBLANK($E78),\"missing\",IF(OR(AND(ISBLANK($B78),COUNT(BX73,CA73:CB73)=0,ISNUMBER($E78),$E78=0),AND(ISNUMBER($E78),$E78>0),AND(ISTEXT($E78),$E78=\"ND\")),$E78,\"!error\"))))","v":""},{"$f":"IF(BV73=\"\",\"\",IF(AY73=0,\"NA\",IF(OR($BJ$12=\"!error\",$BJ$13=\"!error\",BY73=\"!error\"),\"!error\",IF(BV73=\"NA\",\"NA\",IF(AND(ISNUMBER(BY73),BY73=0),0,IF(AND(ISNUMBER($BJ$12),ISNUMBER($BJ$13),ISNUMBER(BY73)),$BJ$13*$BJ$12/BY73,IF(BY73=\"ND\",\"ND\",\"missing\")))))))","v":""},{"$f":"IF(BV73=\"\",\"\",IF(BV73=\"NA\",\"NA\",IF(ISBLANK($F78),\"missing\",IF(OR(ISNUMBER($F78),$F78=\"ND\"),$F78,\"!error\"))))","v":""},{"$f":"IF(BV73=\"\",\"\",IF(BV73=\"NA\",\"NA\",IF(ISBLANK($G78),\"missing\",IF(OR(AND(ISNUMBER($G78),$G78>=0,$G78<=14),$G78=\"ND\"),$G78,\"!error\"))))","v":""},"",{"$f":"IF(BV73=\"\",\"\",IF(AY73=0,\"NA\",IF(CX73=\"ND\",\"ND\",IF(OR($BN$12=\"!error\",BV73=\"!error\",AND(BV73=\"missing\",ISNUMBER(BX73)),IF(BW73=1,BX73=\"!error\",0),CA73=\"!error\",CB73=\"!error\"),\"!error\",IF(OR(BV73=\"NA\",AND(ISNUMBER($BN$12),$BN$12=0),AND(BW73<>0,ISNUMBER(CC73),CC73=0),AND(BW73=1,ISNUMBER(CB73),CB73>9),AND(BW73>1,ISNUMBER(CB73),OR(CB73<6,CB73>=9.5))),\"NA\",IF(AND(ISNUMBER($BN$12),BW73<>0,IF(BW73=1,ISNUMBER(BX73),1),ISNUMBER(CA73),ISNUMBER(CB73)),CT_Giardia(BW73,$BN$12,CA73,CB73,IF(BW73=1,BX73,)),IF(COUNTIF(BW73,\"<>0\")+COUNT(BX73,BY73,CA73,CB73)=5,\"!error\",\"missing\")))))))","v":""},{"$f":"IF(BV73=\"\",\"\",IF(OR(AY73=0,AND(ISNUMBER($BN$12),$BN$12=0)),\"NA\",IF(CX73=\"ND\",\"ND\",IF(OR(CC73=\"!error\",CD73=\"!error\",CF73=\"!error\"),\"!error\",IF(BV73=\"NA\",\"NA\",IF(CD73=\"NA\",0,IF(AND(ISNUMBER(CC73),ISNUMBER(CD73)),CC73/CD73,IF(AND(BW73=99,CF73=0.5),CF73/$BN$12,\"missing\"))))))))","v":""},{"$f":"IF(BV73=\"\",\"\",IF(AY73=0,\"NA\",IF(CX73=\"ND\",\"ND\",IF(OR(BV73=\"!error\",AND(BV73=\"missing\",ISNUMBER(BX73)),BX73=\"!error\",BZ73=\"!error\",CA73=\"!error\",CB73=\"!error\"),\"!error\",IF(BV73=\"NA\",\"NA\",IF(OR(AND(BW73<>0,ISNUMBER(CC73),CC73=0),AND(BW73=1,ISNUMBER(CB73),CB73>9),AND(BW73>1,ISNUMBER(CB73),OR(CB73<6,CB73>=9.5))),0,IF(AND(ISNUMBER($BN$12),BW73<>0,ISNUMBER(BX73),ISNUMBER(BZ73),ISNUMBER(CA73),ISNUMBER(CB73)),log_Giardia(BW73,$BN$12,CA73,CB73,BX73,BZ73),IF(COUNTIF(BW73,\"<>0\")+COUNT(BX73,BY73,CA73,CB73)=5,\"!error\",\"missing\"))))))))","v":""},{"$f":"IF(BV73=\"\",\"\",IF(AY73=0,\"NA\",IF(CX73=\"ND\",\"ND\",IF(OR($BP$12=\"!error\",BV73=\"!error\",AND(BV73=\"missing\",ISNUMBER(BX73)),CA73=\"!error\",CB73=\"!error\"),\"!error\",IF(OR(BV73=\"NA\",AND(ISNUMBER($BP$12),$BP$12=0),AND(BW73<>0,ISNUMBER(CC73),CC73=0),AND(BW73=1,ISNUMBER(CB73),OR(CB73<5.5,CB73>=10.5)),AND(OR(BW73=2,BW73=4),ISNUMBER(CB73),OR(CB73<6,CB73>=9.5)),AND(BW73=3,ISNUMBER(CB73),OR(CB73<6,CB73>9))),\"NA\",IF(AND(ISNUMBER($BP$12),BW73<>0,ISNUMBER(CA73),ISNUMBER(CB73)),CT_Virus(BW73,$BP$12,CA73,CB73),IF(COUNTIF(BW73,\"<>0\")+COUNT(BX73,BY73,CA73,CB73)=5,\"!error\",\"missing\")))))))","v":""},{"$f":"IF(BV73=\"\",\"\",IF(OR(AY73=0,AND(ISNUMBER($BP$12),$BP$12=0)),\"NA\",IF(CX73=\"ND\",\"ND\",IF(OR(CC73=\"!error\",CG73=\"!error\",CI73=\"!error\"),\"!error\",IF(BV73=\"NA\",\"NA\",IF(CG73=\"NA\",0,IF(AND(ISNUMBER(CC73),ISNUMBER(CG73)),CC73/CG73,IF(AND(BW73=99,CI73=1),CI73/$BP$12,\"missing\"))))))))","v":""},{"$f":"IF(BV73=\"\",\"\",IF(AY73=0,\"NA\",IF(CX73=\"ND\",\"ND\",IF(OR(BV73=\"!error\",AND(BV73=\"missing\",ISNUMBER(BX73)),BX73=\"!error\",BZ73=\"!error\",CA73=\"!error\",CB73=\"!error\"),\"!error\",IF(BV73=\"NA\",\"NA\",IF(OR(AND(BW73<>0,ISNUMBER(CC73),CC73=0),AND(BW73=1,ISNUMBER(CB73),OR(CB73<5.5,CB73>=10.5)),AND(OR(BW73=2,BW73=4),ISNUMBER(CB73),OR(CB73<6,CB73>=9.5)),AND(BW73=3,ISNUMBER(CB73),OR(CB73<6,CB73>9))),0,IF(AND(ISNUMBER($BP$12),BW73<>0,ISNUMBER(BX73),ISNUMBER(BZ73),ISNUMBER(CA73),ISNUMBER(CB73)),Log_Virus(BW73,$BP$12,CA73,CB73,BX73,BZ73),IF(COUNTIF(BW73,\"<>0\")+COUNT(BX73,BY73,CA73,CB73)=5,\"!error\",\"missing\"))))))))","v":""},null,null,null,null,null,null,null,null,null,null,null,null,null,{"$f":"IF(OR(BF73=\"ND\",BG73=\"ND\",BI73=\"ND\",BJ73=\"ND\"),\"ND\",\"data\")","v":"data"},{"$f":"IF(OR(BX73=\"ND\",BY73=\"ND\",CA73=\"ND\",CB73=\"ND\"),\"ND\",\"data\")","v":"data"}]
[null," ",{"$f":"$E$15","v":3},null,null,null,null,{"$f":"IF(BL74=\"!error\",\"!error\",$BK74)","v":"missing"},"missing","missing","missing","missing",null,null,null,null,"",null,null,null,null,null,null,null,null,null,null,null,null,null,null,null,null,null,null,null,null,null,null,null,null,null,null,null,null,null,null,null,null,null,1,{"$f":"IF($BF$14=0,0,IF(COUNTIF(OFFSET($BD72,0,0,MIN($BF$14,5),1),\"<>NA\")+IF($BF$14>5,COUNTIF(OFFSET($BV72,0,0,$BF$14-5,1),\"<>NA\"),0),1,0))","v":1},{"$f":"IF($BF$14=0,0,IF(COUNTIF(OFFSET($BD72,0,0,MIN($BF$14,5),1),\"O3\")+COUNTIF(OFFSET($BD72,0,0,MIN($BF$14,5),1),\"O3 Cell 1\")+IF($BF$14>5,COUNTIF(OFFSET($BV72,0,0,$BF$14-5,1),\"O3\"),0)+IF($BF$14>5,COUNTIF(OFFSET($BV72,0,0,$BF$14-5,1),\"O3 Cell 1\"),0),1,0))","v":0},{"$f":"IF(OR($AY74=0,AND(COUNTA(D74,F74:G74)=0,COUNTIF(E74,0))),\"NA\",IF(COUNTA(D74:G74),IF(BA74,4,5),IF($BF$15=1,IF(BA74,4,IF(AZ74,5,6)),IF(BD74=\"!error\",IF(BA74,4,5),IF(BA74,\"5B\",6)))))","v":5},{"$f":"$BF$11","v":3},{"$f":"IF(AND(IF($BN$4=\"missing\",10,$BN$4)>=3,$AY74<>\"\"),IF(OR($AY74=0,AND($B74=\"NA\",COUNTA($D74,$F74:$G74)=0,COUNTIF($E74,0)),AND($B74=\"NA\",COUNTA($D74:$G74)=0,IF($BF$14=0,0,COUNTIF(OFFSET($BD72,0,0,MIN($BF$14,5),1),\"NA\")+IF($BF$14>5,COUNTIF(OFFSET($BV72,0,0,$BF$14-5,1),\"NA\"),0))=$BF$14),AND($B74=\"NA\",COUNTA($D74:$G74)=0,IF($BF$14<5,COUNTA(OFFSET($D72,$BF$14,0,MIN(5-$BF$14,$BF$15),4))-COUNTIF(OFFSET($E72,$BF$14,0,MIN(5-$BF$14,$BF$15),1),0),0)+IF($BF$14+$BF$15>5,COUNTA(OFFSET($D77,MAX($BF$14-5,0),0,MIN($BF$14+$BF$15-5,$BF$15),4))-COUNTIF(OFFSET($E77,MAX($BF$14-5,0),0,MIN($BF$14+$BF$15-5,$BF$15),1),0),0)),AND($B74=\"NA\",COUNTA($D74:$G74)=0,IF($BF$14<5,COUNTIF(OFFSET($B72,$BF$14,0,MIN(5-$BF$14,$BF$15),1),\"NA\"),0)+IF($BF$14+$BF$15>5,COUNTIF(OFFSET($B77,MAX($BF$14-5,0),0,MIN($BF$14+$BF$15-5,$BF$15),1),\"NA\"),0)<>$BF$15)),\"NA\",IF($B74=\"\",\"missing\",IF(AND($B74<>\"NA\",COUNTA($D74,$F74:$G74)+COUNTIF($E74,\"<>0\")),UPPER($B74),\"!error\"))),\"\")","v":" "},0,"missing","missing",{"$f":"IF(BD74=\"\",\"\",IF(AY74=0,\"NA\",IF(OR($BF$12=\"!error\",$BF$13=\"!error\",BG74=\"!error\"),\"!error\",IF(BD74=\"NA\",\"NA\",IF(AND(ISNUMBER(BG74),BG74=0),0,IF(AND(ISNUMBER($BF$12),ISNUMBER($BF$13),ISNUMBER(BG74)),$BF$13*$BF$12/BG74,IF(BG74=\"ND\",\"ND\",\"missing\")))))))","v":"missing"},"missing","missing","missing",{"$f":"IF(BD74=\"\",\"\",IF(AY74=0,\"NA\",IF(CW74=\"ND\",\"ND\",IF(OR($BN$12=\"!error\",BD74=\"!error\",AND(BD74=\"missing\",ISNUMBER(BF74)),IF(BE74=1,BF74=\"!error\",0),BI74=\"!error\",BJ74=\"!error\"),\"!error\",IF(OR(BD74=\"NA\",AND(ISNUMBER($BN$12),$BN$12=0),AND(BE74<>0,ISNUMBER(BK74),BK74=0),AND(BE74=1,ISNUMBER(BJ74),BJ74>9),AND(BE74=2,ISNUMBER(BJ74),OR(BJ74<6,BJ74>=9.5)),AND(OR(BE74=3,BE74=4),ISNUMBER(BJ74),OR(BJ74<5.5,BJ74>=9.5))),\"NA\",IF(AND(ISNUMBER($BN$12),BE74<>0,IF(BE74=1,ISNUMBER(BF74),1),ISNUMBER(BI74),ISNUMBER(BJ74)),CT_Giardia(BE74,$BN$12,BI74,BJ74,IF(BE74=1,BF74,)),IF(COUNTIF(BE74,\"<>0\")+COUNT(BF74,BG74,BI74,BJ74)=5,\"!error\",\"missing\")))))))","v":"missing"},{"$f":"IF(BD74=\"\",\"\",IF(OR(AY74=0,AND(ISNUMBER($BN$12),$BN$12=0)),\"NA\",IF(CW74=\"ND\",\"ND\",IF(OR(BK74=\"!error\",BL74=\"!error\",BN74=\"!error\"),\"!error\",IF(BD74=\"NA\",\"NA\",IF(BL74=\"NA\",0,IF(AND(BE74<>99,ISNUMBER(BK74),ISNUMBER(BL74)),BK74/BL74,IF(AND(BE74=99,BN74=0.5),BN74/$BN$12,\"missing\"))))))))","v":"missing"},{"$f":"IF(BD74=\"\",\"\",IF(AY74=0,\"NA\",IF(CW74=\"ND\",\"ND\",IF(OR(BD74=\"!error\",AND(BD74=\"missing\",ISNUMBER(BF74)),BF74=\"!error\",BH74=\"!error\",BI74=\"!error\",BJ74=\"!error\"),\"!error\",IF(BD74=\"NA\",\"NA\",IF(OR(AND(BE74<>0,ISNUMBER(BK74),BK74=0),AND(BE74=1,ISNUMBER(BJ74),BJ74>9),AND(BE74=2,ISNUMBER(BJ74),OR(BJ74<6,BJ74>=9.5)),AND(OR(BE74=3,BE74=4),ISNUMBER(BJ74),OR(BJ74<5.5,BJ74>=9.5))),0,IF(AND(ISNUMBER($BN$12),BE74<>0,ISNUMBER(BF74),ISNUMBER(BH74),ISNUMBER(BI74),ISNUMBER(BJ74)),log_Giardia(BE74,$BN$12,BI74,BJ74,BF74,BH74),IF(COUNTIF(BE74,\"<>0\")+COUNT(BF74,BG74,BI74,BJ74)=5,\"!error\",\"missing\"))))))))","v":"missing"},{"$f":"IF(BD74=\"\",\"\",IF(AY74=0,\"NA\",IF(CW74=\"ND\",\"ND\",IF(OR($BP$12=\"!error\",BD74=\"!error\",AND(BD74=\"missing\",ISNUMBER(BF74)),BI74=\"!error\",BJ74=\"!error\"),\"!error\",IF(OR(BD74=\"NA\",AND(ISNUMBER($BP$12),$BP$12=0),AND(BE74<>0,ISNUMBER(BK74),BK74=0),AND(BE74=1,ISNUMBER(BJ74),BJ74>=10.5),AND(BE74=2,ISNUMBER(BJ74),OR(BJ74<6,BJ74>=9.5)),AND(BE74=3,ISNUMBER(BJ74),OR(BJ74<6,BJ74>9)),AND(BE74=4,ISNUMBER(BJ74),OR(BJ74<6,BJ74>10))),\"NA\",IF(AND(ISNUMBER($BP$12),BE74<>0,ISNUMBER(BI74),ISNUMBER(BJ74)),CT_Virus(BE74,$BP$12,BI74,BJ74),IF(COUNTIF(BE74,\"<>0\")+COUNT(BF74,BG74,BI74,BJ74)=5,\"!error\",\"missing\")))))))","v":"missing"},{"$f":"IF(BD74=\"\",\"\",IF(OR(AY74=0,AND(ISNUMBER($BP$12),$BP$12=0)),\"NA\",IF(CW74=\"ND\",\"ND\",IF(OR(BK74=\"!error\",BO74=\"!error\",BQ74=\"!error\"),\"!error\",IF(BD74=\"NA\",\"NA\",IF(BO74=\"NA\",0,IF(AND(BE74<>99,ISNUMBER(BK74),ISNUMBER(BO74)),BK74/BO74,IF(AND(BE74=99,BQ74=1),BQ74/$BP$12,\"missing\"))))))))","v":"missing"},{"$f":"IF(BD74=\"\",\"\",IF(AY74=0,\"NA\",IF(CW74=\"ND\",\"ND\",IF(OR(BD74=\"!error\",AND(BD74=\"missing\",ISNUMBER(BF74)),BF74=\"!error\",BH74=\"!error\",BI74=\"!error\",BJ74=\"!error\"),\"!error\",IF(BD74=\"NA\",\"NA\",IF(OR(AND(BE74<>0,ISNUMBER(BK74),BK74=0),AND(BE74=1,ISNUMBER(BJ74),BJ74>=10.5),AND(BE74=2,ISNUMBER(BJ74),OR(BJ74<6,BJ74>=9.5)),AND(BE74=3,ISNUMBER(BJ74),OR(BJ74<6,BJ74>9)),AND(BE74=4,ISNUMBER(BJ74),OR(BJ74<6,BJ74>10))),0,IF(AND(ISNUMBER($BP$12),BE74<>0,ISNUMBER(BF74),ISNUMBER(BH74),ISNUMBER(BI74),ISNUMBER(BJ74)),Log_Virus(BE74,$BP$12,BI74,BJ74,BF74,BH74),IF(COUNTIF(BE74,\"<>0\")+COUNT(BF74,BG74,BI74,BJ74)=5,\"!error\",\"missing\"))))))))","v":"missing"},{"$f":"IF($BK$14=0,0,IF(COUNTIF(OFFSET($BD72,0,0,MIN($BK$14,5),1),\"<>NA\")+IF($BK$14>5,COUNTIF(OFFSET($BV72,0,0,$BK$14-5,1),\"<>NA\"),0),1,0))","v":1},{"$f":"IF($BK$14=0,0,IF(COUNTIF(OFFSET($BD72,0,0,MIN($BK$14,5),1),\"O3\")+COUNTIF(OFFSET($BD72,0,0,MIN($BK$14,5),1),\"O3 Cell 1\")+IF($BK$14>5,COUNTIF(OFFSET($BV72,0,0,$BK$14-5,1),\"O3\"),0)+IF($BK$14>5,COUNTIF(OFFSET($BV72,0,0,$BK$14-5,1),\"O3 Cell 1\"),0),1,0))","v":0},{"$f":"IF(OR($AY74=0,AND(COUNTA(D79,F79:G79)=0,COUNTIF(E79,0))),\"NA\",IF(COUNTA(D79:G79),IF(BS74,4,5),IF($BK$15=1,IF(BS74,4,IF(BR74,5,6)),IF(BV74=\"!error\",IF(BS74,4,5),IF(BS74,\"5B\",6)))))","v":6},{"$f":"$BK$11","v":8},{"$f":"IF(AND(IF($BN$4=\"missing\",10,$BN$4)>=8,$AY74<>\"\"),IF(OR($AY74=0,AND($B79=\"NA\",COUNTA($D79,$F79:$G79)=0,COUNTIF($E79,0)),AND($B79=\"NA\",COUNTA($D79:$G79)=0,IF($BK$14=0,0,COUNTIF(OFFSET($BD72,0,0,MIN($BK$14,5),1),\"NA\")+IF($BK$14>5,COUNTIF(OFFSET($BV72,0,0,$BK$14-5,1),\"NA\"),0))=$BK$14),AND($B79=\"NA\",COUNTA($D79:$G79)=0,IF($BK$14<5,COUNTA(OFFSET($D72,$BK$14,0,MIN(5-$BK$14,$BK$15),4))-COUNTIF(OFFSET($E72,$BK$14,0,MIN(5-$BK$14,$BK$15),1),0),0)+IF($BK$14+$BK$15>5,COUNTA(OFFSET($D77,MAX($BK$14-5,0),0,MIN($BK$14+$BK$15-5,$BK$15),4))-COUNTIF(OFFSET($E77,MAX($BK$14-5,0),0,MIN($BK$14+$BK$15-5,$BK$15),1),0),0)),AND($B79=\"NA\",COUNTA($D79:$G79)=0,IF($BK$14<5,COUNTIF(OFFSET($B72,$BK$14,0,MIN(5-$BK$14,$BK$15),1),\"NA\"),0)+IF($BK$14+$BK$15>5,COUNTIF(OFFSET($B77,MAX($BK$14-5,0),0,MIN($BK$14+$BK$15-5,$BK$15),1),\"NA\"),0)<>$BK$15)),\"NA\",IF($B79=\"\",\"missing\",IF(AND($B79<>\"NA\",COUNTA($D79,$F79:$G79)+COUNTIF($E79,\"<>0\")),UPPER($B79),\"!error\"))),\"\")","v":""},"",{"$f":"IF(BV74=\"\",\"\",IF(BV74=\"NA\",\"NA\",IF(ISBLANK($D79),\"missing\",IF(AND(BW74=1,ISNUMBER($D79),$D79>4),4,IF(AND(ISNUMBER($D79),$D79>=0),$D79,IF(AND(ISTEXT($D79),$D79=\"ND\"),\"ND\",\"!error\"))))))","v":""},{"$f":"IF(BV74=\"\",\"\",IF(BV74=\"NA\",\"NA\",IF(ISBLANK($E79),\"missing\",IF(OR(AND(ISBLANK($B79),COUNT(BX74,CA74:CB74)=0,ISNUMBER($E79),$E79=0),AND(ISNUMBER($E79),$E79>0),AND(ISTEXT($E79),$E79=\"ND\")),$E79,\"!error\"))))","v":""},{"$f":"IF(BV74=\"\",\"\",IF(AY74=0,\"NA\",IF(OR($BK$12=\"!error\",$BK$13=\"!error\",BY74=\"!error\"),\"!error\",IF(BV74=\"NA\",\"NA\",IF(AND(ISNUMBER(BY74),BY74=0),0,IF(AND(ISNUMBER($BK$12),ISNUMBER($BK$13),ISNUMBER(BY74)),$BK$13*$BK$12/BY74,IF(BY74=\"ND\",\"ND\",\"missing\")))))))","v":""},{"$f":"IF(BV74=\"\",\"\",IF(BV74=\"NA\",\"NA\",IF(ISBLANK($F79),\"missing\",IF(OR(ISNUMBER($F79),$F79=\"ND\"),$F79,\"!error\"))))","v":""},{"$f":"IF(BV74=\"\",\"\",IF(BV74=\"NA\",\"NA\",IF(ISBLANK($G79),\"missing\",IF(OR(AND(ISNUMBER($G79),$G79>=0,$G79<=14),$G79=\"ND\"),$G79,\"!error\"))))","v":""},"",{"$f":"IF(BV74=\"\",\"\",IF(AY74=0,\"NA\",IF(CX74=\"ND\",\"ND\",IF(OR($BN$12=\"!error\",BV74=\"!error\",AND(BV74=\"missing\",ISNUMBER(BX74)),IF(BW74=1,BX74=\"!error\",0),CA74=\"!error\",CB74=\"!error\"),\"!error\",IF(OR(BV74=\"NA\",AND(ISNUMBER($BN$12),$BN$12=0),AND(BW74<>0,ISNUMBER(CC74),CC74=0),AND(BW74=1,ISNUMBER(CB74),CB74>9),AND(BW74>1,ISNUMBER(CB74),OR(CB74<6,CB74>=9.5))),\"NA\",IF(AND(ISNUMBER($BN$12),BW74<>0,IF(BW74=1,ISNUMBER(BX74),1),ISNUMBER(CA74),ISNUMBER(CB74)),CT_Giardia(BW74,$BN$12,CA74,CB74,IF(BW74=1,BX74,)),IF(COUNTIF(BW74,\"<>0\")+COUNT(BX74,BY74,CA74,CB74)=5,\"!error\",\"missing\")))))))","v":""},{"$f":"IF(BV74=\"\",\"\",IF(OR(AY74=0,AND(ISNUMBER($BN$12),$BN$12=0)),\"NA\",IF(CX74=\"ND\",\"ND\",IF(OR(CC74=\"!error\",CD74=\"!error\",CF74=\"!error\"),\"!error\",IF(BV74=\"NA\",\"NA\",IF(CD74=\"NA\",0,IF(AND(ISNUMBER(CC74),ISNUMBER(CD74)),CC74/CD74,IF(AND(BW74=99,CF74=0.5),CF74/$BN$12,\"missing\"))))))))","v":""},{"$f":"IF(BV74=\"\",\"\",IF(AY74=0,\"NA\",IF(CX74=\"ND\",\"ND\",IF(OR(BV74=\"!error\",AND(BV74=\"missing\",ISNUMBER(BX74)),BX74=\"!error\",BZ74=\"!error\",CA74=\"!error\",CB74=\"!error\"),\"!error\",IF(BV74=\"NA\",\"NA\",IF(OR(AND(BW74<>0,ISNUMBER(CC74),CC74=0),AND(BW74=1,ISNUMBER(CB74),CB74>9),AND(BW74>1,ISNUMBER(CB74),OR(CB74<6,CB74>=9.5))),0,IF(AND(ISNUMBER($BN$12),BW74<>0,ISNUMBER(BX74),ISNUMBER(BZ74),ISNUMBER(CA74),ISNUMBER(CB74)),log_Giardia(BW74,$BN$12,CA74,CB74,BX74,BZ74),IF(COUNTIF(BW74,\"<>0\")+COUNT(BX74,BY74,CA74,CB74)=5,\"!error\",\"missing\"))))))))","v":""},{"$f":"IF(BV74=\"\",\"\",IF(AY74=0,\"NA\",IF(CX74=\"ND\",\"ND\",IF(OR($BP$12=\"!error\",BV74=\"!error\",AND(BV74=\"missing\",ISNUMBER(BX74)),CA74=\"!error\",CB74=\"!error\"),\"!error\",IF(OR(BV74=\"NA\",AND(ISNUMBER($BP$12),$BP$12=0),AND(BW74<>0,ISNUMBER(CC74),CC74=0),AND(BW74=1,ISNUMBER(CB74),OR(CB74<5.5,CB74>=10.5)),AND(OR(BW74=2,BW74=4),ISNUMBER(CB74),OR(CB74<6,CB74>=9.5)),AND(BW74=3,ISNUMBER(CB74),OR(CB74<6,CB74>9))),\"NA\",IF(AND(ISNUMBER($BP$12),BW74<>0,ISNUMBER(CA74),ISNUMBER(CB74)),CT_Virus(BW74,$BP$12,CA74,CB74),IF(COUNTIF(BW74,\"<>0\")+COUNT(BX74,BY74,CA74,CB74)=5,\"!error\",\"missing\")))))))","v":""},{"$f":"IF(BV74=\"\",\"\",IF(OR(AY74=0,AND(ISNUMBER($BP$12),$BP$12=0)),\"NA\",IF(CX74=\"ND\",\"ND\",IF(OR(CC74=\"!error\",CG74=\"!error\",CI74=\"!error\"),\"!error\",IF(BV74=\"NA\",\"NA\",IF(CG74=\"NA\",0,IF(AND(ISNUMBER(CC74),ISNUMBER(CG74)),CC74/CG74,IF(AND(BW74=99,CI74=1),CI74/$BP$12,\"missing\"))))))))","v":""},{"$f":"IF(BV74=\"\",\"\",IF(AY74=0,\"NA\",IF(CX74=\"ND\",\"ND\",IF(OR(BV74=\"!error\",AND(BV74=\"missing\",ISNUMBER(BX74)),BX74=\"!error\",BZ74=\"!error\",CA74=\"!error\",CB74=\"!error\"),\"!error\",IF(BV74=\"NA\",\"NA\",IF(OR(AND(BW74<>0,ISNUMBER(CC74),CC74=0),AND(BW74=1,ISNUMBER(CB74),OR(CB74<5.5,CB74>=10.5)),AND(OR(BW74=2,BW74=4),ISNUMBER(CB74),OR(CB74<6,CB74>=9.5)),AND(BW74=3,ISNUMBER(CB74),OR(CB74<6,CB74>9))),0,IF(AND(ISNUMBER($BP$12),BW74<>0,ISNUMBER(BX74),ISNUMBER(BZ74),ISNUMBER(CA74),ISNUMBER(CB74)),Log_Virus(BW74,$BP$12,CA74,CB74,BX74,BZ74),IF(COUNTIF(BW74,\"<>0\")+COUNT(BX74,BY74,CA74,CB74)=5,\"!error\",\"missing\"))))))))","v":""},null,null,null,null,null,null,null,null,null,null,null,null,null,"data","data"]
[null," ",{"$f":"$F$15","v":4},null,null,null,null,{"$f":"IF(BL75=\"!error\",\"!error\",$BK75)","v":""},"","","","",null,null,null,null,"",null,null,null,null,null,null,null,null,null,null,null,null,null,null,null,null,null,null,null,null,null,null,null,null,null,null,null,null,null,null,null,null,null,1,{"$f":"IF($BG$14=0,0,IF(COUNTIF(OFFSET($BD72,0,0,MIN($BG$14,5),1),\"<>NA\")+IF($BG$14>5,COUNTIF(OFFSET($BV72,0,0,$BG$14-5,1),\"<>NA\"),0),1,0))","v":1},{"$f":"IF($BG$14=0,0,IF(COUNTIF(OFFSET($BD72,0,0,MIN($BG$14,5),1),\"O3\")+COUNTIF(OFFSET($BD72,0,0,MIN($BG$14,5),1),\"O3 Cell 1\")+IF($BG$14>5,COUNTIF(OFFSET($BV72,0,0,$BG$14-5,1),\"O3\"),0)+IF($BG$14>5,COUNTIF(OFFSET($BV72,0,0,$BG$14-5,1),\"O3 Cell 1\"),0),1,0))","v":0},{"$f":"IF(OR($AY75=0,AND(COUNTA(D75,F75:G75)=0,COUNTIF(E75,0))),\"NA\",IF(COUNTA(D75:G75),IF(BA75,4,5),IF($BG$15=1,IF(BA75,4,IF(AZ75,5,6)),IF(BD75=\"!error\",IF(BA75,4,5),IF(BA75,\"5B\",6)))))","v":6},{"$f":"$BG$11","v":4},{"$f":"IF(AND(IF($BN$4=\"missing\",10,$BN$4)>=4,$AY75<>\"\"),IF(OR($AY75=0,AND($B75=\"NA\",COUNTA($D75,$F75:$G75)=0,COUNTIF($E75,0)),AND($B75=\"NA\",COUNTA($D75:$G75)=0,IF($BG$14=0,0,COUNTIF(OFFSET($BD72,0,0,MIN($BG$14,5),1),\"NA\")+IF($BG$14>5,COUNTIF(OFFSET($BV72,0,0,$BG$14-5,1),\"NA\"),0))=$BG$14),AND($B75=\"NA\",COUNTA($D75:$G75)=0,IF($BG$14<5,COUNTA(OFFSET($D72,$BG$14,0,MIN(5-$BG$14,$BG$15),4))-COUNTIF(OFFSET($E72,$BG$14,0,MIN(5-$BG$14,$BG$15),1),0),0)+IF($BG$14+$BG$15>5,COUNTA(OFFSET($D77,MAX($BG$14-5,0),0,MIN($BG$14+$BG$15-5,$BG$15),4))-COUNTIF(OFFSET($E77,MAX($BG$14-5,0),0,MIN($BG$14+$BG$15-5,$BG$15),1),0),0)),AND($B75=\"NA\",COUNTA($D75:$G75)=0,IF($BG$14<5,COUNTIF(OFFSET($B72,$BG$14,0,MIN(5-$BG$14,$BG$15),1),\"NA\"),0)+IF($BG$14+$BG$15>5,COUNTIF(OFFSET($B77,MAX($BG$14-5,0),0,MIN($BG$14+$BG$15-5,$BG$15),1),\"NA\"),0)<>$BG$15)),\"NA\",IF($B75=\"\",\"missing\",IF(AND($B75<>\"NA\",COUNTA($D75,$F75:$G75)+COUNTIF($E75,\"<>0\")),UPPER($B75),\"!error\"))),\"\")","v":""},"","","",{"$f":"IF(BD75=\"\",\"\",IF(AY75=0,\"NA\",IF(OR($BG$12=\"!error\",$BG$13=\"!error\",BG75=\"!error\"),\"!error\",IF(BD75=\"NA\",\"NA\",IF(AND(ISNUMBER(BG75),BG75=0),0,IF(AND(ISNUMBER($BG$12),ISNUMBER($BG$13),ISNUMBER(BG75)),$BG$13*$BG$12/BG75,IF(BG75=\"ND\",\"ND\",\"missing\")))))))","v":""},"","","",{"$f":"IF(BD75=\"\",\"\",IF(AY75=0,\"NA\",IF(CW75=\"ND\",\"ND\",IF(OR($BN$12=\"!error\",BD75=\"!error\",AND(BD75=\"missing\",ISNUMBER(BF75)),IF(BE75=1,BF75=\"!error\",0),BI75=\"!error\",BJ75=\"!error\"),\"!error\",IF(OR(BD75=\"NA\",AND(ISNUMBER($BN$12),$BN$12=0),AND(BE75<>0,ISNUMBER(BK75),BK75=0),AND(BE75=1,ISNUMBER(BJ75),BJ75>9),AND(BE75=2,ISNUMBER(BJ75),OR(BJ75<6,BJ75>=9.5)),AND(OR(BE75=3,BE75=4),ISNUMBER(BJ75),OR(BJ75<5.5,BJ75>=9.5))),\"NA\",IF(AND(ISNUMBER($BN$12),BE75<>0,IF(BE75=1,ISNUMBER(BF75),1),ISNUMBER(BI75),ISNUMBER(BJ75)),CT_Giardia(BE75,$BN$12,BI75,BJ75,IF(BE75=1,BF75,)),IF(COUNTIF(BE75,\"<>0\")+COUNT(BF75,BG75,BI75,BJ75)=5,\"!error\",\"missing\")))))))","v":""},{"$f":"IF(BD75=\"\",\"\",IF(OR(AY75=0,AND(ISNUMBER($BN$12),$BN$12=0)),\"NA\",IF(CW75=\"ND\",\"ND\",IF(OR(BK75=\"!error\",BL75=\"!error\",BN75=\"!error\"),\"!error\",IF(BD75=\"NA\",\"NA\",IF(BL75=\"NA\",0,IF(AND(BE75<>99,ISNUMBER(BK75),ISNUMBER(BL75)),BK75/BL75,IF(AND(BE75=99,BN75=0.5),BN75/$BN$12,\"missing\"))))))))","v":""},{"$f":"IF(BD75=\"\",\"\",IF(AY75=0,\"NA\",IF(CW75=\"ND\",\"ND\",IF(OR(BD75=\"!error\",AND(BD75=\"missing\",ISNUMBER(BF75)),BF75=\"!error\",BH75=\"!error\",BI75=\"!error\",BJ75=\"!error\"),\"!error\",IF(BD75=\"NA\",\"NA\",IF(OR(AND(BE75<>0,ISNUMBER(BK75),BK75=0),AND(BE75=1,ISNUMBER(BJ75),BJ75>9),AND(BE75=2,ISNUMBER(BJ75),OR(BJ75<6,BJ75>=9.5)),AND(OR(BE75=3,BE75=4),ISNUMBER(BJ75),OR(BJ75<5.5,BJ75>=9.5))),0,IF(AND(ISNUMBER($BN$12),BE75<>0,ISNUMBER(BF75),ISNUMBER(BH75),ISNUMBER(BI75),ISNUMBER(BJ75)),log_Giardia(BE75,$BN$12,BI75,BJ75,BF75,BH75),IF(COUNTIF(BE75,\"<>0\")+COUNT(BF75,BG75,BI75,BJ75)=5,\"!error\",\"missing\"))))))))","v":""},{"$f":"IF(BD75=\"\",\"\",IF(AY75=0,\"NA\",IF(CW75=\"ND\",\"ND\",IF(OR($BP$12=\"!error\",BD75=\"!error\",AND(BD75=\"missing\",ISNUMBER(BF75)),BI75=\"!error\",BJ75=\"!error\"),\"!error\",IF(OR(BD75=\"NA\",AND(ISNUMBER($BP$12),$BP$12=0),AND(BE75<>0,ISNUMBER(BK75),BK75=0),AND(BE75=1,ISNUMBER(BJ75),BJ75>=10.5),AND(BE75=2,ISNUMBER(BJ75),OR(BJ75<6,BJ75>=9.5)),AND(BE75=3,ISNUMBER(BJ75),OR(BJ75<6,BJ75>9)),AND(BE75=4,ISNUMBER(BJ75),OR(BJ75<6,BJ75>10))),\"NA\",IF(AND(ISNUMBER($BP$12),BE75<>0,ISNUMBER(BI75),ISNUMBER(BJ75)),CT_Virus(BE75,$BP$12,BI75,BJ75),IF(COUNTIF(BE75,\"<>0\")+COUNT(BF75,BG75,BI75,BJ75)=5,\"!error\",\"missing\")))))))","v":""},{"$f":"IF(BD75=\"\",\"\",IF(OR(AY75=0,AND(ISNUMBER($BP$12),$BP$12=0)),\"NA\",IF(CW75=\"ND\",\"ND\",IF(OR(BK75=\"!error\",BO75=\"!error\",BQ75=\"!error\"),\"!error\",IF(BD75=\"NA\",\"NA\",IF(BO75=\"NA\",0,IF(AND(BE75<>99,ISNUMBER(BK75),ISNUMBER(BO75)),BK75/BO75,IF(AND(BE75=99,BQ75=1),BQ75/$BP$12,\"missing\"))))))))","v":""},{"$f":"IF(BD75=\"\",\"\",IF(AY75=0,\"NA\",IF(CW75=\"ND\",\"ND\",IF(OR(BD75=\"!error\",AND(BD75=\"missing\",ISNUMBER(BF75)),BF75=\"!error\",BH75=\"!error\",BI75=\"!error\",BJ75=\"!error\"),\"!error\",IF(BD75=\"NA\",\"NA\",IF(OR(AND(BE75<>0,ISNUMBER(BK75),BK75=0),AND(BE75=1,ISNUMBER(BJ75),BJ75>=10.5),AND(BE75=2,ISNUMBER(BJ75),OR(BJ75<6,BJ75>=9.5)),AND(BE75=3,ISNUMBER(BJ75),OR(BJ75<6,BJ75>9)),AND(BE75=4,ISNUMBER(BJ75),OR(BJ75<6,BJ75>10))),0,IF(AND(ISNUMBER($BP$12),BE75<>0,ISNUMBER(BF75),ISNUMBER(BH75),ISNUMBER(BI75),ISNUMBER(BJ75)),Log_Virus(BE75,$BP$12,BI75,BJ75,BF75,BH75),IF(COUNTIF(BE75,\"<>0\")+COUNT(BF75,BG75,BI75,BJ75)=5,\"!error\",\"missing\"))))))))","v":""},{"$f":"IF($BL$14=0,0,IF(COUNTIF(OFFSET($BD72,0,0,MIN($BL$14,5),1),\"<>NA\")+IF($BL$14>5,COUNTIF(OFFSET($BV72,0,0,$BL$14-5,1),\"<>NA\"),0),1,0))","v":1},{"$f":"IF($BL$14=0,0,IF(COUNTIF(OFFSET($BD72,0,0,MIN($BL$14,5),1),\"O3\")+COUNTIF(OFFSET($BD72,0,0,MIN($BL$14,5),1),\"O3 Cell 1\")+IF($BL$14>5,COUNTIF(OFFSET($BV72,0,0,$BL$14-5,1),\"O3\"),0)+IF($BL$14>5,COUNTIF(OFFSET($BV72,0,0,$BL$14-5,1),\"O3 Cell 1\"),0),1,0))","v":0},{"$f":"IF(OR($AY75=0,AND(COUNTA(D80,F80:G80)=0,COUNTIF(E80,0))),\"NA\",IF(COUNTA(D80:G80),IF(BS75,4,5),IF($BL$15=1,IF(BS75,4,IF(BR75,5,6)),IF(BV75=\"!error\",IF(BS75,4,5),IF(BS75,\"5B\",6)))))","v":6},{"$f":"$BL$11","v":9},{"$f":"IF(AND(IF($BN$4=\"missing\",10,$BN$4)>=9,$AY75<>\"\"),IF(OR($AY75=0,AND($B80=\"NA\",COUNTA($D80,$F80:$G80)=0,COUNTIF($E80,0)),AND($B80=\"NA\",COUNTA($D80:$G80)=0,IF($BL$14=0,0,COUNTIF(OFFSET($BD72,0,0,MIN($BL$14,5),1),\"NA\")+IF($BL$14>5,COUNTIF(OFFSET($BV72,0,0,$BL$14-5,1),\"NA\"),0))=$BL$14),AND($B80=\"NA\",COUNTA($D80:$G80)=0,IF($BL$14<5,COUNTA(OFFSET($D72,$BL$14,0,MIN(5-$BL$14,$BL$15),4))-COUNTIF(OFFSET($E72,$BL$14,0,MIN(5-$BL$14,$BL$15),1),0),0)+IF($BL$14+$BL$15>5,COUNTA(OFFSET($D77,MAX($BL$14-5,0),0,MIN($BL$14+$BL$15-5,$BL$15),4))-COUNTIF(OFFSET($E77,MAX($BL$14-5,0),0,MIN($BL$14+$BL$15-5,$BL$15),1),0),0)),AND($B80=\"NA\",COUNTA($D80:$G80)=0,IF($BL$14<5,COUNTIF(OFFSET($B72,$BL$14,0,MIN(5-$BL$14,$BL$15),1),\"NA\"),0)+IF($BL$14+$BL$15>5,COUNTIF(OFFSET($B77,MAX($BL$14-5,0),0,MIN($BL$14+$BL$15-5,$BL$15),1),\"NA\"),0)<>$BL$15)),\"NA\",IF($B80=\"\",\"missing\",IF(AND($B80<>\"NA\",COUNTA($D80,$F80:$G80)+COUNTIF($E80,\"<>0\")),UPPER($B80),\"!error\"))),\"\")","v":""},"",{"$f":"IF(BV75=\"\",\"\",IF(BV75=\"NA\",\"NA\",IF(ISBLANK($D80),\"missing\",IF(AND(BW75=1,ISNUMBER($D80),$D80>4),4,IF(AND(ISNUMBER($D80),$D80>=0),$D80,IF(AND(ISTEXT($D80),$D80=\"ND\"),\"ND\",\"!error\"))))))","v":""},{"$f":"IF(BV75=\"\",\"\",IF(BV75=\"NA\",\"NA\",IF(ISBLANK($E80),\"missing\",IF(OR(AND(ISBLANK($B80),COUNT(BX75,CA75:CB75)=0,ISNUMBER($E80),$E80=0),AND(ISNUMBER($E80),$E80>0),AND(ISTEXT($E80),$E80=\"ND\")),$E80,\"!error\"))))","v":""},{"$f":"IF(BV75=\"\",\"\",IF(AY75=0,\"NA\",IF(OR($BL$12=\"!error\",$BL$13=\"!error\",BY75=\"!error\"),\"!error\",IF(BV75=\"NA\",\"NA\",IF(AND(ISNUMBER(BY75),BY75=0),0,IF(AND(ISNUMBER($BL$12),ISNUMBER($BL$13),ISNUMBER(BY75)),$BL$13*$BL$12/BY75,IF(BY75=\"ND\",\"ND\",\"missing\")))))))","v":""},{"$f":"IF(BV75=\"\",\"\",IF(BV75=\"NA\",\"NA\",IF(ISBLANK($F80),\"missing\",IF(OR(ISNUMBER($F80),$F80=\"ND\"),$F80,\"!error\"))))","v":""},{"$f":"IF(BV75=\"\",\"\",IF(BV75=\"NA\",\"NA\",IF(ISBLANK($G80),\"missing\",IF(OR(AND(ISNUMBER($G80),$G80>=0,$G80<=14),$G80=\"ND\"),$G80,\"!error\"))))","v":""},"",{"$f":"IF(BV75=\"\",\"\",IF(AY75=0,\"NA\",IF(CX75=\"ND\",\"ND\",IF(OR($BN$12=\"!error\",BV75=\"!error\",AND(BV75=\"missing\",ISNUMBER(BX75)),IF(BW75=1,BX75=\"!error\",0),CA75=\"!error\",CB75=\"!error\"),\"!error\",IF(OR(BV75=\"NA\",AND(ISNUMBER($BN$12),$BN$12=0),AND(BW75<>0,ISNUMBER(CC75),CC75=0),AND(BW75=1,ISNUMBER(CB75),CB75>9),AND(BW75>1,ISNUMBER(CB75),OR(CB75<6,CB75>=9.5))),\"NA\",IF(AND(ISNUMBER($BN$12),BW75<>0,IF(BW75=1,ISNUMBER(BX75),1),ISNUMBER(CA75),ISNUMBER(CB75)),CT_Giardia(BW75,$BN$12,CA75,CB75,IF(BW75=1,BX75,)),IF(COUNTIF(BW75,\"<>0\")+COUNT(BX75,BY75,CA75,CB75)=5,\"!error\",\"missing\")))))))","v":""},{"$f":"IF(BV75=\"\",\"\",IF(OR(AY75=0,AND(ISNUMBER($BN$12),$BN$12=0)),\"NA\",IF(CX75=\"ND\",\"ND\",IF(OR(CC75=\"!error\",CD75=\"!error\",CF75=\"!error\"),\"!error\",IF(BV75=\"NA\",\"NA\",IF(CD75=\"NA\",0,IF(AND(ISNUMBER(CC75),ISNUMBER(CD75)),CC75/CD75,IF(AND(BW75=99,CF75=0.5),CF75/$BN$12,\"missing\"))))))))","v":""},{"$f":"IF(BV75=\"\",\"\",IF(AY75=0,\"NA\",IF(CX75=\"ND\",\"ND\",IF(OR(BV75=\"!error\",AND(BV75=\"missing\",ISNUMBER(BX75)),BX75=\"!error\",BZ75=\"!error\",CA75=\"!error\",CB75=\"!error\"),\"!error\",IF(BV75=\"NA\",\"NA\",IF(OR(AND(BW75<>0,ISNUMBER(CC75),CC75=0),AND(BW75=1,ISNUMBER(CB75),CB75>9),AND(BW75>1,ISNUMBER(CB75),OR(CB75<6,CB75>=9.5))),0,IF(AND(ISNUMBER($BN$12),BW75<>0,ISNUMBER(BX75),ISNUMBER(BZ75),ISNUMBER(CA75),ISNUMBER(CB75)),log_Giardia(BW75,$BN$12,CA75,CB75,BX75,BZ75),IF(COUNTIF(BW75,\"<>0\")+COUNT(BX75,BY75,CA75,CB75)=5,\"!error\",\"missing\"))))))))","v":""},{"$f":"IF(BV75=\"\",\"\",IF(AY75=0,\"NA\",IF(CX75=\"ND\",\"ND\",IF(OR($BP$12=\"!error\",BV75=\"!error\",AND(BV75=\"missing\",ISNUMBER(BX75)),CA75=\"!error\",CB75=\"!error\"),\"!error\",IF(OR(BV75=\"NA\",AND(ISNUMBER($BP$12),$BP$12=0),AND(BW75<>0,ISNUMBER(CC75),CC75=0),AND(BW75=1,ISNUMBER(CB75),OR(CB75<5.5,CB75>=10.5)),AND(OR(BW75=2,BW75=4),ISNUMBER(CB75),OR(CB75<6,CB75>=9.5)),AND(BW75=3,ISNUMBER(CB75),OR(CB75<6,CB75>9))),\"NA\",IF(AND(ISNUMBER($BP$12),BW75<>0,ISNUMBER(CA75),ISNUMBER(CB75)),CT_Virus(BW75,$BP$12,CA75,CB75),IF(COUNTIF(BW75,\"<>0\")+COUNT(BX75,BY75,CA75,CB75)=5,\"!error\",\"missing\")))))))","v":""},{"$f":"IF(BV75=\"\",\"\",IF(OR(AY75=0,AND(ISNUMBER($BP$12),$BP$12=0)),\"NA\",IF(CX75=\"ND\",\"ND\",IF(OR(CC75=\"!error\",CG75=\"!error\",CI75=\"!error\"),\"!error\",IF(BV75=\"NA\",\"NA\",IF(CG75=\"NA\",0,IF(AND(ISNUMBER(CC75),ISNUMBER(CG75)),CC75/CG75,IF(AND(BW75=99,CI75=1),CI75/$BP$12,\"missing\"))))))))","v":""},{"$f":"IF(BV75=\"\",\"\",IF(AY75=0,\"NA\",IF(CX75=\"ND\",\"ND\",IF(OR(BV75=\"!error\",AND(BV75=\"missing\",ISNUMBER(BX75)),BX75=\"!error\",BZ75=\"!error\",CA75=\"!error\",CB75=\"!error\"),\"!error\",IF(BV75=\"NA\",\"NA\",IF(OR(AND(BW75<>0,ISNUMBER(CC75),CC75=0),AND(BW75=1,ISNUMBER(CB75),OR(CB75<5.5,CB75>=10.5)),AND(OR(BW75=2,BW75=4),ISNUMBER(CB75),OR(CB75<6,CB75>=9.5)),AND(BW75=3,ISNUMBER(CB75),OR(CB75<6,CB75>9))),0,IF(AND(ISNUMBER($BP$12),BW75<>0,ISNUMBER(BX75),ISNUMBER(BZ75),ISNUMBER(CA75),ISNUMBER(CB75)),Log_Virus(BW75,$BP$12,CA75,CB75,BX75,BZ75),IF(COUNTIF(BW75,\"<>0\")+COUNT(BX75,BY75,CA75,CB75)=5,\"!error\",\"missing\"))))))))","v":""},null,null,null,null,null,null,null,null,null,null,null,null,null,"data","data"]
[null," ",{"$f":"$G$15","v":5},null,null,null,null,"","","","","",null,null,null,null,"",null,null,null,null,null,null,null,null,null,null,null,null,null,null,null,null,null,null,null,null,null,null,null,null,null,null,null,null,null,null,null,null,null,1,{"$f":"IF($BH$14=0,0,IF(COUNTIF(OFFSET($BD72,0,0,MIN($BH$14,5),1),\"<>NA\")+IF($BH$14>5,COUNTIF(OFFSET($BV72,0,0,$BH$14-5,1),\"<>NA\"),0),1,0))","v":1},{"$f":"IF($BH$14=0,0,IF(COUNTIF(OFFSET($BD72,0,0,MIN($BH$14,5),1),\"O3\")+COUNTIF(OFFSET($BD72,0,0,MIN($BH$14,5),1),\"O3 Cell 1\")+IF($BH$14>5,COUNTIF(OFFSET($BV72,0,0,$BH$14-5,1),\"O3\"),0)+IF($BH$14>5,COUNTIF(OFFSET($BV72,0,0,$BH$14-5,1),\"O3 Cell 1\"),0),1,0))","v":0},{"$f":"IF(OR($AY76=0,AND(COUNTA(D76,F76:G76)=0,COUNTIF(E76,0))),\"NA\",IF(COUNTA(D76:G76),IF(BA76,4,5),IF($BH$15=1,IF(BA76,4,IF(AZ76,5,6)),IF(BD76=\"!error\",IF(BA76,4,5),IF(BA76,\"5B\",6)))))","v":6},{"$f":"$BH$11","v":5},{"$f":"IF(AND(IF($BN$4=\"missing\",10,$BN$4)>=5,$AY76<>\"\"),IF(OR($AY76=0,AND($B76=\"NA\",COUNTA($D76,$F76:$G76)=0,COUNTIF($E76,0)),AND($B76=\"NA\",COUNTA($D76:$G76)=0,IF($BH$14=0,0,COUNTIF(OFFSET($BD72,0,0,MIN($BH$14,5),1),\"NA\")+IF($BH$14>5,COUNTIF(OFFSET($BV72,0,0,$BH$14-5,1),\"NA\"),0))=$BH$14),AND($B76=\"NA\",COUNTA($D76:$G76)=0,IF($BH$14<5,COUNTA(OFFSET($D72,$BH$14,0,MIN(5-$BH$14,$BH$15),4))-COUNTIF(OFFSET($E72,$BH$14,0,MIN(5-$BH$14,$BH$15),1),0),0)+IF($BH$14+$BH$15>5,COUNTA(OFFSET($D77,MAX($BH$14-5,0),0,MIN($BH$14+$BH$15-5,$BH$15),4))-COUNTIF(OFFSET($E77,MAX($BH$14-5,0),0,MIN($BH$14+$BH$15-5,$BH$15),1),0),0)),AND($B76=\"NA\",COUNTA($D76:$G76)=0,IF($BH$14<5,COUNTIF(OFFSET($B72,$BH$14,0,MIN(5-$BH$14,$BH$15),1),\"NA\"),0)+IF($BH$14+$BH$15>5,COUNTIF(OFFSET($B77,MAX($BH$14-5,0),0,MIN($BH$14+$BH$15-5,$BH$15),1),\"NA\"),0)<>$BH$15)),\"NA\",IF($B76=\"\",\"missing\",IF(AND($B76<>\"NA\",COUNTA($D76,$F76:$G76)+COUNTIF($E76,\"<>0\")),UPPER($B76),\"!error\"))),\"\")","v":""},"","","",{"$f":"IF(BD76=\"\",\"\",IF(AY76=0,\"NA\",IF(OR($BH$12=\"!error\",$BH$13=\"!error\",BG76=\"!error\"),\"!error\",IF(BD76=\"NA\",\"NA\",IF(AND(ISNUMBER(BG76),BG76=0),0,IF(AND(ISNUMBER($BH$12),ISNUMBER($BH$13),ISNUMBER(BG76)),$BH$13*$BH$12/BG76,IF(BG76=\"ND\",\"ND\",\"missing\")))))))","v":""},"","","",{"$f":"IF(BD76=\"\",\"\",IF(AY76=0,\"NA\",IF(CW76=\"ND\",\"ND\",IF(OR($BN$12=\"!error\",BD76=\"!error\",AND(BD76=\"missing\",ISNUMBER(BF76)),IF(BE76=1,BF76=\"!error\",0),BI76=\"!error\",BJ76=\"!error\"),\"!error\",IF(OR(BD76=\"NA\",AND(ISNUMBER($BN$12),$BN$12=0),AND(BE76<>0,ISNUMBER(BK76),BK76=0),AND(BE76=1,ISNUMBER(BJ76),BJ76>9),AND(BE76=2,ISNUMBER(BJ76),OR(BJ76<6,BJ76>=9.5)),AND(OR(BE76=3,BE76=4),ISNUMBER(BJ76),OR(BJ76<5.5,BJ76>=9.5))),\"NA\",IF(AND(ISNUMBER($BN$12),BE76<>0,IF(BE76=1,ISNUMBER(BF76),1),ISNUMBER(BI76),ISNUMBER(BJ76)),CT_Giardia(BE76,$BN$12,BI76,BJ76,IF(BE76=1,BF76,)),IF(COUNTIF(BE76,\"<>0\")+COUNT(BF76,BG76,BI76,BJ76)=5,\"!error\",\"missing\")))))))","v":""},{"$f":"IF(BD76=\"\",\"\",IF(OR(AY76=0,AND(ISNUMBER($BN$12),$BN$12=0)),\"NA\",IF(CW76=\"ND\",\"ND\",IF(OR(BK76=\"!error\",BL76=\"!error\",BN76=\"!error\"),\"!error\",IF(BD76=\"NA\",\"NA\",IF(BL76=\"NA\",0,IF(AND(BE76<>99,ISNUMBER(BK76),ISNUMBER(BL76)),BK76/BL76,IF(AND(BE76=99,BN76=0.5),BN76/$BN$12,\"missing\"))))))))","v":""},{"$f":"IF(BD76=\"\",\"\",IF(AY76=0,\"NA\",IF(CW76=\"ND\",\"ND\",IF(OR(BD76=\"!error\",AND(BD76=\"missing\",ISNUMBER(BF76)),BF76=\"!error\",BH76=\"!error\",BI76=\"!error\",BJ76=\"!error\"),\"!error\",IF(BD76=\"NA\",\"NA\",IF(OR(AND(BE76<>0,ISNUMBER(BK76),BK76=0),AND(BE76=1,ISNUMBER(BJ76),BJ76>9),AND(BE76=2,ISNUMBER(BJ76),OR(BJ76<6,BJ76>=9.5)),AND(OR(BE76=3,BE76=4),ISNUMBER(BJ76),OR(BJ76<5.5,BJ76>=9.5))),0,IF(AND(ISNUMBER($BN$12),BE76<>0,ISNUMBER(BF76),ISNUMBER(BH76),ISNUMBER(BI76),ISNUMBER(BJ76)),log_Giardia(BE76,$BN$12,BI76,BJ76,BF76,BH76),IF(COUNTIF(BE76,\"<>0\")+COUNT(BF76,BG76,BI76,BJ76)=5,\"!error\",\"missing\"))))))))","v":""},{"$f":"IF(BD76=\"\",\"\",IF(AY76=0,\"NA\",IF(CW76=\"ND\",\"ND\",IF(OR($BP$12=\"!error\",BD76=\"!error\",AND(BD76=\"missing\",ISNUMBER(BF76)),BI76=\"!error\",BJ76=\"!error\"),\"!error\",IF(OR(BD76=\"NA\",AND(ISNUMBER($BP$12),$BP$12=0),AND(BE76<>0,ISNUMBER(BK76),BK76=0),AND(BE76=1,ISNUMBER(BJ76),BJ76>=10.5),AND(BE76=2,ISNUMBER(BJ76),OR(BJ76<6,BJ76>=9.5)),AND(BE76=3,ISNUMBER(BJ76),OR(BJ76<6,BJ76>9)),AND(BE76=4,ISNUMBER(BJ76),OR(BJ76<6,BJ76>10))),\"NA\",IF(AND(ISNUMBER($BP$12),BE76<>0,ISNUMBER(BI76),ISNUMBER(BJ76)),CT_Virus(BE76,$BP$12,BI76,BJ76),IF(COUNTIF(BE76,\"<>0\")+COUNT(BF76,BG76,BI76,BJ76)=5,\"!error\",\"missing\")))))))","v":""},{"$f":"IF(BD76=\"\",\"\",IF(OR(AY76=0,AND(ISNUMBER($BP$12),$BP$12=0)),\"NA\",IF(CW76=\"ND\",\"ND\",IF(OR(BK76=\"!error\",BO76=\"!error\",BQ76=\"!error\"),\"!error\",IF(BD76=\"NA\",\"NA\",IF(BO76=\"NA\",0,IF(AND(BE76<>99,ISNUMBER(BK76),ISNUMBER(BO76)),BK76/BO76,IF(AND(BE76=99,BQ76=1),BQ76/$BP$12,\"missing\"))))))))","v":""},{"$f":"IF(BD76=\"\",\"\",IF(AY76=0,\"NA\",IF(CW76=\"ND\",\"ND\",IF(OR(BD76=\"!error\",AND(BD76=\"missing\",ISNUMBER(BF76)),BF76=\"!error\",BH76=\"!error\",BI76=\"!error\",BJ76=\"!error\"),\"!error\",IF(BD76=\"NA\",\"NA\",IF(OR(AND(BE76<>0,ISNUMBER(BK76),BK76=0),AND(BE76=1,ISNUMBER(BJ76),BJ76>=10.5),AND(BE76=2,ISNUMBER(BJ76),OR(BJ76<6,BJ76>=9.5)),AND(BE76=3,ISNUMBER(BJ76),OR(BJ76<6,BJ76>9)),AND(BE76=4,ISNUMBER(BJ76),OR(BJ76<6,BJ76>10))),0,IF(AND(ISNUMBER($BP$12),BE76<>0,ISNUMBER(BF76),ISNUMBER(BH76),ISNUMBER(BI76),ISNUMBER(BJ76)),Log_Virus(BE76,$BP$12,BI76,BJ76,BF76,BH76),IF(COUNTIF(BE76,\"<>0\")+COUNT(BF76,BG76,BI76,BJ76)=5,\"!error\",\"missing\"))))))))","v":""},{"$f":"IF($BM$14=0,0,IF(COUNTIF(OFFSET($BD72,0,0,MIN($BM$14,5),1),\"<>NA\")+IF($BM$14>5,COUNTIF(OFFSET($BV72,0,0,$BM$14-5,1),\"<>NA\"),0),1,0))","v":1},{"$f":"IF($BK$14=0,0,IF(COUNTIF(OFFSET($BD72,0,0,MIN($BK$14,5),1),\"O3\")+COUNTIF(OFFSET($BD72,0,0,MIN($BK$14,5),1),\"O3 Cell 1\")+IF($BK$14>5,COUNTIF(OFFSET($BV72,0,0,$BK$14-5,1),\"O3\"),0)+IF($BK$14>5,COUNTIF(OFFSET($BV72,0,0,$BK$14-5,1),\"O3 Cell 1\"),0),1,0))","v":0},{"$f":"IF(OR($AY76=0,AND(COUNTA(D81,F81:G81)=0,COUNTIF(E81,0))),\"NA\",IF(COUNTA(D81:G81),IF(BS76,4,5),IF($BM$15=1,IF(BS76,4,IF(BR76,5,6)),IF(BV76=\"!error\",IF(BS76,4,5),IF(BS76,\"5B\",6)))))","v":6},{"$f":"$BM$11","v":10},{"$f":"IF(AND(IF($BN$4=\"missing\",10,$BN$4)>=10,$AY76<>\"\"),IF(OR($AY76=0,AND($B81=\"NA\",COUNTA($D81,$F81:$G81)=0,COUNTIF($E81,0)),AND($B81=\"NA\",COUNTA($D81:$G81)=0,IF($BM$14=0,0,COUNTIF(OFFSET($BD72,0,0,MIN($BM$14,5),1),\"NA\")+IF($BM$14>5,COUNTIF(OFFSET($BV72,0,0,$BM$14-5,1),\"NA\"),0))=$BM$14),AND($B81=\"NA\",COUNTA($D81:$G81)=0,IF($BM$14<5,COUNTA(OFFSET($D72,$BM$14,0,MIN(5-$BM$14,$BM$15),4))-COUNTIF(OFFSET($E72,$BM$14,0,MIN(5-$BM$14,$BM$15),1),0),0)+IF($BM$14+$BM$15>5,COUNTA(OFFSET($D77,MAX($BM$14-5,0),0,MIN($BM$14+$BM$15-5,$BM$15),4))-COUNTIF(OFFSET($E77,MAX($BM$14-5,0),0,MIN($BM$14+$BM$15-5,$BM$15),1),0),0)),AND($B81=\"NA\",COUNTA($D81:$G81)=0,IF($BM$14<5,COUNTIF(OFFSET($B72,$BM$14,0,MIN(5-$BM$14,$BM$15),1),\"NA\"),0)+IF($BM$14+$BM$15>5,COUNTIF(OFFSET($B77,MAX($BM$14-5,0),0,MIN($BM$14+$BM$15-5,$BM$15),1),\"NA\"),0)<>$BM$15)),\"NA\",IF($B81=\"\",\"missing\",IF(AND($B81<>\"NA\",COUNTA($D81,$F81:$G81)+COUNTIF($E81,\"<>0\")),UPPER($B81),\"!error\"))),\"\")","v":""},"",{"$f":"IF(BV76=\"\",\"\",IF(BV76=\"NA\",\"NA\",IF(ISBLANK($D81),\"missing\",IF(AND(BW76=1,ISNUMBER($D81),$D81>4),4,IF(AND(ISNUMBER($D81),$D81>=0),$D81,IF(AND(ISTEXT($D81),$D81=\"ND\"),\"ND\",\"!error\"))))))","v":""},{"$f":"IF(BV76=\"\",\"\",IF(BV76=\"NA\",\"NA\",IF(ISBLANK($E81),\"missing\",IF(OR(AND(ISBLANK($B81),COUNT(BX76,CA76:CB76)=0,ISNUMBER($E81),$E81=0),AND(ISNUMBER($E81),$E81>0),AND(ISTEXT($E81),$E81=\"ND\")),$E81,\"!error\"))))","v":""},{"$f":"IF(BV76=\"\",\"\",IF(AY76=0,\"NA\",IF(OR($BM$12=\"!error\",$BM$13=\"!error\",BY76=\"!error\"),\"!error\",IF(BV76=\"NA\",\"NA\",IF(AND(ISNUMBER(BY76),BY76=0),0,IF(AND(ISNUMBER($BM$12),ISNUMBER($BM$13),ISNUMBER(BY76)),$BM$13*$BM$12/BY76,IF(BY76=\"ND\",\"ND\",\"missing\")))))))","v":""},{"$f":"IF(BV76=\"\",\"\",IF(BV76=\"NA\",\"NA\",IF(ISBLANK($F81),\"missing\",IF(OR(ISNUMBER($F81),$F81=\"ND\"),$F81,\"!error\"))))","v":""},{"$f":"IF(BV76=\"\",\"\",IF(BV76=\"NA\",\"NA\",IF(ISBLANK($G81),\"missing\",IF(OR(AND(ISNUMBER($G81),$G81>=0,$G81<=14),$G81=\"ND\"),$G81,\"!error\"))))","v":""},"",{"$f":"IF(BV76=\"\",\"\",IF(AY76=0,\"NA\",IF(CX76=\"ND\",\"ND\",IF(OR($BN$12=\"!error\",BV76=\"!error\",AND(BV76=\"missing\",ISNUMBER(BX76)),IF(BW76=1,BX76=\"!error\",0),CA76=\"!error\",CB76=\"!error\"),\"!error\",IF(OR(BV76=\"NA\",AND(ISNUMBER($BN$12),$BN$12=0),AND(BW76<>0,ISNUMBER(CC76),CC76=0),AND(BW76=1,ISNUMBER(CB76),CB76>9),AND(BW76>1,ISNUMBER(CB76),OR(CB76<6,CB76>=9.5))),\"NA\",IF(AND(ISNUMBER($BN$12),BW76<>0,IF(BW76=1,ISNUMBER(BX76),1),ISNUMBER(CA76),ISNUMBER(CB76)),CT_Giardia(BW76,$BN$12,CA76,CB76,IF(BW76=1,BX76,)),IF(COUNTIF(BW76,\"<>0\")+COUNT(BX76,BY76,CA76,CB76)=5,\"!error\",\"missing\")))))))","v":""},{"$f":"IF(BV76=\"\",\"\",IF(OR(AY76=0,AND(ISNUMBER($BN$12),$BN$12=0)),\"NA\",IF(CX76=\"ND\",\"ND\",IF(OR(CC76=\"!error\",CD76=\"!error\",CF76=\"!error\"),\"!error\",IF(BV76=\"NA\",\"NA\",IF(CD76=\"NA\",0,IF(AND(ISNUMBER(CC76),ISNUMBER(CD76)),CC76/CD76,IF(AND(BW76=99,CF76=0.5),CF76/$BN$12,\"missing\"))))))))","v":""},{"$f":"IF(BV76=\"\",\"\",IF(AY76=0,\"NA\",IF(CX76=\"ND\",\"ND\",IF(OR(BV76=\"!error\",AND(BV76=\"missing\",ISNUMBER(BX76)),BX76=\"!error\",BZ76=\"!error\",CA76=\"!error\",CB76=\"!error\"),\"!error\",IF(BV76=\"NA\",\"NA\",IF(OR(AND(BW76<>0,ISNUMBER(CC76),CC76=0),AND(BW76=1,ISNUMBER(CB76),CB76>9),AND(BW76>1,ISNUMBER(CB76),OR(CB76<6,CB76>=9.5))),0,IF(AND(ISNUMBER($BN$12),BW76<>0,ISNUMBER(BX76),ISNUMBER(BZ76),ISNUMBER(CA76),ISNUMBER(CB76)),log_Giardia(BW76,$BN$12,CA76,CB76,BX76,BZ76),IF(COUNTIF(BW76,\"<>0\")+COUNT(BX76,BY76,CA76,CB76)=5,\"!error\",\"missing\"))))))))","v":""},{"$f":"IF(BV76=\"\",\"\",IF(AY76=0,\"NA\",IF(CX76=\"ND\",\"ND\",IF(OR($BP$12=\"!error\",BV76=\"!error\",AND(BV76=\"missing\",ISNUMBER(BX76)),CA76=\"!error\",CB76=\"!error\"),\"!error\",IF(OR(BV76=\"NA\",AND(ISNUMBER($BP$12),$BP$12=0),AND(BW76<>0,ISNUMBER(CC76),CC76=0),AND(BW76=1,ISNUMBER(CB76),OR(CB76<5.5,CB76>=10.5)),AND(OR(BW76=2,BW76=4),ISNUMBER(CB76),OR(CB76<6,CB76>=9.5)),AND(BW76=3,ISNUMBER(CB76),OR(CB76<6,CB76>9))),\"NA\",IF(AND(ISNUMBER($BP$12),BW76<>0,ISNUMBER(CA76),ISNUMBER(CB76)),CT_Virus(BW76,$BP$12,CA76,CB76),IF(COUNTIF(BW76,\"<>0\")+COUNT(BX76,BY76,CA76,CB76)=5,\"!error\",\"missing\")))))))","v":""},{"$f":"IF(BV76=\"\",\"\",IF(OR(AY76=0,AND(ISNUMBER($BP$12),$BP$12=0)),\"NA\",IF(CX76=\"ND\",\"ND\",IF(OR(CC76=\"!error\",CG76=\"!error\",CI76=\"!error\"),\"!error\",IF(BV76=\"NA\",\"NA\",IF(CG76=\"NA\",0,IF(AND(ISNUMBER(CC76),ISNUMBER(CG76)),CC76/CG76,IF(AND(BW76=99,CI76=1),CI76/$BP$12,\"missing\"))))))))","v":""},{"$f":"IF(BV76=\"\",\"\",IF(AY76=0,\"NA\",IF(CX76=\"ND\",\"ND\",IF(OR(BV76=\"!error\",AND(BV76=\"missing\",ISNUMBER(BX76)),BX76=\"!error\",BZ76=\"!error\",CA76=\"!error\",CB76=\"!error\"),\"!error\",IF(BV76=\"NA\",\"NA\",IF(OR(AND(BW76<>0,ISNUMBER(CC76),CC76=0),AND(BW76=1,ISNUMBER(CB76),OR(CB76<5.5,CB76>=10.5)),AND(OR(BW76=2,BW76=4),ISNUMBER(CB76),OR(CB76<6,CB76>=9.5)),AND(BW76=3,ISNUMBER(CB76),OR(CB76<6,CB76>9))),0,IF(AND(ISNUMBER($BP$12),BW76<>0,ISNUMBER(BX76),ISNUMBER(BZ76),ISNUMBER(CA76),ISNUMBER(CB76)),Log_Virus(BW76,$BP$12,CA76,CB76,BX76,BZ76),IF(COUNTIF(BW76,\"<>0\")+COUNT(BX76,BY76,CA76,CB76)=5,\"!error\",\"missing\"))))))))","v":""},null,null,null,null,null,null,null,null,null,null,null,null,null,{"$f":"IF(OR(BF76=\"ND\",BG76=\"ND\",BI76=\"ND\",BJ76=\"ND\"),\"ND\",\"data\")","v":"data"},{"$f":"IF(OR(BX76=\"ND\",BY76=\"ND\",CA76=\"ND\",CB76=\"ND\"),\"ND\",\"data\")","v":"data"}]
[null," ",{"$f":"$H$15","v":6},null,null,null,null,{"$f":"IF($CD72=\"!error\",\"!error\",$CC72)","v":""},{"$f":"$CD72","v":""},{"$f":"$CG72","v":""},{"$f":"$CF72","v":""},{"$f":"$CI72","v":""},null,null,null,null,{"$f":"IF(AND(BW72=1,D77>4,D77<>\"ND\"),\"Note: The inactivation credit in zone D\" & C77 & \" was restricted due to elevated free chlorine levels.\",\"\")","v":""},null,null,null,null,null,null,null,null,null,null,null,null,null,null,null,null,null,null,null,null,null,null,null,null,null,null,null,null,null,null,null,null,null,null,null,null,null,null,null,null,null,null,null,null,null,null,null,null,null,null,null,null,null,null,null,null,null,null,null,null,null,null,null,null,null,null,null,null,null,null,null," Not representative of total log inactivation for all disinfection zones."]
[null," ",{"$f":"$I$15","v":7},null,null,null,null,{"$f":"IF($CD73=\"!error\",\"!error\",$CC73)","v":""},{"$f":"$CD73","v":""},{"$f":"$CG73","v":""},{"$f":"$CF73","v":""},{"$f":"$CI73","v":""},null,null,null,null,{"$f":"IF(AND(BW73=1,D78>4,D78<>\"ND\"),\"Note: The inactivation credit in zone D\" & C78 & \" was restricted due to elevated free chlorine levels.\",\"\")","v":""},null,null,null,null,null,null,null,null,null,null,null,null,null,null,null,null,null,null,null,null,null,null,null,null,null,null,null,null,null,null,null,null,null,null,null,null,null,null,null,null,null,null,null,null,null,null,null,null,null,null,null,null,null,null,null,null,null,null,null,null,null,null,null,null,null,null,null,null,null,null,null,null,null,{"$f":"CL72=\"\"","v":true},null,null,null,{"$f":"CP72=\"\"","v":true}]
[null," ",{"$f":"$J$15","v":8},null,null,null,null,"",{"$f":"$CD74","v":""},{"$f":"$CG74","v":""},{"$f":"$CF74","v":""},{"$f":"$CI74","v":""},null,null,null,null,""]
[null," ",{"$f":"$K$15","v":9},null,null,null,null,"",{"$f":"$CD75","v":""},{"$f":"$CG75","v":""},{"$f":"$CF75","v":""},{"$f":"$CI75","v":""},null,null,null,null,""]
[null," ",{"$f":"$L$15","v":10},null,null,null,null,{"$f":"IF($CC76=\"!error\",\"!error\",$CC76)","v":""},{"$f":"$CD76","v":""},{"$f":"$CG76","v":""},{"$f":"$CF76","v":""},{"$f":"$CI76","v":""},null,null,null,null,""]
[]
[null,null,null,null,null,"DISINFECTION PROCESS DATA "]
[null,"DATE:",null,null,null,{"$f":"OR(AND(COUNTA(D88:G97)=0,C84=\"\"),IsDate(C84))","v":true},"TIME:",null,null,null,null,"Operator Initials:"]
[null,"INDIVIDUAL DISINFECTION ZONES",null,null,null,null,null,null,null,null,null,null,"PLANT TOTAL",null,null,null,null,null,null,null,null,null,null,null,null,null,null,null,null,null,null,null,null,null,null,null,null,null,null,null,null,null,null,null,null,null,null,null,null,"PUMPAGE",null,null,null,null,{"$f":"\"DISINFECTION ZONES  ( D\"&$BD$11&\" - D\"&$BH$11&\" )\"","v":"DISINFECTION ZONES  ( D1 - D5 )"},null,null,null,null,null,null,null,null,null,null,null,null,null,null,null,null,null,{"$f":"\"DISINFECTION ZONES  ( D\"&$BI$11&\" - D\"&$BM$11&\" )\"","v":"DISINFECTION ZONES  ( D6 - D10 )"},null,null,null,null,null,null,null,null,null,null,null,null,null,null,null,"DAILY DISINFECTION DATA SUMMARY"]
[null,null,null,"C","Flow","Temp",null,null,"Giardia","Virus","Giardia","Virus","Giardia","Virus","Inact.",null,null,null,null,null,null,null,null,null,null,null,null,null,null,null,null,null,null,null,null,null,null,null,null,null,null,null,null,null,null,null,null,null,null,null,"RAW",null,null,null,null,null,null,null,null,null,null,null,null,"GIARDIA","GIARDIA","GIARDIA","VIRUS","VIRUS","VIRUS",null,null,null,null,null,null,null,null,null,null,null,null,"GIARDIA","GIARDIA","GIARDIA","VIRUS","VIRUS","VIRUS",null,"GIARDIA",null,"GIARDIA",null,"VIRUS",null,"VIRUS",null,"MINIMUM",null,null,null,"NO DATA"]
[null,"Disinfectant",null,"(mg/L)","(MGD)","(oC)","pH","CTCALC","CTREQD","CTREQD","Log","Log","Log","Log","Ratio",null,null,null,null,null,null,null,null,null,null,null,null,null,null,null,null,null,null,null,null,null,null,null,null,null,null,null,null,null,null,null,null,null,null,"DATE","WATER",null,null,"AT LEAST ONE PRECEDING ZONE <> \"NA\"","DISINFECTANT",null,null,"C","FLOW","T10","TEMP","pH","CTACTUAL","CTREQD","INACT. RATIO","LOG","CTREQD","INACT. RATIO","LOG",null,null,null,"DISINFECTANT",null,null,"C","FLOW","T10","TEMP","pH","CTACTUAL","CTREQD","INACT. RATIO","LOG","CTREQD","INACT. RATIO","LOG",null,"LOG",null,"INACT. RATIO",null,"LOG",null,"INACT. RATIO",null,"INACT. RATIO",null,null,null,{"$f":"\"D\"&$BD$11&\" - D\"&$BH$11","v":"D1 - D5"},{"$f":"\"D\"&$BI$11&\" - D\"&$BM$11","v":"D6 - D10"}]
[null,null,{"$f":"$C$15","v":1},null,null,null,null,{"$f":"IF(BL88=\"!error\",\"!error\",$BK88)","v":"missing"},{"$f":"$BL88","v":"missing"},{"$f":"$BO88","v":"missing"},{"$f":"$BN88","v":"missing"},{"$f":"$BQ88","v":"missing"},{"$f":"IF($CK88=\"\",\"\",IF($CK88=\"NA\",\"NA\",IF($CK88=\"!error\",-99,IF(COUNTIF(CW88:CX92,\"ND\")=$BN$4,\"MD\",IF(ISNUMBER($CK88),FIXED($CK88,2)&IF($CL88=\"*\",\"*\",\" \"),\"\")))))","v":""},{"$f":"IF($CO88=\"\",\"\",IF($CO88=\"NA\",\"NA \",IF($CO88=\"!error\",-99,IF(COUNTIF(CW88:CX92,\"ND\")=$BN$4,\"MD\",IF(ISNUMBER($CO88),FIXED($CO88,2)&IF($CP88=\"*\",\"*\",\" \"),\"\")))))","v":""},{"$f":"IF($CS88=\"\",\"\",IF($CS88=\"NA\",\"NA\",IF($CS88=\"!error\",-99,IF(AND($CW88=\"ND\",$CW89=\"ND\",$CW90=\"ND\",$CW91=\"ND\",$CW92=\"ND\",$CX88=\"ND\",$CX89=\"ND\",$CX90=\"ND\",$CX91=\"ND\",$CX92=\"ND\"),\"ND\",IF(ISNUMBER($CS88),$CS88,\"\")))))","v":""},null,{"$f":"IF(AND(BE88=1,D88>4,D88<>\"ND\"),\"Note: The inactivation credit in zone D\" & C88 & \" was restricted due to elevated free chlorine levels.\",\"\")","v":""},null,null,null,null,null,null,null,null,null,null,null,null,null,null,null,null,null,null,null,null,null,null,null,null,null,null,null,null,null,null,null,null,1,1,{"$f":"IF($BD$14=0,0,IF(COUNTIF(OFFSET($BD88,0,0,MIN($BD$14,5),1),\"<>NA\")+IF($BD$14>5,COUNTIF(OFFSET($BV88,0,0,$BD$14-5,1),\"<>NA\"),0),1,0))","v":0},{"$f":"IF($BD$14=0,0,IF(COUNTIF(OFFSET($BD88,0,0,MIN($BD$14,5),1),\"O3\")+COUNTIF(OFFSET($BD88,0,0,MIN($BD$14,5),1),\"O3 Cell 1\")+IF($BD$14>5,COUNTIF(OFFSET($BV88,0,0,$BD$14-5,1),\"O3\"),0)+IF($BD$14>5,COUNTIF(OFFSET($BV88,0,0,$BD$14-5,1),\"O3 Cell 1\"),0),1,0))","v":0},{"$f":"IF(OR($AY88=0,AND(COUNTA(D88,F88:G88)=0,COUNTIF(E88,0))),\"NA\",\n       IF(COUNTA(D88:G88),IF(BA88,4,\n                                                                     5),\n            IF($BD$15=1,IF(BA88,4,\n                                                        IF(AZ88,5,\n                                                                         6)),\n                    IF(BD88=\"!error\",IF(BA88,4,\n                                                                        5),\n                          IF(BA88,\"5B\",\n                                            6)))))","v":6},{"$f":"$BD$11","v":1},{"$f":"IF(AND(IF($BN$4=\"missing\",10,$BN$4)>=1,$AY88<>\"\"),IF(OR($AY88=0,AND($B88=\"NA\",COUNTA($D88,$F88:$G88)=0,COUNTIF($E88,0)),AND($B88=\"NA\",COUNTA($D88:$G88)=0,IF($BD$14=0,0,COUNTIF(OFFSET($BD88,0,0,MIN($BD$14,5),1),\"NA\")+IF($BD$14>5,COUNTIF(OFFSET($BV88,0,0,$BD$14-5,1),\"NA\"),0))=$BD$14),AND($B88=\"NA\",COUNTA($D88:$G88)=0,IF($BD$14<5,COUNTA(OFFSET($D88,$BD$14,0,MIN(5-$BD$14,$BD$15),4))-COUNTIF(OFFSET($E88,$BD$14,0,MIN(5-$BD$14,$BD$15),1),0),0)+IF($BD$14+$BD$15>5,COUNTA(OFFSET($D93,MAX($BD$14-5,0),0,MIN($BD$14+$BD$15-5,$BD$15),4))-COUNTIF(OFFSET($E93,MAX($BD$14-5,0),0,MIN($BD$14+$BD$15-5,$BD$15),1),0),0)),AND($B88=\"NA\",COUNTA($D88:$G88)=0,IF($BD$14<5,COUNTIF(OFFSET($B88,$BD$14,0,MIN(5-$BD$14,$BD$15),1),\"NA\"),0)+IF($BD$14+$BD$15>5,COUNTIF(OFFSET($B93,MAX($BD$14-5,0),0,MIN($BD$14+$BD$15-5,$BD$15),1),\"NA\"),0)<>$BD$15)),\"NA\",IF($B88=\"\",\"missing\",IF(AND($B88<>\"NA\",COUNTA($D88,$F88:$G88)+COUNTIF($E88,\"<>0\")),UPPER($B88),\"!error\"))),\"\")","v":"missing"},{"$f":"IF(BD88=\"\",\"\",IF(BD88=\"FCL\",1,IF(BD88=\"CLO2\",2,IF(BD88=\"O3 Cell 1\",99,IF(BD88=\"O3\",3,IF(BD88=\"CLA\",4,0))))))","v":0},{"$f":"IF(BD88=\"\",\"\",IF(BD88=\"NA\",\"NA\",IF(ISBLANK($D88),\"missing\",IF(AND(BE88=1,ISNUMBER($D88),$D88>4),4,IF(AND(ISNUMBER($D88),$D88>=0),$D88,IF(AND(ISTEXT($D88),$D88=\"ND\"),\"ND\",\"!error\"))))))","v":"missing"},{"$f":"IF(BD88=\"\",\"\",IF(BD88=\"NA\",\"NA\",IF(ISBLANK($E88),\"missing\",IF(OR(AND(ISBLANK($B88),COUNT(BF88,BI88:BJ88)=0,ISNUMBER($E88),$E88=0),AND(ISNUMBER($E88),$E88>0),AND(ISTEXT($E88),$E88=\"ND\")),$E88,\"!error\"))))","v":"missing"},{"$f":"IF(BD88=\"\",\"\",IF(AY88=0,\"NA\",IF(OR($BD$12=\"!error\",$BD$13=\"!error\",BG88=\"!error\"),\"!error\",IF(BD88=\"NA\",\"NA\",IF(AND(ISNUMBER(BG88),BG88=0),0,IF(AND(ISNUMBER($BD$12),ISNUMBER($BD$13),ISNUMBER(BG88)),$BD$13*$BD$12/BG88,IF(BG88=\"ND\",\"ND\",\"missing\")))))))","v":"missing"},{"$f":"IF(BD88=\"\",\"\",IF(BD88=\"NA\",\"NA\",IF(ISBLANK($F88),\"missing\",IF(OR(ISNUMBER($F88),$F88=\"ND\"),$F88,\"!error\"))))","v":"missing"},{"$f":"IF(BD88=\"\",\"\",IF(BD88=\"NA\",\"NA\",IF(ISBLANK($G88),\"missing\",IF(OR(AND(ISNUMBER($G88),$G88>=0,$G88<=14),$G88=\"ND\"),$G88,\"!error\"))))","v":"missing"},{"$f":"IF(BD88=\"\",\"\",IF(AY88=0,\"NA\",IF(OR(BF88=\"!error\",BH88=\"!error\"),\"!error\",IF(BD88=\"NA\",\"NA\",IF(OR(AND(ISNUMBER(BF88),BF88=0),AND(ISNUMBER(BH88),BH88=0)),0,IF(AND(ISNUMBER(BF88),ISNUMBER(BH88)),BF88*BH88,IF(OR(BF88=\"ND\",BH88=\"ND\"),\"ND\",\"missing\")))))))","v":"missing"},{"$f":"IF(BD88=\"\",\"\",IF(AY88=0,\"NA\",IF(CW88=\"ND\",\"ND\",IF(OR($BN$12=\"!error\",BD88=\"!error\",AND(BD88=\"missing\",ISNUMBER(BF88)),IF(BE88=1,BF88=\"!error\",0),BI88=\"!error\",BJ88=\"!error\"),\"!error\",IF(OR(BD88=\"NA\",AND(ISNUMBER($BN$12),$BN$12=0),AND(BE88<>0,ISNUMBER(BK88),BK88=0),AND(BE88=1,ISNUMBER(BJ88),BJ88>9),AND(BE88=2,ISNUMBER(BJ88),OR(BJ88<6,BJ88>=9.5)),AND(OR(BE88=3,BE88=4),ISNUMBER(BJ88),OR(BJ88<5.5,BJ88>=9.5))),\"NA\",IF(AND(ISNUMBER($BN$12),BE88<>0,IF(BE88=1,ISNUMBER(BF88),1),ISNUMBER(BI88),ISNUMBER(BJ88)),CT_Giardia(BE88,$BN$12,BI88,BJ88,IF(BE88=1,BF88,)),IF(COUNTIF(BE88,\"<>0\")+COUNT(BF88,BG88,BI88,BJ88)=5,\"!error\",\"missing\")))))))","v":"missing"},{"$f":"IF(BD88=\"\",\"\",IF(OR(AY88=0,AND(ISNUMBER($BN$12),$BN$12=0)),\"NA\",IF(CW88=\"ND\",\"ND\",IF(OR(BK88=\"!error\",BL88=\"!error\",BN88=\"!error\"),\"!error\",IF(BD88=\"NA\",\"NA\",IF(BL88=\"NA\",0,IF(AND(BE88<>99,ISNUMBER(BK88),ISNUMBER(BL88)),BK88/BL88,IF(AND(BE88=99,BN88=0.5),BN88/$BN$12,\"missing\"))))))))","v":"missing"},{"$f":"IF(BD88=\"\",\"\",IF(AY88=0,\"NA\",IF(CW88=\"ND\",\"ND\",IF(OR(BD88=\"!error\",AND(BD88=\"missing\",ISNUMBER(BF88)),BF88=\"!error\",BH88=\"!error\",BI88=\"!error\",BJ88=\"!error\"),\"!error\",IF(BD88=\"NA\",\"NA\",IF(OR(AND(BE88<>0,ISNUMBER(BK88),BK88=0),AND(BE88=1,ISNUMBER(BJ88),BJ88>9),AND(BE88=2,ISNUMBER(BJ88),OR(BJ88<6,BJ88>=9.5)),AND(OR(BE88=3,BE88=4),ISNUMBER(BJ88),OR(BJ88<5.5,BJ88>=9.5))),0,IF(AND(ISNUMBER($BN$12),BE88<>0,ISNUMBER(BF88),ISNUMBER(BH88),ISNUMBER(BI88),ISNUMBER(BJ88)),log_Giardia(BE88,$BN$12,BI88,BJ88,BF88,BH88),IF(COUNTIF(BE88,\"<>0\")+COUNT(BF88,BG88,BI88,BJ88)=5,\"!error\",\"missing\"))))))))","v":"missing"},{"$f":"IF(BD88=\"\",\"\",IF(AY88=0,\"NA\",IF(CW88=\"ND\",\"ND\",IF(OR($BP$12=\"!error\",BD88=\"!error\",AND(BD88=\"missing\",ISNUMBER(BF88)),BI88=\"!error\",BJ88=\"!error\"),\"!error\",IF(OR(BD88=\"NA\",AND(ISNUMBER($BP$12),$BP$12=0),AND(BE88<>0,ISNUMBER(BK88),BK88=0),AND(BE88=1,ISNUMBER(BJ88),BJ88>=10.5),AND(BE88=2,ISNUMBER(BJ88),OR(BJ88<6,BJ88>=9.5)),AND(BE88=3,ISNUMBER(BJ88),OR(BJ88<6,BJ88>9)),AND(BE88=4,ISNUMBER(BJ88),OR(BJ88<6,BJ88>10))),\"NA\",IF(AND(ISNUMBER($BP$12),BE88<>0,ISNUMBER(BI88),ISNUMBER(BJ88)),CT_Virus(BE88,$BP$12,BI88,BJ88),IF(COUNTIF(BE88,\"<>0\")+COUNT(BF88,BG88,BI88,BJ88)=5,\"!error\",\"missing\")))))))","v":"missing"},{"$f":"IF(BD88=\"\",\"\",IF(OR(AY88=0,AND(ISNUMBER($BP$12),$BP$12=0)),\"NA\",IF(CW88=\"ND\",\"ND\",IF(OR(BK88=\"!error\",BO88=\"!error\",BQ88=\"!error\"),\"!error\",IF(BD88=\"NA\",\"NA\",IF(BO88=\"NA\",0,IF(AND(BE88<>99,ISNUMBER(BK88),ISNUMBER(BO88)),BK88/BO88,IF(AND(BE88=99,BQ88=1),BQ88/$BP$12,\"missing\"))))))))","v":"missing"},{"$f":"IF(BD88=\"\",\"\",IF(AY88=0,\"NA\",IF(CW88=\"ND\",\"ND\",IF(OR(BD88=\"!error\",AND(BD88=\"missing\",ISNUMBER(BF88)),BF88=\"!error\",BH88=\"!error\",BI88=\"!error\",BJ88=\"!error\"),\"!error\",IF(BD88=\"NA\",\"NA\",IF(OR(AND(BE88<>0,ISNUMBER(BK88),BK88=0),AND(BE88=1,ISNUMBER(BJ88),BJ88>=10.5),AND(BE88=2,ISNUMBER(BJ88),OR(BJ88<6,BJ88>=9.5)),AND(BE88=3,ISNUMBER(BJ88),OR(BJ88<6,BJ88>9)),AND(BE88=4,ISNUMBER(BJ88),OR(BJ88<6,BJ88>10))),0,IF(AND(ISNUMBER($BP$12),BE88<>0,ISNUMBER(BF88),ISNUMBER(BH88),ISNUMBER(BI88),ISNUMBER(BJ88)),Log_Virus(BE88,$BP$12,BI88,BJ88,BF88,BH88),IF(COUNTIF(BE88,\"<>0\")+COUNT(BF88,BG88,BI88,BJ88)=5,\"!error\",\"missing\"))))))))","v":"missing"},{"$f":"IF($BI$14=0,0,IF(COUNTIF(OFFSET($BD88,0,0,MIN($BI$14,5),1),\"<>NA\")+IF($BI$14>5,COUNTIF(OFFSET($BV88,0,0,$BI$14-5,1),\"<>NA\"),0),1,0))","v":1},{"$f":"IF($BI$14=0,0,IF(COUNTIF(OFFSET($BD88,0,0,MIN($BI$14,5),1),\"O3\")+COUNTIF(OFFSET($BD88,0,0,MIN($BI$14,5),1),\"O3 Cell 1\")+IF($BI$14>5,COUNTIF(OFFSET($BV88,0,0,$BI$14-5,1),\"O3\"),0)+IF($BI$14>5,COUNTIF(OFFSET($BV88,0,0,$BI$14-5,1),\"O3 Cell 1\"),0),1,0))","v":0},{"$f":"IF(OR($AY88=0,AND(COUNTA(D93,F93:G93)=0,COUNTIF(E93,0))),\"NA\",IF(COUNTA(D93:G93),IF(BS88,4,5),IF($BI$15=1,IF(BS88,4,IF(BR88,5,6)),IF(BV88=\"!error\",IF(BS88,4,5),IF(BS88,\"5B\",6)))))","v":6},{"$f":"$BI$11","v":6},{"$f":"IF(AND(IF($BN$4=\"missing\",10,$BN$4)>=6,$AY88<>\"\"),IF(OR($AY88=0,AND($B93=\"NA\",COUNTA($D93,$F93:$G93)=0,COUNTIF($E93,0)),AND($B93=\"NA\",COUNTA($D93:$G93)=0,IF($BI$14=0,0,COUNTIF(OFFSET($BD88,0,0,MIN($BI$14,5),1),\"NA\")+IF($BI$14>5,COUNTIF(OFFSET($BV88,0,0,$BI$14-5,1),\"NA\"),0))=$BI$14),AND($B93=\"NA\",COUNTA($D93:$G93)=0,IF($BI$14<5,COUNTA(OFFSET($D88,$BI$14,0,MIN(5-$BI$14,$BI$15),4))-COUNTIF(OFFSET($E88,$BI$14,0,MIN(5-$BI$14,$BI$15),1),0),0)+IF($BI$14+$BI$15>5,COUNTA(OFFSET($D93,MAX($BI$14-5,0),0,MIN($BI$14+$BI$15-5,$BI$15),4))-COUNTIF(OFFSET($E93,MAX($BI$14-5,0),0,MIN($BI$14+$BI$15-5,$BI$15),1),0),0)),AND($B93=\"NA\",COUNTA($D93:$G93)=0,IF($BI$14<5,COUNTIF(OFFSET($B88,$BI$14,0,MIN(5-$BI$14,$BI$15),1),\"NA\"),0)+IF($BI$14+$BI$15>5,COUNTIF(OFFSET($B93,MAX($BI$14-5,0),0,MIN($BI$14+$BI$15-5,$BI$15),1),\"NA\"),0)<>$BI$15)),\"NA\",IF($B93=\"\",\"missing\",IF(AND($B93<>\"NA\",COUNTA($D93,$F93:$G93)+COUNTIF($E93,\"<>0\")),UPPER($B93),\"!error\"))),\"\")","v":""},{"$f":"IF(BV88=\"\",\"\",IF(BV88=\"FCL\",1,IF(BV88=\"CLO2\",2,IF(BV88=\"O3 Cell 1\",99,IF(BV88=\"O3\",3,IF(BV88=\"CLA\",4,0))))))","v":""},{"$f":"IF(BV88=\"\",\"\",IF(BV88=\"NA\",\"NA\",IF(ISBLANK($D93),\"missing\",IF(AND(BW88=1,ISNUMBER($D93),$D93>4),4,IF(AND(ISNUMBER($D93),$D93>=0),$D93,IF(AND(ISTEXT($D93),$D93=\"ND\"),\"ND\",\"!error\"))))))","v":""},{"$f":"IF(BV88=\"\",\"\",IF(BV88=\"NA\",\"NA\",IF(ISBLANK($E93),\"missing\",IF(OR(AND(ISBLANK($B93),COUNT(BX88,CA88:CB88)=0,ISNUMBER($E93),$E93=0),AND(ISNUMBER($E93),$E93>0),AND(ISTEXT($E93),$E93=\"ND\")),$E93,\"!error\"))))","v":""},{"$f":"IF(BV88=\"\",\"\",IF(AY88=0,\"NA\",IF(OR($BI$12=\"!error\",$BI$13=\"!error\",BY88=\"!error\"),\"!error\",IF(BV88=\"NA\",\"NA\",IF(AND(ISNUMBER(BY88),BY88=0),0,IF(AND(ISNUMBER($BI$12),ISNUMBER($BI$13),ISNUMBER(BY88)),$BI$13*$BI$12/BY88,IF(BY88=\"ND\",\"ND\",\"missing\")))))))","v":""},{"$f":"IF(BV88=\"\",\"\",IF(BV88=\"NA\",\"NA\",IF(ISBLANK($F93),\"missing\",IF(OR(ISNUMBER($F93),$F93=\"ND\"),$F93,\"!error\"))))","v":""},{"$f":"IF(BV88=\"\",\"\",IF(BV88=\"NA\",\"NA\",IF(ISBLANK($G93),\"missing\",IF(OR(AND(ISNUMBER($G93),$G93>=0,$G93<=14),$G93=\"ND\"),$G93,\"!error\"))))","v":""},{"$f":"IF(BV88=\"\",\"\",IF(AY88=0,\"NA\",IF(OR(BX88=\"!error\",BZ88=\"!error\"),\"!error\",IF(BV88=\"NA\",\"NA\",IF(OR(AND(ISNUMBER(BX88),BX88=0),AND(ISNUMBER(BZ88),BZ88=0)),0,IF(AND(ISNUMBER(BX88),ISNUMBER(BZ88)),BX88*BZ88,IF(OR(BX88=\"ND\",BZ88=\"ND\"),\"ND\",\"missing\")))))))","v":""},{"$f":"IF(BV88=\"\",\"\",IF(AY88=0,\"NA\",IF(CX88=\"ND\",\"ND\",IF(OR($BN$12=\"!error\",BV88=\"!error\",AND(BV88=\"missing\",ISNUMBER(BX88)),IF(BW88=1,BX88=\"!error\",0),CA88=\"!error\",CB88=\"!error\"),\"!error\",IF(OR(BV88=\"NA\",AND(ISNUMBER($BN$12),$BN$12=0),AND(BW88<>0,ISNUMBER(CC88),CC88=0),AND(BW88=1,ISNUMBER(CB88),CB88>9),AND(BW88>1,ISNUMBER(CB88),OR(CB88<6,CB88>=9.5))),\"NA\",IF(AND(ISNUMBER($BN$12),BW88<>0,IF(BW88=1,ISNUMBER(BX88),1),ISNUMBER(CA88),ISNUMBER(CB88)),CT_Giardia(BW88,$BN$12,CA88,CB88,IF(BW88=1,BX88,)),IF(COUNTIF(BW88,\"<>0\")+COUNT(BX88,BY88,CA88,CB88)=5,\"!error\",\"missing\")))))))","v":""},{"$f":"IF(BV88=\"\",\"\",IF(OR(AY88=0,AND(ISNUMBER($BN$12),$BN$12=0)),\"NA\",IF(CX88=\"ND\",\"ND\",IF(OR(CC88=\"!error\",CD88=\"!error\",CF88=\"!error\"),\"!error\",IF(BV88=\"NA\",\"NA\",IF(CD88=\"NA\",0,IF(AND(ISNUMBER(CC88),ISNUMBER(CD88)),CC88/CD88,IF(AND(BW88=99,CF88=0.5),CF88/$BN$12,\"missing\"))))))))","v":""},{"$f":"IF(BV88=\"\",\"\",IF(AY88=0,\"NA\",IF(CX88=\"ND\",\"ND\",IF(OR(BV88=\"!error\",AND(BV88=\"missing\",ISNUMBER(BX88)),BX88=\"!error\",BZ88=\"!error\",CA88=\"!error\",CB88=\"!error\"),\"!error\",IF(BV88=\"NA\",\"NA\",IF(OR(AND(BW88<>0,ISNUMBER(CC88),CC88=0),AND(BW88=1,ISNUMBER(CB88),CB88>9),AND(BW88>1,ISNUMBER(CB88),OR(CB88<6,CB88>=9.5))),0,IF(AND(ISNUMBER($BN$12),BW88<>0,ISNUMBER(BX88),ISNUMBER(BZ88),ISNUMBER(CA88),ISNUMBER(CB88)),log_Giardia(BW88,$BN$12,CA88,CB88,BX88,BZ88),IF(COUNTIF(BW88,\"<>0\")+COUNT(BX88,BY88,CA88,CB88)=5,\"!error\",\"missing\"))))))))","v":""},{"$f":"IF(BV88=\"\",\"\",IF(AY88=0,\"NA\",IF(CX88=\"ND\",\"ND\",IF(OR($BP$12=\"!error\",BV88=\"!error\",AND(BV88=\"missing\",ISNUMBER(BX88)),CA88=\"!error\",CB88=\"!error\"),\"!error\",IF(OR(BV88=\"NA\",AND(ISNUMBER($BP$12),$BP$12=0),AND(BW88<>0,ISNUMBER(CC88),CC88=0),AND(BW88=1,ISNUMBER(CB88),OR(CB88<5.5,CB88>=10.5)),AND(OR(BW88=2,BW88=4),ISNUMBER(CB88),OR(CB88<6,CB88>=9.5)),AND(BW88=3,ISNUMBER(CB88),OR(CB88<6,CB88>9))),\"NA\",IF(AND(ISNUMBER($BP$12),BW88<>0,ISNUMBER(CA88),ISNUMBER(CB88)),CT_Virus(BW88,$BP$12,CA88,CB88),IF(COUNTIF(BW88,\"<>0\")+COUNT(BX88,BY88,CA88,CB88)=5,\"!error\",\"missing\")))))))","v":""},{"$f":"IF(BV88=\"\",\"\",IF(OR(AY88=0,AND(ISNUMBER($BP$12),$BP$12=0)),\"NA\",IF(CX88=\"ND\",\"ND\",IF(OR(CC88=\"!error\",CG88=\"!error\",CI88=\"!error\"),\"!error\",IF(BV88=\"NA\",\"NA\",IF(CG88=\"NA\",0,IF(AND(ISNUMBER(CC88),ISNUMBER(CG88)),CC88/CG88,IF(AND(BW88=99,CI88=1),CI88/$BP$12,\"missing\"))))))))","v":""},{"$f":"IF(BV88=\"\",\"\",IF(AY88=0,\"NA\",IF(CX88=\"ND\",\"ND\",IF(OR(BV88=\"!error\",AND(BV88=\"missing\",ISNUMBER(BX88)),BX88=\"!error\",BZ88=\"!error\",CA88=\"!error\",CB88=\"!error\"),\"!error\",IF(BV88=\"NA\",\"NA\",IF(OR(AND(BW88<>0,ISNUMBER(CC88),CC88=0),AND(BW88=1,ISNUMBER(CB88),OR(CB88<5.5,CB88>=10.5)),AND(OR(BW88=2,BW88=4),ISNUMBER(CB88),OR(CB88<6,CB88>=9.5)),AND(BW88=3,ISNUMBER(CB88),OR(CB88<6,CB88>9))),0,IF(AND(ISNUMBER($BP$12),BW88<>0,ISNUMBER(BX88),ISNUMBER(BZ88),ISNUMBER(CA88),ISNUMBER(CB88)),Log_Virus(BW88,$BP$12,CA88,CB88,BX88,BZ88),IF(COUNTIF(BW88,\"<>0\")+COUNT(BX88,BY88,CA88,CB88)=5,\"!error\",\"missing\"))))))))","v":""},null,{"$f":"IF(AY88=\"\",\"\",IF(AY88=0,\"NA\",IF(COUNTIF(BN88:BN92,\"!error\")+COUNTIF(CF88:CF92,\"!error\")>0,\"!error\",IF(COUNT(BN88:BN92,CF88:CF92)>0,SUMIFF(BC88:BC92,\">0\",BN88:BN92)+SUMIFF(BU88:BU92,\">0\",CF88:CF92)+MINIF(BC88:BC92,BU88:BU92,\"1?\",BN88:BN92,CF88:CF92)+MINIF(BC88:BC92,BU88:BU92,\"2?\",BN88:BN92,CF88:CF92)+MINIF(BC88:BC92,BU88:BU92,\"3?\",BN88:BN92,CF88:CF92)+MINIF(BC88:BC92,BU88:BU92,\"4?\",BN88:BN92,CF88:CF92)+MINIF(BC88:BC92,BU88:BU92,\"5?\",BN88:BN92,CF88:CF92)+MINIF(BC88:BC92,BU88:BU92,\"6?\",BN88:BN92,CF88:CF92)+MINIF(BC88:BC92,BU88:BU92,\"7?\",BN88:BN92,CF88:CF92)+MINIF(BC88:BC92,BU88:BU92,\"8?\",BN88:BN92,CF88:CF92)+MINIF(BC88:BC92,BU88:BU92,\"9?\",BN88:BN92,CF88:CF92)+MINIF(BC88:BC92,BU88:BU92,\"10?\",BN88:BN92,CF88:CF92),IF(COUNTIF(BN88:BN92,\"NA\")+COUNTIF(CF88:CF92,\"NA\")=IF($AZ$4=\"missing\",10,SUM($BD$4:$BM$4)),0,\"missing\")))))","v":"missing"},{"$f":"IF(AND(ISNUMBER(CK88),COUNT(BN88:BN92,CF88:CF92)+COUNTIF(BN88:BN92,\"NA\")+COUNTIF(CF88:CF92,\"NA\")<IF($AZ$4=\"missing\",10,SUM($BD$4:$BM$4))),\"*\",\"\")","v":""},{"$f":"IF(AY88=\"\",\"\",IF(OR(AY88=0,AND(ISNUMBER($BN$12),$BN$12=0)),\"NA\",IF(COUNTIF(BM88:BM92,\"!error\")+COUNTIF(CE88:CE92,\"!error\")>0,\"!error\",IF(COUNT(BM88:BM92,CE88:CE92)>0,SUMIFF(BC88:BC92,\">0\",BM88:BM92)+SUMIFF(BU88:BU92,\">0\",CE88:CE92)+MINIF(BC88:BC92,BU88:BU92,\"1?\",BM88:BM92,CE88:CE92)+MINIF(BC88:BC92,BU88:BU92,\"2?\",BM88:BM92,CE88:CE92)+MINIF(BC88:BC92,BU88:BU92,\"3?\",BM88:BM92,CE88:CE92)+MINIF(BC88:BC92,BU88:BU92,\"4?\",BM88:BM92,CE88:CE92)+MINIF(BC88:BC92,BU88:BU92,\"5?\",BM88:BM92,CE88:CE92)+MINIF(BC88:BC92,BU88:BU92,\"6?\",BM88:BM92,CE88:CE92)+MINIF(BC88:BC92,BU88:BU92,\"7?\",BM88:BM92,CE88:CE92)+MINIF(BC88:BC92,BU88:BU92,\"8?\",BM88:BM92,CE88:CE92)+MINIF(BC88:BC92,BU88:BU92,\"9?\",BM88:BM92,CE88:CE92)+MINIF(BC88:BC92,BU88:BU92,\"10?\",BM88:BM92,CE88:CE92),IF(COUNTIF(BM88:BM92,\"NA\")+COUNTIF(CE88:CE92,\"NA\")=IF($AZ$4=\"missing\",10,SUM($BD$4:$BM$4)),0,\"missing\")))))","v":"missing"},{"$f":"IF(AND(ISNUMBER(CM88),COUNT(BM88:BM92,CE88:CE92)+COUNTIF(BM88:BM92,\"NA\")+COUNTIF(CE88:CE92,\"NA\")<IF($AZ$4=\"missing\",10,SUM($BD$4:$BM$4))),\"*\",\"\")","v":""},{"$f":"IF(AY88=\"\",\"\",IF(AY88=0,\"NA\",IF(COUNTIF(BQ88:BQ92,\"!error\")+COUNTIF(CI88:CI92,\"!error\")>0,\"!error\",IF(COUNT(BQ88:BQ92,CI88:CI92)>0,SUMIFF(BC88:BC92,\">0\",BQ88:BQ92)+SUMIFF(BU88:BU92,\">0\",CI88:CI92)+MINIF(BC88:BC92,BU88:BU92,\"1?\",BQ88:BQ92,CI88:CI92)+MINIF(BC88:BC92,BU88:BU92,\"2?\",BQ88:BQ92,CI88:CI92)+MINIF(BC88:BC92,BU88:BU92,\"3?\",BQ88:BQ92,CI88:CI92)+MINIF(BC88:BC92,BU88:BU92,\"4?\",BQ88:BQ92,CI88:CI92)+MINIF(BC88:BC92,BU88:BU92,\"5?\",BQ88:BQ92,CI88:CI92)+MINIF(BC88:BC92,BU88:BU92,\"6?\",BQ88:BQ92,CI88:CI92)+MINIF(BC88:BC92,BU88:BU92,\"7?\",BQ88:BQ92,CI88:CI92)+MINIF(BC88:BC92,BU88:BU92,\"8?\",BQ88:BQ92,CI88:CI92)+MINIF(BC88:BC92,BU88:BU92,\"9?\",BQ88:BQ92,CI88:CI92)+MINIF(BC88:BC92,BU88:BU92,\"10?\",BQ88:BQ92,CI88:CI92),IF(COUNTIF(BQ88:BQ92,\"NA\")+COUNTIF(CI88:CI92,\"NA\")=IF($AZ$4=\"missing\",10,SUM($BD$4:$BM$4)),0,\"missing\")))))","v":"missing"},{"$f":"IF(AND(ISNUMBER(CO88),COUNT(BQ88:BQ92,CI88:CI92)+COUNTIF(BQ88:BQ92,\"NA\")+COUNTIF(CI88:CI92,\"NA\")<IF($AZ$4=\"missing\",10,SUM($BD$4:$BM$4))),\"*\",\"\")","v":""},{"$f":"IF(AY88=\"\",\"\",IF(OR(AY88=0,AND(ISNUMBER($BP$12),$BP$12=0)),\"NA\",IF(COUNTIF(BP88:BP92,\"!error\")+COUNTIF(CH88:CH92,\"!error\")>0,\"!error\",IF(COUNT(BP88:BP92,CH88:CH92)>0,SUMIFF(BC88:BC92,\">0\",BP88:BP92)+SUMIFF(BU88:BU92,\">0\",CH88:CH92)+MINIF(BC88:BC92,BU88:BU92,\"1?\",BP88:BP92,CH88:CH92)+MINIF(BC88:BC92,BU88:BU92,\"2?\",BP88:BP92,CH88:CH92)+MINIF(BC88:BC92,BU88:BU92,\"3?\",BP88:BP92,CH88:CH92)+MINIF(BC88:BC92,BU88:BU92,\"4?\",BP88:BP92,CH88:CH92)+MINIF(BC88:BC92,BU88:BU92,\"5?\",BP88:BP92,CH88:CH92)+MINIF(BC88:BC92,BU88:BU92,\"6?\",BP88:BP92,CH88:CH92)+MINIF(BC88:BC92,BU88:BU92,\"7?\",BP88:BP92,CH88:CH92)+MINIF(BC88:BC92,BU88:BU92,\"8?\",BP88:BP92,CH88:CH92)+MINIF(BC88:BC92,BU88:BU92,\"9?\",BP88:BP92,CH88:CH92)+MINIF(BC88:BC92,BU88:BU92,\"10?\",BP88:BP92,CH88:CH92),IF(COUNTIF(BP88:BP92,\"NA\")+COUNTIF(CH88:CH92,\"NA\")=IF($AZ$4=\"missing\",10,SUM($BD$4:$BM$4)),0,\"missing\")))))","v":"missing"},{"$f":"IF(AND(ISNUMBER(CQ88),COUNT(BP88:BP92,CH88:CH92)+COUNTIF(BP88:BP92,\"NA\")+COUNTIF(CH88:CH92,\"NA\")<IF($AZ$4=\"missing\",10,SUM($BD$4:$BM$4))),\"*\",\"\")","v":""},{"$f":"IF(AY88=\"\",\"\",IF(AND(CM88=\"NA\",CQ88=\"NA\"),\"NA\",IF(OR(AND(ISNUMBER(CM88),ISNUMBER(CQ88)),AND(ISNUMBER(CM88),CQ88=\"NA\"),AND(CM88=\"NA\",ISNUMBER(CQ88)),AND(ISNUMBER(CM88),CM88=0),AND(ISNUMBER(CQ88),CQ88=0)),MIN(CM88,CQ88),IF(OR(CM88=\"!error\",CQ88=\"!error\"),\"!error\",\"missing\"))))","v":"missing"},{"$f":"IF(ISNUMBER(CS88),IF(CM88<CQ88,IF(CN88=\"*\",\"*\",\"\"),IF(CQ88<CM88,IF(CR88=\"*\",\"*\",\"\"),IF(AND(CN88=\"*\",CR88=\"*\"),\"*\",\"\"))),\"\")","v":""},{"$f":"IF(ISNUMBER(CS88),IF(CM88<CQ88,\"(G)\",IF(CQ88<CM88,\"(V)\",IF(AND(CN88=\"\",CR88=\"*\"),\"(G)\",IF(AND(CN88=\"*\",CR88=\"\"),\"(V)\",\"(G/V)\")))),\"\")","v":""},null,{"$f":"IF(OR(BF88=\"ND\",BG88=\"ND\",BI88=\"ND\",BJ88=\"ND\"),\"ND\",\"data\")","v":"data"},{"$f":"IF(OR(BX88=\"ND\",BY88=\"ND\",CA88=\"ND\",CB88=\"ND\"),\"ND\",\"data\")","v":"data"}]
[null," ",{"$f":"$D$15","v":2},null,null,null,null,"missing",{"$f":"$BL89","v":"missing"},{"$f":"$BO89","v":"missing"},{"$f":"$BN89","v":"missing"},{"$f":"$BQ89","v":"missing"},null,null,null,null,{"$f":"IF(AND(BE89=1,D89>4,D89<>\"ND\"),\"Note: The inactivation credit in zone D\" & C89 & \" was restricted due to elevated free chlorine levels.\",\"\")","v":""},null,null,null,null,null,null,null,null,null,null,null,null,null,null,null,null,null,null,null,null,null,null,null,null,null,null,null,null,null,null,null,null,null,1,{"$f":"IF($BE$14=0,0,IF(COUNTIF(OFFSET($BD88,0,0,MIN($BE$14,5),1),\"<>NA\")+IF($BE$14>5,COUNTIF(OFFSET($BV88,0,0,$BE$14-5,1),\"<>NA\"),0),1,0))","v":1},{"$f":"IF($BE$14=0,0,IF(COUNTIF(OFFSET($BD88,0,0,MIN($BE$14,5),1),\"O3\")+COUNTIF(OFFSET($BD88,0,0,MIN($BE$14,5),1),\"O3 Cell 1\")+IF($BE$14>5,COUNTIF(OFFSET($BV88,0,0,$BE$14-5,1),\"O3\"),0)+IF($BE$14>5,COUNTIF(OFFSET($BV88,0,0,$BE$14-5,1),\"O3 Cell 1\"),0),1,0))","v":0},{"$f":"IF(OR($AY89=0,AND(COUNTA(D89,F89:G89)=0,COUNTIF(E89,0))),\"NA\",IF(COUNTA(D89:G89),IF(BA89,4,5),IF($BE$15=1,IF(BA89,4,IF(AZ89,5,6)),IF(BD89=\"!error\",IF(BA89,4,5),IF(BA89,\"5B\",6)))))","v":5},{"$f":"$BE$11","v":2},{"$f":"IF(AND(IF($BN$4=\"missing\",10,$BN$4)>=2,$AY89<>\"\"),IF(OR($AY89=0,AND($B89=\"NA\",COUNTA($D89,$F89:$G89)=0,COUNTIF($E89,0)),AND($B89=\"NA\",COUNTA($D89:$G89)=0,IF($BE$14=0,0,COUNTIF(OFFSET($BD88,0,0,MIN($BE$14,5),1),\"NA\")+IF($BE$14>5,COUNTIF(OFFSET($BV88,0,0,$BE$14-5,1),\"NA\"),0))=$BE$14),AND($B89=\"NA\",COUNTA($D89:$G89)=0,IF($BE$14<5,COUNTA(OFFSET($D88,$BE$14,0,MIN(5-$BE$14,$BE$15),4))-COUNTIF(OFFSET($E88,$BE$14,0,MIN(5-$BE$14,$BE$15),1),0),0)+IF($BE$14+$BE$15>5,COUNTA(OFFSET($D93,MAX($BE$14-5,0),0,MIN($BE$14+$BE$15-5,$BE$15),4))-COUNTIF(OFFSET($E93,MAX($BE$14-5,0),0,MIN($BE$14+$BE$15-5,$BE$15),1),0),0)),AND($B89=\"NA\",COUNTA($D89:$G89)=0,IF($BE$14<5,COUNTIF(OFFSET($B88,$BE$14,0,MIN(5-$BE$14,$BE$15),1),\"NA\"),0)+IF($BE$14+$BE$15>5,COUNTIF(OFFSET($B93,MAX($BE$14-5,0),0,MIN($BE$14+$BE$15-5,$BE$15),1),\"NA\"),0)<>$BE$15)),\"NA\",IF($B89=\"\",\"missing\",IF(AND($B89<>\"NA\",COUNTA($D89,$F89:$G89)+COUNTIF($E89,\"<>0\")),UPPER($B89),\"!error\"))),\"\")","v":" "},0,{"$f":"IF(BD89=\"\",\"\",IF(BD89=\"NA\",\"NA\",IF(ISBLANK($D89),\"missing\",IF(AND(BE89=1,ISNUMBER($D89),$D89>4),4,IF(AND(ISNUMBER($D89),$D89>=0),$D89,IF(AND(ISTEXT($D89),$D89=\"ND\"),\"ND\",\"!error\"))))))","v":"missing"},{"$f":"IF(BD89=\"\",\"\",IF(BD89=\"NA\",\"NA\",IF(ISBLANK($E89),\"missing\",IF(OR(AND(ISBLANK($B89),COUNT(BF89,BI89:BJ89)=0,ISNUMBER($E89),$E89=0),AND(ISNUMBER($E89),$E89>0),AND(ISTEXT($E89),$E89=\"ND\")),$E89,\"!error\"))))","v":"missing"},{"$f":"IF(BD89=\"\",\"\",IF(AY89=0,\"NA\",IF(OR($BE$12=\"!error\",$BE$13=\"!error\",BG89=\"!error\"),\"!error\",IF(BD89=\"NA\",\"NA\",IF(AND(ISNUMBER(BG89),BG89=0),0,IF(AND(ISNUMBER($BE$12),ISNUMBER($BE$13),ISNUMBER(BG89)),$BE$13*$BE$12/BG89,IF(BG89=\"ND\",\"ND\",\"missing\")))))))","v":"missing"},{"$f":"IF(BD89=\"\",\"\",IF(BD89=\"NA\",\"NA\",IF(ISBLANK($F89),\"missing\",IF(OR(ISNUMBER($F89),$F89=\"ND\"),$F89,\"!error\"))))","v":"missing"},{"$f":"IF(BD89=\"\",\"\",IF(BD89=\"NA\",\"NA\",IF(ISBLANK($G89),\"missing\",IF(OR(AND(ISNUMBER($G89),$G89>=0,$G89<=14),$G89=\"ND\"),$G89,\"!error\"))))","v":"missing"},"missing",{"$f":"IF(BD89=\"\",\"\",IF(AY89=0,\"NA\",IF(CW89=\"ND\",\"ND\",IF(OR($BN$12=\"!error\",BD89=\"!error\",AND(BD89=\"missing\",ISNUMBER(BF89)),IF(BE89=1,BF89=\"!error\",0),BI89=\"!error\",BJ89=\"!error\"),\"!error\",IF(OR(BD89=\"NA\",AND(ISNUMBER($BN$12),$BN$12=0),AND(BE89<>0,ISNUMBER(BK89),BK89=0),AND(BE89=1,ISNUMBER(BJ89),BJ89>9),AND(BE89=2,ISNUMBER(BJ89),OR(BJ89<6,BJ89>=9.5)),AND(OR(BE89=3,BE89=4),ISNUMBER(BJ89),OR(BJ89<5.5,BJ89>=9.5))),\"NA\",IF(AND(ISNUMBER($BN$12),BE89<>0,IF(BE89=1,ISNUMBER(BF89),1),ISNUMBER(BI89),ISNUMBER(BJ89)),CT_Giardia(BE89,$BN$12,BI89,BJ89,IF(BE89=1,BF89,)),IF(COUNTIF(BE89,\"<>0\")+COUNT(BF89,BG89,BI89,BJ89)=5,\"!error\",\"missing\")))))))","v":"missing"},{"$f":"IF(BD89=\"\",\"\",IF(OR(AY89=0,AND(ISNUMBER($BN$12),$BN$12=0)),\"NA\",IF(CW89=\"ND\",\"ND\",IF(OR(BK89=\"!error\",BL89=\"!error\",BN89=\"!error\"),\"!error\",IF(BD89=\"NA\",\"NA\",IF(BL89=\"NA\",0,IF(AND(BE89<>99,ISNUMBER(BK89),ISNUMBER(BL89)),BK89/BL89,IF(AND(BE89=99,BN89=0.5),BN89/$BN$12,\"missing\"))))))))","v":"missing"},{"$f":"IF(BD89=\"\",\"\",IF(AY89=0,\"NA\",IF(CW89=\"ND\",\"ND\",IF(OR(BD89=\"!error\",AND(BD89=\"missing\",ISNUMBER(BF89)),BF89=\"!error\",BH89=\"!error\",BI89=\"!error\",BJ89=\"!error\"),\"!error\",IF(BD89=\"NA\",\"NA\",IF(OR(AND(BE89<>0,ISNUMBER(BK89),BK89=0),AND(BE89=1,ISNUMBER(BJ89),BJ89>9),AND(BE89=2,ISNUMBER(BJ89),OR(BJ89<6,BJ89>=9.5)),AND(OR(BE89=3,BE89=4),ISNUMBER(BJ89),OR(BJ89<5.5,BJ89>=9.5))),0,IF(AND(ISNUMBER($BN$12),BE89<>0,ISNUMBER(BF89),ISNUMBER(BH89),ISNUMBER(BI89),ISNUMBER(BJ89)),log_Giardia(BE89,$BN$12,BI89,BJ89,BF89,BH89),IF(COUNTIF(BE89,\"<>0\")+COUNT(BF89,BG89,BI89,BJ89)=5,\"!error\",\"missing\"))))))))","v":"missing"},{"$f":"IF(BD89=\"\",\"\",IF(AY89=0,\"NA\",IF(CW89=\"ND\",\"ND\",IF(OR($BP$12=\"!error\",BD89=\"!error\",AND(BD89=\"missing\",ISNUMBER(BF89)),BI89=\"!error\",BJ89=\"!error\"),\"!error\",IF(OR(BD89=\"NA\",AND(ISNUMBER($BP$12),$BP$12=0),AND(BE89<>0,ISNUMBER(BK89),BK89=0),AND(BE89=1,ISNUMBER(BJ89),BJ89>=10.5),AND(BE89=2,ISNUMBER(BJ89),OR(BJ89<6,BJ89>=9.5)),AND(BE89=3,ISNUMBER(BJ89),OR(BJ89<6,BJ89>9)),AND(BE89=4,ISNUMBER(BJ89),OR(BJ89<6,BJ89>10))),\"NA\",IF(AND(ISNUMBER($BP$12),BE89<>0,ISNUMBER(BI89),ISNUMBER(BJ89)),CT_Virus(BE89,$BP$12,BI89,BJ89),IF(COUNTIF(BE89,\"<>0\")+COUNT(BF89,BG89,BI89,BJ89)=5,\"!error\",\"missing\")))))))","v":"missing"},{"$f":"IF(BD89=\"\",\"\",IF(OR(AY89=0,AND(ISNUMBER($BP$12),$BP$12=0)),\"NA\",IF(CW89=\"ND\",\"ND\",IF(OR(BK89=\"!error\",BO89=\"!error\",BQ89=\"!error\"),\"!error\",IF(BD89=\"NA\",\"NA\",IF(BO89=\"NA\",0,IF(AND(BE89<>99,ISNUMBER(BK89),ISNUMBER(BO89)),BK89/BO89,IF(AND(BE89=99,BQ89=1),BQ89/$BP$12,\"missing\"))))))))","v":"missing"},{"$f":"IF(BD89=\"\",\"\",IF(AY89=0,\"NA\",IF(CW89=\"ND\",\"ND\",IF(OR(BD89=\"!error\",AND(BD89=\"missing\",ISNUMBER(BF89)),BF89=\"!error\",BH89=\"!error\",BI89=\"!error\",BJ89=\"!error\"),\"!error\",IF(BD89=\"NA\",\"NA\",IF(OR(AND(BE89<>0,ISNUMBER(BK89),BK89=0),AND(BE89=1,ISNUMBER(BJ89),BJ89>=10.5),AND(BE89=2,ISNUMBER(BJ89),OR(BJ89<6,BJ89>=9.5)),AND(BE89=3,ISNUMBER(BJ89),OR(BJ89<6,BJ89>9)),AND(BE89=4,ISNUMBER(BJ89),OR(BJ89<6,BJ89>10))),0,IF(AND(ISNUMBER($BP$12),BE89<>0,ISNUMBER(BF89),ISNUMBER(BH89),ISNUMBER(BI89),ISNUMBER(BJ89)),Log_Virus(BE89,$BP$12,BI89,BJ89,BF89,BH89),IF(COUNTIF(BE89,\"<>0\")+COUNT(BF89,BG89,BI89,BJ89)=5,\"!error\",\"missing\"))))))))","v":"missing"},{"$f":"IF($BJ$14=0,0,IF(COUNTIF(OFFSET($BD88,0,0,MIN($BJ$14,5),1),\"<>NA\")+IF($BJ$14>5,COUNTIF(OFFSET($BV88,0,0,$BJ$14-5,1),\"<>NA\"),0),1,0))","v":1},{"$f":"IF($BJ$14=0,0,IF(COUNTIF(OFFSET($BD88,0,0,MIN($BJ$14,5),1),\"O3\")+COUNTIF(OFFSET($BD88,0,0,MIN($BJ$14,5),1),\"O3 Cell 1\")+IF($BJ$14>5,COUNTIF(OFFSET($BV88,0,0,$BJ$14-5,1),\"O3\"),0)+IF($BJ$14>5,COUNTIF(OFFSET($BV88,0,0,$BJ$14-5,1),\"O3 Cell 1\"),0),1,0))","v":0},{"$f":"IF(OR($AY89=0,AND(COUNTA(D94,F94:G94)=0,COUNTIF(E94,0))),\"NA\",IF(COUNTA(D94:G94),IF(BS89,4,5),IF($BJ$15=1,IF(BS89,4,IF(BR89,5,6)),IF(BV89=\"!error\",IF(BS89,4,5),IF(BS89,\"5B\",6)))))","v":6},{"$f":"$BJ$11","v":7},{"$f":"IF(AND(IF($BN$4=\"missing\",10,$BN$4)>=7,$AY89<>\"\"),IF(OR($AY89=0,AND($B94=\"NA\",COUNTA($D94,$F94:$G94)=0,COUNTIF($E94,0)),AND($B94=\"NA\",COUNTA($D94:$G94)=0,IF($BJ$14=0,0,COUNTIF(OFFSET($BD88,0,0,MIN($BJ$14,5),1),\"NA\")+IF($BJ$14>5,COUNTIF(OFFSET($BV88,0,0,$BJ$14-5,1),\"NA\"),0))=$BJ$14),AND($B94=\"NA\",COUNTA($D94:$G94)=0,IF($BJ$14<5,COUNTA(OFFSET($D88,$BJ$14,0,MIN(5-$BJ$14,$BJ$15),4))-COUNTIF(OFFSET($E88,$BJ$14,0,MIN(5-$BJ$14,$BJ$15),1),0),0)+IF($BJ$14+$BJ$15>5,COUNTA(OFFSET($D93,MAX($BJ$14-5,0),0,MIN($BJ$14+$BJ$15-5,$BJ$15),4))-COUNTIF(OFFSET($E93,MAX($BJ$14-5,0),0,MIN($BJ$14+$BJ$15-5,$BJ$15),1),0),0)),AND($B94=\"NA\",COUNTA($D94:$G94)=0,IF($BJ$14<5,COUNTIF(OFFSET($B88,$BJ$14,0,MIN(5-$BJ$14,$BJ$15),1),\"NA\"),0)+IF($BJ$14+$BJ$15>5,COUNTIF(OFFSET($B93,MAX($BJ$14-5,0),0,MIN($BJ$14+$BJ$15-5,$BJ$15),1),\"NA\"),0)<>$BJ$15)),\"NA\",IF($B94=\"\",\"missing\",IF(AND($B94<>\"NA\",COUNTA($D94,$F94:$G94)+COUNTIF($E94,\"<>0\")),UPPER($B94),\"!error\"))),\"\")","v":""},"",{"$f":"IF(BV89=\"\",\"\",IF(BV89=\"NA\",\"NA\",IF(ISBLANK($D94),\"missing\",IF(AND(BW89=1,ISNUMBER($D94),$D94>4),4,IF(AND(ISNUMBER($D94),$D94>=0),$D94,IF(AND(ISTEXT($D94),$D94=\"ND\"),\"ND\",\"!error\"))))))","v":""},{"$f":"IF(BV89=\"\",\"\",IF(BV89=\"NA\",\"NA\",IF(ISBLANK($E94),\"missing\",IF(OR(AND(ISBLANK($B94),COUNT(BX89,CA89:CB89)=0,ISNUMBER($E94),$E94=0),AND(ISNUMBER($E94),$E94>0),AND(ISTEXT($E94),$E94=\"ND\")),$E94,\"!error\"))))","v":""},{"$f":"IF(BV89=\"\",\"\",IF(AY89=0,\"NA\",IF(OR($BJ$12=\"!error\",$BJ$13=\"!error\",BY89=\"!error\"),\"!error\",IF(BV89=\"NA\",\"NA\",IF(AND(ISNUMBER(BY89),BY89=0),0,IF(AND(ISNUMBER($BJ$12),ISNUMBER($BJ$13),ISNUMBER(BY89)),$BJ$13*$BJ$12/BY89,IF(BY89=\"ND\",\"ND\",\"missing\")))))))","v":""},{"$f":"IF(BV89=\"\",\"\",IF(BV89=\"NA\",\"NA\",IF(ISBLANK($F94),\"missing\",IF(OR(ISNUMBER($F94),$F94=\"ND\"),$F94,\"!error\"))))","v":""},{"$f":"IF(BV89=\"\",\"\",IF(BV89=\"NA\",\"NA\",IF(ISBLANK($G94),\"missing\",IF(OR(AND(ISNUMBER($G94),$G94>=0,$G94<=14),$G94=\"ND\"),$G94,\"!error\"))))","v":""},"",{"$f":"IF(BV89=\"\",\"\",IF(AY89=0,\"NA\",IF(CX89=\"ND\",\"ND\",IF(OR($BN$12=\"!error\",BV89=\"!error\",AND(BV89=\"missing\",ISNUMBER(BX89)),IF(BW89=1,BX89=\"!error\",0),CA89=\"!error\",CB89=\"!error\"),\"!error\",IF(OR(BV89=\"NA\",AND(ISNUMBER($BN$12),$BN$12=0),AND(BW89<>0,ISNUMBER(CC89),CC89=0),AND(BW89=1,ISNUMBER(CB89),CB89>9),AND(BW89>1,ISNUMBER(CB89),OR(CB89<6,CB89>=9.5))),\"NA\",IF(AND(ISNUMBER($BN$12),BW89<>0,IF(BW89=1,ISNUMBER(BX89),1),ISNUMBER(CA89),ISNUMBER(CB89)),CT_Giardia(BW89,$BN$12,CA89,CB89,IF(BW89=1,BX89,)),IF(COUNTIF(BW89,\"<>0\")+COUNT(BX89,BY89,CA89,CB89)=5,\"!error\",\"missing\")))))))","v":""},{"$f":"IF(BV89=\"\",\"\",IF(OR(AY89=0,AND(ISNUMBER($BN$12),$BN$12=0)),\"NA\",IF(CX89=\"ND\",\"ND\",IF(OR(CC89=\"!error\",CD89=\"!error\",CF89=\"!error\"),\"!error\",IF(BV89=\"NA\",\"NA\",IF(CD89=\"NA\",0,IF(AND(ISNUMBER(CC89),ISNUMBER(CD89)),CC89/CD89,IF(AND(BW89=99,CF89=0.5),CF89/$BN$12,\"missing\"))))))))","v":""},{"$f":"IF(BV89=\"\",\"\",IF(AY89=0,\"NA\",IF(CX89=\"ND\",\"ND\",IF(OR(BV89=\"!error\",AND(BV89=\"missing\",ISNUMBER(BX89)),BX89=\"!error\",BZ89=\"!error\",CA89=\"!error\",CB89=\"!error\"),\"!error\",IF(BV89=\"NA\",\"NA\",IF(OR(AND(BW89<>0,ISNUMBER(CC89),CC89=0),AND(BW89=1,ISNUMBER(CB89),CB89>9),AND(BW89>1,ISNUMBER(CB89),OR(CB89<6,CB89>=9.5))),0,IF(AND(ISNUMBER($BN$12),BW89<>0,ISNUMBER(BX89),ISNUMBER(BZ89),ISNUMBER(CA89),ISNUMBER(CB89)),log_Giardia(BW89,$BN$12,CA89,CB89,BX89,BZ89),IF(COUNTIF(BW89,\"<>0\")+COUNT(BX89,BY89,CA89,CB89)=5,\"!error\",\"missing\"))))))))","v":""},{"$f":"IF(BV89=\"\",\"\",IF(AY89=0,\"NA\",IF(CX89=\"ND\",\"ND\",IF(OR($BP$12=\"!error\",BV89=\"!error\",AND(BV89=\"missing\",ISNUMBER(BX89)),CA89=\"!error\",CB89=\"!error\"),\"!error\",IF(OR(BV89=\"NA\",AND(ISNUMBER($BP$12),$BP$12=0),AND(BW89<>0,ISNUMBER(CC89),CC89=0),AND(BW89=1,ISNUMBER(CB89),OR(CB89<5.5,CB89>=10.5)),AND(OR(BW89=2,BW89=4),ISNUMBER(CB89),OR(CB89<6,CB89>=9.5)),AND(BW89=3,ISNUMBER(CB89),OR(CB89<6,CB89>9))),\"NA\",IF(AND(ISNUMBER($BP$12),BW89<>0,ISNUMBER(CA89),ISNUMBER(CB89)),CT_Virus(BW89,$BP$12,CA89,CB89),IF(COUNTIF(BW89,\"<>0\")+COUNT(BX89,BY89,CA89,CB89)=5,\"!error\",\"missing\")))))))","v":""},{"$f":"IF(BV89=\"\",\"\",IF(OR(AY89=0,AND(ISNUMBER($BP$12),$BP$12=0)),\"NA\",IF(CX89=\"ND\",\"ND\",IF(OR(CC89=\"!error\",CG89=\"!error\",CI89=\"!error\"),\"!error\",IF(BV89=\"NA\",\"NA\",IF(CG89=\"NA\",0,IF(AND(ISNUMBER(CC89),ISNUMBER(CG89)),CC89/CG89,IF(AND(BW89=99,CI89=1),CI89/$BP$12,\"missing\"))))))))","v":""},{"$f":"IF(BV89=\"\",\"\",IF(AY89=0,\"NA\",IF(CX89=\"ND\",\"ND\",IF(OR(BV89=\"!error\",AND(BV89=\"missing\",ISNUMBER(BX89)),BX89=\"!error\",BZ89=\"!error\",CA89=\"!error\",CB89=\"!error\"),\"!error\",IF(BV89=\"NA\",\"NA\",IF(OR(AND(BW89<>0,ISNUMBER(CC89),CC89=0),AND(BW89=1,ISNUMBER(CB89),OR(CB89<5.5,CB89>=10.5)),AND(OR(BW89=2,BW89=4),ISNUMBER(CB89),OR(CB89<6,CB89>=9.5)),AND(BW89=3,ISNUMBER(CB89),OR(CB89<6,CB89>9))),0,IF(AND(ISNUMBER($BP$12),BW89<>0,ISNUMBER(BX89),ISNUMBER(BZ89),ISNUMBER(CA89),ISNUMBER(CB89)),Log_Virus(BW89,$BP$12,CA89,CB89,BX89,BZ89),IF(COUNTIF(BW89,\"<>0\")+COUNT(BX89,BY89,CA89,CB89)=5,\"!error\",\"missing\"))))))))","v":""},null,null,null,null,null,null,null,null,null,null,null,null,null,{"$f":"IF(OR(BF89=\"ND\",BG89=\"ND\",BI89=\"ND\",BJ89=\"ND\"),\"ND\",\"data\")","v":"data"},{"$f":"IF(OR(BX89=\"ND\",BY89=\"ND\",CA89=\"ND\",CB89=\"ND\"),\"ND\",\"data\")","v":"data"}]
[null," ",{"$f":"$E$15","v":3},null,null,null,null,{"$f":"IF(BL90=\"!error\",\"!error\",$BK90)","v":"missing"},"missing","missing","missing","missing",null,null,null,null,"",null,null,null,null,null,null,null,null,null,null,null,null,null,null,null,null,null,null,null,null,null,null,null,null,null,null,null,null,null,null,null,null,null,1,{"$f":"IF($BF$14=0,0,IF(COUNTIF(OFFSET($BD88,0,0,MIN($BF$14,5),1),\"<>NA\")+IF($BF$14>5,COUNTIF(OFFSET($BV88,0,0,$BF$14-5,1),\"<>NA\"),0),1,0))","v":1},{"$f":"IF($BF$14=0,0,IF(COUNTIF(OFFSET($BD88,0,0,MIN($BF$14,5),1),\"O3\")+COUNTIF(OFFSET($BD88,0,0,MIN($BF$14,5),1),\"O3 Cell 1\")+IF($BF$14>5,COUNTIF(OFFSET($BV88,0,0,$BF$14-5,1),\"O3\"),0)+IF($BF$14>5,COUNTIF(OFFSET($BV88,0,0,$BF$14-5,1),\"O3 Cell 1\"),0),1,0))","v":0},{"$f":"IF(OR($AY90=0,AND(COUNTA(D90,F90:G90)=0,COUNTIF(E90,0))),\"NA\",IF(COUNTA(D90:G90),IF(BA90,4,5),IF($BF$15=1,IF(BA90,4,IF(AZ90,5,6)),IF(BD90=\"!error\",IF(BA90,4,5),IF(BA90,\"5B\",6)))))","v":5},{"$f":"$BF$11","v":3},{"$f":"IF(AND(IF($BN$4=\"missing\",10,$BN$4)>=3,$AY90<>\"\"),IF(OR($AY90=0,AND($B90=\"NA\",COUNTA($D90,$F90:$G90)=0,COUNTIF($E90,0)),AND($B90=\"NA\",COUNTA($D90:$G90)=0,IF($BF$14=0,0,COUNTIF(OFFSET($BD88,0,0,MIN($BF$14,5),1),\"NA\")+IF($BF$14>5,COUNTIF(OFFSET($BV88,0,0,$BF$14-5,1),\"NA\"),0))=$BF$14),AND($B90=\"NA\",COUNTA($D90:$G90)=0,IF($BF$14<5,COUNTA(OFFSET($D88,$BF$14,0,MIN(5-$BF$14,$BF$15),4))-COUNTIF(OFFSET($E88,$BF$14,0,MIN(5-$BF$14,$BF$15),1),0),0)+IF($BF$14+$BF$15>5,COUNTA(OFFSET($D93,MAX($BF$14-5,0),0,MIN($BF$14+$BF$15-5,$BF$15),4))-COUNTIF(OFFSET($E93,MAX($BF$14-5,0),0,MIN($BF$14+$BF$15-5,$BF$15),1),0),0)),AND($B90=\"NA\",COUNTA($D90:$G90)=0,IF($BF$14<5,COUNTIF(OFFSET($B88,$BF$14,0,MIN(5-$BF$14,$BF$15),1),\"NA\"),0)+IF($BF$14+$BF$15>5,COUNTIF(OFFSET($B93,MAX($BF$14-5,0),0,MIN($BF$14+$BF$15-5,$BF$15),1),\"NA\"),0)<>$BF$15)),\"NA\",IF($B90=\"\",\"missing\",IF(AND($B90<>\"NA\",COUNTA($D90,$F90:$G90)+COUNTIF($E90,\"<>0\")),UPPER($B90),\"!error\"))),\"\")","v":" "},0,"missing","missing",{"$f":"IF(BD90=\"\",\"\",IF(AY90=0,\"NA\",IF(OR($BF$12=\"!error\",$BF$13=\"!error\",BG90=\"!error\"),\"!error\",IF(BD90=\"NA\",\"NA\",IF(AND(ISNUMBER(BG90),BG90=0),0,IF(AND(ISNUMBER($BF$12),ISNUMBER($BF$13),ISNUMBER(BG90)),$BF$13*$BF$12/BG90,IF(BG90=\"ND\",\"ND\",\"missing\")))))))","v":"missing"},"missing","missing","missing",{"$f":"IF(BD90=\"\",\"\",IF(AY90=0,\"NA\",IF(CW90=\"ND\",\"ND\",IF(OR($BN$12=\"!error\",BD90=\"!error\",AND(BD90=\"missing\",ISNUMBER(BF90)),IF(BE90=1,BF90=\"!error\",0),BI90=\"!error\",BJ90=\"!error\"),\"!error\",IF(OR(BD90=\"NA\",AND(ISNUMBER($BN$12),$BN$12=0),AND(BE90<>0,ISNUMBER(BK90),BK90=0),AND(BE90=1,ISNUMBER(BJ90),BJ90>9),AND(BE90=2,ISNUMBER(BJ90),OR(BJ90<6,BJ90>=9.5)),AND(OR(BE90=3,BE90=4),ISNUMBER(BJ90),OR(BJ90<5.5,BJ90>=9.5))),\"NA\",IF(AND(ISNUMBER($BN$12),BE90<>0,IF(BE90=1,ISNUMBER(BF90),1),ISNUMBER(BI90),ISNUMBER(BJ90)),CT_Giardia(BE90,$BN$12,BI90,BJ90,IF(BE90=1,BF90,)),IF(COUNTIF(BE90,\"<>0\")+COUNT(BF90,BG90,BI90,BJ90)=5,\"!error\",\"missing\")))))))","v":"missing"},{"$f":"IF(BD90=\"\",\"\",IF(OR(AY90=0,AND(ISNUMBER($BN$12),$BN$12=0)),\"NA\",IF(CW90=\"ND\",\"ND\",IF(OR(BK90=\"!error\",BL90=\"!error\",BN90=\"!error\"),\"!error\",IF(BD90=\"NA\",\"NA\",IF(BL90=\"NA\",0,IF(AND(BE90<>99,ISNUMBER(BK90),ISNUMBER(BL90)),BK90/BL90,IF(AND(BE90=99,BN90=0.5),BN90/$BN$12,\"missing\"))))))))","v":"missing"},{"$f":"IF(BD90=\"\",\"\",IF(AY90=0,\"NA\",IF(CW90=\"ND\",\"ND\",IF(OR(BD90=\"!error\",AND(BD90=\"missing\",ISNUMBER(BF90)),BF90=\"!error\",BH90=\"!error\",BI90=\"!error\",BJ90=\"!error\"),\"!error\",IF(BD90=\"NA\",\"NA\",IF(OR(AND(BE90<>0,ISNUMBER(BK90),BK90=0),AND(BE90=1,ISNUMBER(BJ90),BJ90>9),AND(BE90=2,ISNUMBER(BJ90),OR(BJ90<6,BJ90>=9.5)),AND(OR(BE90=3,BE90=4),ISNUMBER(BJ90),OR(BJ90<5.5,BJ90>=9.5))),0,IF(AND(ISNUMBER($BN$12),BE90<>0,ISNUMBER(BF90),ISNUMBER(BH90),ISNUMBER(BI90),ISNUMBER(BJ90)),log_Giardia(BE90,$BN$12,BI90,BJ90,BF90,BH90),IF(COUNTIF(BE90,\"<>0\")+COUNT(BF90,BG90,BI90,BJ90)=5,\"!error\",\"missing\"))))))))","v":"missing"},{"$f":"IF(BD90=\"\",\"\",IF(AY90=0,\"NA\",IF(CW90=\"ND\",\"ND\",IF(OR($BP$12=\"!error\",BD90=\"!error\",AND(BD90=\"missing\",ISNUMBER(BF90)),BI90=\"!error\",BJ90=\"!error\"),\"!error\",IF(OR(BD90=\"NA\",AND(ISNUMBER($BP$12),$BP$12=0),AND(BE90<>0,ISNUMBER(BK90),BK90=0),AND(BE90=1,ISNUMBER(BJ90),BJ90>=10.5),AND(BE90=2,ISNUMBER(BJ90),OR(BJ90<6,BJ90>=9.5)),AND(BE90=3,ISNUMBER(BJ90),OR(BJ90<6,BJ90>9)),AND(BE90=4,ISNUMBER(BJ90),OR(BJ90<6,BJ90>10))),\"NA\",IF(AND(ISNUMBER($BP$12),BE90<>0,ISNUMBER(BI90),ISNUMBER(BJ90)),CT_Virus(BE90,$BP$12,BI90,BJ90),IF(COUNTIF(BE90,\"<>0\")+COUNT(BF90,BG90,BI90,BJ90)=5,\"!error\",\"missing\")))))))","v":"missing"},{"$f":"IF(BD90=\"\",\"\",IF(OR(AY90=0,AND(ISNUMBER($BP$12),$BP$12=0)),\"NA\",IF(CW90=\"ND\",\"ND\",IF(OR(BK90=\"!error\",BO90=\"!error\",BQ90=\"!error\"),\"!error\",IF(BD90=\"NA\",\"NA\",IF(BO90=\"NA\",0,IF(AND(BE90<>99,ISNUMBER(BK90),ISNUMBER(BO90)),BK90/BO90,IF(AND(BE90=99,BQ90=1),BQ90/$BP$12,\"missing\"))))))))","v":"missing"},{"$f":"IF(BD90=\"\",\"\",IF(AY90=0,\"NA\",IF(CW90=\"ND\",\"ND\",IF(OR(BD90=\"!error\",AND(BD90=\"missing\",ISNUMBER(BF90)),BF90=\"!error\",BH90=\"!error\",BI90=\"!error\",BJ90=\"!error\"),\"!error\",IF(BD90=\"NA\",\"NA\",IF(OR(AND(BE90<>0,ISNUMBER(BK90),BK90=0),AND(BE90=1,ISNUMBER(BJ90),BJ90>=10.5),AND(BE90=2,ISNUMBER(BJ90),OR(BJ90<6,BJ90>=9.5)),AND(BE90=3,ISNUMBER(BJ90),OR(BJ90<6,BJ90>9)),AND(BE90=4,ISNUMBER(BJ90),OR(BJ90<6,BJ90>10))),0,IF(AND(ISNUMBER($BP$12),BE90<>0,ISNUMBER(BF90),ISNUMBER(BH90),ISNUMBER(BI90),ISNUMBER(BJ90)),Log_Virus(BE90,$BP$12,BI90,BJ90,BF90,BH90),IF(COUNTIF(BE90,\"<>0\")+COUNT(BF90,BG90,BI90,BJ90)=5,\"!error\",\"missing\"))))))))","v":"missing"},{"$f":"IF($BK$14=0,0,IF(COUNTIF(OFFSET($BD88,0,0,MIN($BK$14,5),1),\"<>NA\")+IF($BK$14>5,COUNTIF(OFFSET($BV88,0,0,$BK$14-5,1),\"<>NA\"),0),1,0))","v":1},{"$f":"IF($BK$14=0,0,IF(COUNTIF(OFFSET($BD88,0,0,MIN($BK$14,5),1),\"O3\")+COUNTIF(OFFSET($BD88,0,0,MIN($BK$14,5),1),\"O3 Cell 1\")+IF($BK$14>5,COUNTIF(OFFSET($BV88,0,0,$BK$14-5,1),\"O3\"),0)+IF($BK$14>5,COUNTIF(OFFSET($BV88,0,0,$BK$14-5,1),\"O3 Cell 1\"),0),1,0))","v":0},{"$f":"IF(OR($AY90=0,AND(COUNTA(D95,F95:G95)=0,COUNTIF(E95,0))),\"NA\",IF(COUNTA(D95:G95),IF(BS90,4,5),IF($BK$15=1,IF(BS90,4,IF(BR90,5,6)),IF(BV90=\"!error\",IF(BS90,4,5),IF(BS90,\"5B\",6)))))","v":6},{"$f":"$BK$11","v":8},{"$f":"IF(AND(IF($BN$4=\"missing\",10,$BN$4)>=8,$AY90<>\"\"),IF(OR($AY90=0,AND($B95=\"NA\",COUNTA($D95,$F95:$G95)=0,COUNTIF($E95,0)),AND($B95=\"NA\",COUNTA($D95:$G95)=0,IF($BK$14=0,0,COUNTIF(OFFSET($BD88,0,0,MIN($BK$14,5),1),\"NA\")+IF($BK$14>5,COUNTIF(OFFSET($BV88,0,0,$BK$14-5,1),\"NA\"),0))=$BK$14),AND($B95=\"NA\",COUNTA($D95:$G95)=0,IF($BK$14<5,COUNTA(OFFSET($D88,$BK$14,0,MIN(5-$BK$14,$BK$15),4))-COUNTIF(OFFSET($E88,$BK$14,0,MIN(5-$BK$14,$BK$15),1),0),0)+IF($BK$14+$BK$15>5,COUNTA(OFFSET($D93,MAX($BK$14-5,0),0,MIN($BK$14+$BK$15-5,$BK$15),4))-COUNTIF(OFFSET($E93,MAX($BK$14-5,0),0,MIN($BK$14+$BK$15-5,$BK$15),1),0),0)),AND($B95=\"NA\",COUNTA($D95:$G95)=0,IF($BK$14<5,COUNTIF(OFFSET($B88,$BK$14,0,MIN(5-$BK$14,$BK$15),1),\"NA\"),0)+IF($BK$14+$BK$15>5,COUNTIF(OFFSET($B93,MAX($BK$14-5,0),0,MIN($BK$14+$BK$15-5,$BK$15),1),\"NA\"),0)<>$BK$15)),\"NA\",IF($B95=\"\",\"missing\",IF(AND($B95<>\"NA\",COUNTA($D95,$F95:$G95)+COUNTIF($E95,\"<>0\")),UPPER($B95),\"!error\"))),\"\")","v":""},"",{"$f":"IF(BV90=\"\",\"\",IF(BV90=\"NA\",\"NA\",IF(ISBLANK($D95),\"missing\",IF(AND(BW90=1,ISNUMBER($D95),$D95>4),4,IF(AND(ISNUMBER($D95),$D95>=0),$D95,IF(AND(ISTEXT($D95),$D95=\"ND\"),\"ND\",\"!error\"))))))","v":""},{"$f":"IF(BV90=\"\",\"\",IF(BV90=\"NA\",\"NA\",IF(ISBLANK($E95),\"missing\",IF(OR(AND(ISBLANK($B95),COUNT(BX90,CA90:CB90)=0,ISNUMBER($E95),$E95=0),AND(ISNUMBER($E95),$E95>0),AND(ISTEXT($E95),$E95=\"ND\")),$E95,\"!error\"))))","v":""},{"$f":"IF(BV90=\"\",\"\",IF(AY90=0,\"NA\",IF(OR($BK$12=\"!error\",$BK$13=\"!error\",BY90=\"!error\"),\"!error\",IF(BV90=\"NA\",\"NA\",IF(AND(ISNUMBER(BY90),BY90=0),0,IF(AND(ISNUMBER($BK$12),ISNUMBER($BK$13),ISNUMBER(BY90)),$BK$13*$BK$12/BY90,IF(BY90=\"ND\",\"ND\",\"missing\")))))))","v":""},{"$f":"IF(BV90=\"\",\"\",IF(BV90=\"NA\",\"NA\",IF(ISBLANK($F95),\"missing\",IF(OR(ISNUMBER($F95),$F95=\"ND\"),$F95,\"!error\"))))","v":""},{"$f":"IF(BV90=\"\",\"\",IF(BV90=\"NA\",\"NA\",IF(ISBLANK($G95),\"missing\",IF(OR(AND(ISNUMBER($G95),$G95>=0,$G95<=14),$G95=\"ND\"),$G95,\"!error\"))))","v":""},"",{"$f":"IF(BV90=\"\",\"\",IF(AY90=0,\"NA\",IF(CX90=\"ND\",\"ND\",IF(OR($BN$12=\"!error\",BV90=\"!error\",AND(BV90=\"missing\",ISNUMBER(BX90)),IF(BW90=1,BX90=\"!error\",0),CA90=\"!error\",CB90=\"!error\"),\"!error\",IF(OR(BV90=\"NA\",AND(ISNUMBER($BN$12),$BN$12=0),AND(BW90<>0,ISNUMBER(CC90),CC90=0),AND(BW90=1,ISNUMBER(CB90),CB90>9),AND(BW90>1,ISNUMBER(CB90),OR(CB90<6,CB90>=9.5))),\"NA\",IF(AND(ISNUMBER($BN$12),BW90<>0,IF(BW90=1,ISNUMBER(BX90),1),ISNUMBER(CA90),ISNUMBER(CB90)),CT_Giardia(BW90,$BN$12,CA90,CB90,IF(BW90=1,BX90,)),IF(COUNTIF(BW90,\"<>0\")+COUNT(BX90,BY90,CA90,CB90)=5,\"!error\",\"missing\")))))))","v":""},{"$f":"IF(BV90=\"\",\"\",IF(OR(AY90=0,AND(ISNUMBER($BN$12),$BN$12=0)),\"NA\",IF(CX90=\"ND\",\"ND\",IF(OR(CC90=\"!error\",CD90=\"!error\",CF90=\"!error\"),\"!error\",IF(BV90=\"NA\",\"NA\",IF(CD90=\"NA\",0,IF(AND(ISNUMBER(CC90),ISNUMBER(CD90)),CC90/CD90,IF(AND(BW90=99,CF90=0.5),CF90/$BN$12,\"missing\"))))))))","v":""},{"$f":"IF(BV90=\"\",\"\",IF(AY90=0,\"NA\",IF(CX90=\"ND\",\"ND\",IF(OR(BV90=\"!error\",AND(BV90=\"missing\",ISNUMBER(BX90)),BX90=\"!error\",BZ90=\"!error\",CA90=\"!error\",CB90=\"!error\"),\"!error\",IF(BV90=\"NA\",\"NA\",IF(OR(AND(BW90<>0,ISNUMBER(CC90),CC90=0),AND(BW90=1,ISNUMBER(CB90),CB90>9),AND(BW90>1,ISNUMBER(CB90),OR(CB90<6,CB90>=9.5))),0,IF(AND(ISNUMBER($BN$12),BW90<>0,ISNUMBER(BX90),ISNUMBER(BZ90),ISNUMBER(CA90),ISNUMBER(CB90)),log_Giardia(BW90,$BN$12,CA90,CB90,BX90,BZ90),IF(COUNTIF(BW90,\"<>0\")+COUNT(BX90,BY90,CA90,CB90)=5,\"!error\",\"missing\"))))))))","v":""},{"$f":"IF(BV90=\"\",\"\",IF(AY90=0,\"NA\",IF(CX90=\"ND\",\"ND\",IF(OR($BP$12=\"!error\",BV90=\"!error\",AND(BV90=\"missing\",ISNUMBER(BX90)),CA90=\"!error\",CB90=\"!error\"),\"!error\",IF(OR(BV90=\"NA\",AND(ISNUMBER($BP$12),$BP$12=0),AND(BW90<>0,ISNUMBER(CC90),CC90=0),AND(BW90=1,ISNUMBER(CB90),OR(CB90<5.5,CB90>=10.5)),AND(OR(BW90=2,BW90=4),ISNUMBER(CB90),OR(CB90<6,CB90>=9.5)),AND(BW90=3,ISNUMBER(CB90),OR(CB90<6,CB90>9))),\"NA\",IF(AND(ISNUMBER($BP$12),BW90<>0,ISNUMBER(CA90),ISNUMBER(CB90)),CT_Virus(BW90,$BP$12,CA90,CB90),IF(COUNTIF(BW90,\"<>0\")+COUNT(BX90,BY90,CA90,CB90)=5,\"!error\",\"missing\")))))))","v":""},{"$f":"IF(BV90=\"\",\"\",IF(OR(AY90=0,AND(ISNUMBER($BP$12),$BP$12=0)),\"NA\",IF(CX90=\"ND\",\"ND\",IF(OR(CC90=\"!error\",CG90=\"!error\",CI90=\"!error\"),\"!error\",IF(BV90=\"NA\",\"NA\",IF(CG90=\"NA\",0,IF(AND(ISNUMBER(CC90),ISNUMBER(CG90)),CC90/CG90,IF(AND(BW90=99,CI90=1),CI90/$BP$12,\"missing\"))))))))","v":""},{"$f":"IF(BV90=\"\",\"\",IF(AY90=0,\"NA\",IF(CX90=\"ND\",\"ND\",IF(OR(BV90=\"!error\",AND(BV90=\"missing\",ISNUMBER(BX90)),BX90=\"!error\",BZ90=\"!error\",CA90=\"!error\",CB90=\"!error\"),\"!error\",IF(BV90=\"NA\",\"NA\",IF(OR(AND(BW90<>0,ISNUMBER(CC90),CC90=0),AND(BW90=1,ISNUMBER(CB90),OR(CB90<5.5,CB90>=10.5)),AND(OR(BW90=2,BW90=4),ISNUMBER(CB90),OR(CB90<6,CB90>=9.5)),AND(BW90=3,ISNUMBER(CB90),OR(CB90<6,CB90>9))),0,IF(AND(ISNUMBER($BP$12),BW90<>0,ISNUMBER(BX90),ISNUMBER(BZ90),ISNUMBER(CA90),ISNUMBER(CB90)),Log_Virus(BW90,$BP$12,CA90,CB90,BX90,BZ90),IF(COUNTIF(BW90,\"<>0\")+COUNT(BX90,BY90,CA90,CB90)=5,\"!error\",\"missing\"))))))))","v":""},null,null,null,null,null,null,null,null,null,null,null,null,null,"data","data"]
[null," ",{"$f":"$F$15","v":4},null,null,null,null,{"$f":"IF(BL91=\"!error\",\"!error\",$BK91)","v":""},"","","","",null,null,null,null,"",null,null,null,null,null,null,null,null,null,null,null,null,null,null,null,null,null,null,null,null,null,null,null,null,null,null,null,null,null,null,null,null,null,1,{"$f":"IF($BG$14=0,0,IF(COUNTIF(OFFSET($BD88,0,0,MIN($BG$14,5),1),\"<>NA\")+IF($BG$14>5,COUNTIF(OFFSET($BV88,0,0,$BG$14-5,1),\"<>NA\"),0),1,0))","v":1},{"$f":"IF($BG$14=0,0,IF(COUNTIF(OFFSET($BD88,0,0,MIN($BG$14,5),1),\"O3\")+COUNTIF(OFFSET($BD88,0,0,MIN($BG$14,5),1),\"O3 Cell 1\")+IF($BG$14>5,COUNTIF(OFFSET($BV88,0,0,$BG$14-5,1),\"O3\"),0)+IF($BG$14>5,COUNTIF(OFFSET($BV88,0,0,$BG$14-5,1),\"O3 Cell 1\"),0),1,0))","v":0},{"$f":"IF(OR($AY91=0,AND(COUNTA(D91,F91:G91)=0,COUNTIF(E91,0))),\"NA\",IF(COUNTA(D91:G91),IF(BA91,4,5),IF($BG$15=1,IF(BA91,4,IF(AZ91,5,6)),IF(BD91=\"!error\",IF(BA91,4,5),IF(BA91,\"5B\",6)))))","v":6},{"$f":"$BG$11","v":4},{"$f":"IF(AND(IF($BN$4=\"missing\",10,$BN$4)>=4,$AY91<>\"\"),IF(OR($AY91=0,AND($B91=\"NA\",COUNTA($D91,$F91:$G91)=0,COUNTIF($E91,0)),AND($B91=\"NA\",COUNTA($D91:$G91)=0,IF($BG$14=0,0,COUNTIF(OFFSET($BD88,0,0,MIN($BG$14,5),1),\"NA\")+IF($BG$14>5,COUNTIF(OFFSET($BV88,0,0,$BG$14-5,1),\"NA\"),0))=$BG$14),AND($B91=\"NA\",COUNTA($D91:$G91)=0,IF($BG$14<5,COUNTA(OFFSET($D88,$BG$14,0,MIN(5-$BG$14,$BG$15),4))-COUNTIF(OFFSET($E88,$BG$14,0,MIN(5-$BG$14,$BG$15),1),0),0)+IF($BG$14+$BG$15>5,COUNTA(OFFSET($D93,MAX($BG$14-5,0),0,MIN($BG$14+$BG$15-5,$BG$15),4))-COUNTIF(OFFSET($E93,MAX($BG$14-5,0),0,MIN($BG$14+$BG$15-5,$BG$15),1),0),0)),AND($B91=\"NA\",COUNTA($D91:$G91)=0,IF($BG$14<5,COUNTIF(OFFSET($B88,$BG$14,0,MIN(5-$BG$14,$BG$15),1),\"NA\"),0)+IF($BG$14+$BG$15>5,COUNTIF(OFFSET($B93,MAX($BG$14-5,0),0,MIN($BG$14+$BG$15-5,$BG$15),1),\"NA\"),0)<>$BG$15)),\"NA\",IF($B91=\"\",\"missing\",IF(AND($B91<>\"NA\",COUNTA($D91,$F91:$G91)+COUNTIF($E91,\"<>0\")),UPPER($B91),\"!error\"))),\"\")","v":""},"","","",{"$f":"IF(BD91=\"\",\"\",IF(AY91=0,\"NA\",IF(OR($BG$12=\"!error\",$BG$13=\"!error\",BG91=\"!error\"),\"!error\",IF(BD91=\"NA\",\"NA\",IF(AND(ISNUMBER(BG91),BG91=0),0,IF(AND(ISNUMBER($BG$12),ISNUMBER($BG$13),ISNUMBER(BG91)),$BG$13*$BG$12/BG91,IF(BG91=\"ND\",\"ND\",\"missing\")))))))","v":""},"","","",{"$f":"IF(BD91=\"\",\"\",IF(AY91=0,\"NA\",IF(CW91=\"ND\",\"ND\",IF(OR($BN$12=\"!error\",BD91=\"!error\",AND(BD91=\"missing\",ISNUMBER(BF91)),IF(BE91=1,BF91=\"!error\",0),BI91=\"!error\",BJ91=\"!error\"),\"!error\",IF(OR(BD91=\"NA\",AND(ISNUMBER($BN$12),$BN$12=0),AND(BE91<>0,ISNUMBER(BK91),BK91=0),AND(BE91=1,ISNUMBER(BJ91),BJ91>9),AND(BE91=2,ISNUMBER(BJ91),OR(BJ91<6,BJ91>=9.5)),AND(OR(BE91=3,BE91=4),ISNUMBER(BJ91),OR(BJ91<5.5,BJ91>=9.5))),\"NA\",IF(AND(ISNUMBER($BN$12),BE91<>0,IF(BE91=1,ISNUMBER(BF91),1),ISNUMBER(BI91),ISNUMBER(BJ91)),CT_Giardia(BE91,$BN$12,BI91,BJ91,IF(BE91=1,BF91,)),IF(COUNTIF(BE91,\"<>0\")+COUNT(BF91,BG91,BI91,BJ91)=5,\"!error\",\"missing\")))))))","v":""},{"$f":"IF(BD91=\"\",\"\",IF(OR(AY91=0,AND(ISNUMBER($BN$12),$BN$12=0)),\"NA\",IF(CW91=\"ND\",\"ND\",IF(OR(BK91=\"!error\",BL91=\"!error\",BN91=\"!error\"),\"!error\",IF(BD91=\"NA\",\"NA\",IF(BL91=\"NA\",0,IF(AND(BE91<>99,ISNUMBER(BK91),ISNUMBER(BL91)),BK91/BL91,IF(AND(BE91=99,BN91=0.5),BN91/$BN$12,\"missing\"))))))))","v":""},{"$f":"IF(BD91=\"\",\"\",IF(AY91=0,\"NA\",IF(CW91=\"ND\",\"ND\",IF(OR(BD91=\"!error\",AND(BD91=\"missing\",ISNUMBER(BF91)),BF91=\"!error\",BH91=\"!error\",BI91=\"!error\",BJ91=\"!error\"),\"!error\",IF(BD91=\"NA\",\"NA\",IF(OR(AND(BE91<>0,ISNUMBER(BK91),BK91=0),AND(BE91=1,ISNUMBER(BJ91),BJ91>9),AND(BE91=2,ISNUMBER(BJ91),OR(BJ91<6,BJ91>=9.5)),AND(OR(BE91=3,BE91=4),ISNUMBER(BJ91),OR(BJ91<5.5,BJ91>=9.5))),0,IF(AND(ISNUMBER($BN$12),BE91<>0,ISNUMBER(BF91),ISNUMBER(BH91),ISNUMBER(BI91),ISNUMBER(BJ91)),log_Giardia(BE91,$BN$12,BI91,BJ91,BF91,BH91),IF(COUNTIF(BE91,\"<>0\")+COUNT(BF91,BG91,BI91,BJ91)=5,\"!error\",\"missing\"))))))))","v":""},{"$f":"IF(BD91=\"\",\"\",IF(AY91=0,\"NA\",IF(CW91=\"ND\",\"ND\",IF(OR($BP$12=\"!error\",BD91=\"!error\",AND(BD91=\"missing\",ISNUMBER(BF91)),BI91=\"!error\",BJ91=\"!error\"),\"!error\",IF(OR(BD91=\"NA\",AND(ISNUMBER($BP$12),$BP$12=0),AND(BE91<>0,ISNUMBER(BK91),BK91=0),AND(BE91=1,ISNUMBER(BJ91),BJ91>=10.5),AND(BE91=2,ISNUMBER(BJ91),OR(BJ91<6,BJ91>=9.5)),AND(BE91=3,ISNUMBER(BJ91),OR(BJ91<6,BJ91>9)),AND(BE91=4,ISNUMBER(BJ91),OR(BJ91<6,BJ91>10))),\"NA\",IF(AND(ISNUMBER($BP$12),BE91<>0,ISNUMBER(BI91),ISNUMBER(BJ91)),CT_Virus(BE91,$BP$12,BI91,BJ91),IF(COUNTIF(BE91,\"<>0\")+COUNT(BF91,BG91,BI91,BJ91)=5,\"!error\",\"missing\")))))))","v":""},{"$f":"IF(BD91=\"\",\"\",IF(OR(AY91=0,AND(ISNUMBER($BP$12),$BP$12=0)),\"NA\",IF(CW91=\"ND\",\"ND\",IF(OR(BK91=\"!error\",BO91=\"!error\",BQ91=\"!error\"),\"!error\",IF(BD91=\"NA\",\"NA\",IF(BO91=\"NA\",0,IF(AND(BE91<>99,ISNUMBER(BK91),ISNUMBER(BO91)),BK91/BO91,IF(AND(BE91=99,BQ91=1),BQ91/$BP$12,\"missing\"))))))))","v":""},{"$f":"IF(BD91=\"\",\"\",IF(AY91=0,\"NA\",IF(CW91=\"ND\",\"ND\",IF(OR(BD91=\"!error\",AND(BD91=\"missing\",ISNUMBER(BF91)),BF91=\"!error\",BH91=\"!error\",BI91=\"!error\",BJ91=\"!error\"),\"!error\",IF(BD91=\"NA\",\"NA\",IF(OR(AND(BE91<>0,ISNUMBER(BK91),BK91=0),AND(BE91=1,ISNUMBER(BJ91),BJ91>=10.5),AND(BE91=2,ISNUMBER(BJ91),OR(BJ91<6,BJ91>=9.5)),AND(BE91=3,ISNUMBER(BJ91),OR(BJ91<6,BJ91>9)),AND(BE91=4,ISNUMBER(BJ91),OR(BJ91<6,BJ91>10))),0,IF(AND(ISNUMBER($BP$12),BE91<>0,ISNUMBER(BF91),ISNUMBER(BH91),ISNUMBER(BI91),ISNUMBER(BJ91)),Log_Virus(BE91,$BP$12,BI91,BJ91,BF91,BH91),IF(COUNTIF(BE91,\"<>0\")+COUNT(BF91,BG91,BI91,BJ91)=5,\"!error\",\"missing\"))))))))","v":""},{"$f":"IF($BL$14=0,0,IF(COUNTIF(OFFSET($BD88,0,0,MIN($BL$14,5),1),\"<>NA\")+IF($BL$14>5,COUNTIF(OFFSET($BV88,0,0,$BL$14-5,1),\"<>NA\"),0),1,0))","v":1},{"$f":"IF($BL$14=0,0,IF(COUNTIF(OFFSET($BD88,0,0,MIN($BL$14,5),1),\"O3\")+COUNTIF(OFFSET($BD88,0,0,MIN($BL$14,5),1),\"O3 Cell 1\")+IF($BL$14>5,COUNTIF(OFFSET($BV88,0,0,$BL$14-5,1),\"O3\"),0)+IF($BL$14>5,COUNTIF(OFFSET($BV88,0,0,$BL$14-5,1),\"O3 Cell 1\"),0),1,0))","v":0},{"$f":"IF(OR($AY91=0,AND(COUNTA(D96,F96:G96)=0,COUNTIF(E96,0))),\"NA\",IF(COUNTA(D96:G96),IF(BS91,4,5),IF($BL$15=1,IF(BS91,4,IF(BR91,5,6)),IF(BV91=\"!error\",IF(BS91,4,5),IF(BS91,\"5B\",6)))))","v":6},{"$f":"$BL$11","v":9},{"$f":"IF(AND(IF($BN$4=\"missing\",10,$BN$4)>=9,$AY91<>\"\"),IF(OR($AY91=0,AND($B96=\"NA\",COUNTA($D96,$F96:$G96)=0,COUNTIF($E96,0)),AND($B96=\"NA\",COUNTA($D96:$G96)=0,IF($BL$14=0,0,COUNTIF(OFFSET($BD88,0,0,MIN($BL$14,5),1),\"NA\")+IF($BL$14>5,COUNTIF(OFFSET($BV88,0,0,$BL$14-5,1),\"NA\"),0))=$BL$14),AND($B96=\"NA\",COUNTA($D96:$G96)=0,IF($BL$14<5,COUNTA(OFFSET($D88,$BL$14,0,MIN(5-$BL$14,$BL$15),4))-COUNTIF(OFFSET($E88,$BL$14,0,MIN(5-$BL$14,$BL$15),1),0),0)+IF($BL$14+$BL$15>5,COUNTA(OFFSET($D93,MAX($BL$14-5,0),0,MIN($BL$14+$BL$15-5,$BL$15),4))-COUNTIF(OFFSET($E93,MAX($BL$14-5,0),0,MIN($BL$14+$BL$15-5,$BL$15),1),0),0)),AND($B96=\"NA\",COUNTA($D96:$G96)=0,IF($BL$14<5,COUNTIF(OFFSET($B88,$BL$14,0,MIN(5-$BL$14,$BL$15),1),\"NA\"),0)+IF($BL$14+$BL$15>5,COUNTIF(OFFSET($B93,MAX($BL$14-5,0),0,MIN($BL$14+$BL$15-5,$BL$15),1),\"NA\"),0)<>$BL$15)),\"NA\",IF($B96=\"\",\"missing\",IF(AND($B96<>\"NA\",COUNTA($D96,$F96:$G96)+COUNTIF($E96,\"<>0\")),UPPER($B96),\"!error\"))),\"\")","v":""},"",{"$f":"IF(BV91=\"\",\"\",IF(BV91=\"NA\",\"NA\",IF(ISBLANK($D96),\"missing\",IF(AND(BW91=1,ISNUMBER($D96),$D96>4),4,IF(AND(ISNUMBER($D96),$D96>=0),$D96,IF(AND(ISTEXT($D96),$D96=\"ND\"),\"ND\",\"!error\"))))))","v":""},{"$f":"IF(BV91=\"\",\"\",IF(BV91=\"NA\",\"NA\",IF(ISBLANK($E96),\"missing\",IF(OR(AND(ISBLANK($B96),COUNT(BX91,CA91:CB91)=0,ISNUMBER($E96),$E96=0),AND(ISNUMBER($E96),$E96>0),AND(ISTEXT($E96),$E96=\"ND\")),$E96,\"!error\"))))","v":""},{"$f":"IF(BV91=\"\",\"\",IF(AY91=0,\"NA\",IF(OR($BL$12=\"!error\",$BL$13=\"!error\",BY91=\"!error\"),\"!error\",IF(BV91=\"NA\",\"NA\",IF(AND(ISNUMBER(BY91),BY91=0),0,IF(AND(ISNUMBER($BL$12),ISNUMBER($BL$13),ISNUMBER(BY91)),$BL$13*$BL$12/BY91,IF(BY91=\"ND\",\"ND\",\"missing\")))))))","v":""},{"$f":"IF(BV91=\"\",\"\",IF(BV91=\"NA\",\"NA\",IF(ISBLANK($F96),\"missing\",IF(OR(ISNUMBER($F96),$F96=\"ND\"),$F96,\"!error\"))))","v":""},{"$f":"IF(BV91=\"\",\"\",IF(BV91=\"NA\",\"NA\",IF(ISBLANK($G96),\"missing\",IF(OR(AND(ISNUMBER($G96),$G96>=0,$G96<=14),$G96=\"ND\"),$G96,\"!error\"))))","v":""},"",{"$f":"IF(BV91=\"\",\"\",IF(AY91=0,\"NA\",IF(CX91=\"ND\",\"ND\",IF(OR($BN$12=\"!error\",BV91=\"!error\",AND(BV91=\"missing\",ISNUMBER(BX91)),IF(BW91=1,BX91=\"!error\",0),CA91=\"!error\",CB91=\"!error\"),\"!error\",IF(OR(BV91=\"NA\",AND(ISNUMBER($BN$12),$BN$12=0),AND(BW91<>0,ISNUMBER(CC91),CC91=0),AND(BW91=1,ISNUMBER(CB91),CB91>9),AND(BW91>1,ISNUMBER(CB91),OR(CB91<6,CB91>=9.5))),\"NA\",IF(AND(ISNUMBER($BN$12),BW91<>0,IF(BW91=1,ISNUMBER(BX91),1),ISNUMBER(CA91),ISNUMBER(CB91)),CT_Giardia(BW91,$BN$12,CA91,CB91,IF(BW91=1,BX91,)),IF(COUNTIF(BW91,\"<>0\")+COUNT(BX91,BY91,CA91,CB91)=5,\"!error\",\"missing\")))))))","v":""},{"$f":"IF(BV91=\"\",\"\",IF(OR(AY91=0,AND(ISNUMBER($BN$12),$BN$12=0)),\"NA\",IF(CX91=\"ND\",\"ND\",IF(OR(CC91=\"!error\",CD91=\"!error\",CF91=\"!error\"),\"!error\",IF(BV91=\"NA\",\"NA\",IF(CD91=\"NA\",0,IF(AND(ISNUMBER(CC91),ISNUMBER(CD91)),CC91/CD91,IF(AND(BW91=99,CF91=0.5),CF91/$BN$12,\"missing\"))))))))","v":""},{"$f":"IF(BV91=\"\",\"\",IF(AY91=0,\"NA\",IF(CX91=\"ND\",\"ND\",IF(OR(BV91=\"!error\",AND(BV91=\"missing\",ISNUMBER(BX91)),BX91=\"!error\",BZ91=\"!error\",CA91=\"!error\",CB91=\"!error\"),\"!error\",IF(BV91=\"NA\",\"NA\",IF(OR(AND(BW91<>0,ISNUMBER(CC91),CC91=0),AND(BW91=1,ISNUMBER(CB91),CB91>9),AND(BW91>1,ISNUMBER(CB91),OR(CB91<6,CB91>=9.5))),0,IF(AND(ISNUMBER($BN$12),BW91<>0,ISNUMBER(BX91),ISNUMBER(BZ91),ISNUMBER(CA91),ISNUMBER(CB91)),log_Giardia(BW91,$BN$12,CA91,CB91,BX91,BZ91),IF(COUNTIF(BW91,\"<>0\")+COUNT(BX91,BY91,CA91,CB91)=5,\"!error\",\"missing\"))))))))","v":""},{"$f":"IF(BV91=\"\",\"\",IF(AY91=0,\"NA\",IF(CX91=\"ND\",\"ND\",IF(OR($BP$12=\"!error\",BV91=\"!error\",AND(BV91=\"missing\",ISNUMBER(BX91)),CA91=\"!error\",CB91=\"!error\"),\"!error\",IF(OR(BV91=\"NA\",AND(ISNUMBER($BP$12),$BP$12=0),AND(BW91<>0,ISNUMBER(CC91),CC91=0),AND(BW91=1,ISNUMBER(CB91),OR(CB91<5.5,CB91>=10.5)),AND(OR(BW91=2,BW91=4),ISNUMBER(CB91),OR(CB91<6,CB91>=9.5)),AND(BW91=3,ISNUMBER(CB91),OR(CB91<6,CB91>9))),\"NA\",IF(AND(ISNUMBER($BP$12),BW91<>0,ISNUMBER(CA91),ISNUMBER(CB91)),CT_Virus(BW91,$BP$12,CA91,CB91),IF(COUNTIF(BW91,\"<>0\")+COUNT(BX91,BY91,CA91,CB91)=5,\"!error\",\"missing\")))))))","v":""},{"$f":"IF(BV91=\"\",\"\",IF(OR(AY91=0,AND(ISNUMBER($BP$12),$BP$12=0)),\"NA\",IF(CX91=\"ND\",\"ND\",IF(OR(CC91=\"!error\",CG91=\"!error\",CI91=\"!error\"),\"!error\",IF(BV91=\"NA\",\"NA\",IF(CG91=\"NA\",0,IF(AND(ISNUMBER(CC91),ISNUMBER(CG91)),CC91/CG91,IF(AND(BW91=99,CI91=1),CI91/$BP$12,\"missing\"))))))))","v":""},{"$f":"IF(BV91=\"\",\"\",IF(AY91=0,\"NA\",IF(CX91=\"ND\",\"ND\",IF(OR(BV91=\"!error\",AND(BV91=\"missing\",ISNUMBER(BX91)),BX91=\"!error\",BZ91=\"!error\",CA91=\"!error\",CB91=\"!error\"),\"!error\",IF(BV91=\"NA\",\"NA\",IF(OR(AND(BW91<>0,ISNUMBER(CC91),CC91=0),AND(BW91=1,ISNUMBER(CB91),OR(CB91<5.5,CB91>=10.5)),AND(OR(BW91=2,BW91=4),ISNUMBER(CB91),OR(CB91<6,CB91>=9.5)),AND(BW91=3,ISNUMBER(CB91),OR(CB91<6,CB91>9))),0,IF(AND(ISNUMBER($BP$12),BW91<>0,ISNUMBER(BX91),ISNUMBER(BZ91),ISNUMBER(CA91),ISNUMBER(CB91)),Log_Virus(BW91,$BP$12,CA91,CB91,BX91,BZ91),IF(COUNTIF(BW91,\"<>0\")+COUNT(BX91,BY91,CA91,CB91)=5,\"!error\",\"missing\"))))))))","v":""},null,null,null,null,null,null,null,null,null,null,null,null,null,"data","data"]
[null," ",{"$f":"$G$15","v":5},null,null,null,null,"","","","","",null,null,null,null,"",null,null,null,null,null,null,null,null,null,null,null,null,null,null,null,null,null,null,null,null,null,null,null,null,null,null,null,null,null,null,null,null,null,1,{"$f":"IF($BH$14=0,0,IF(COUNTIF(OFFSET($BD88,0,0,MIN($BH$14,5),1),\"<>NA\")+IF($BH$14>5,COUNTIF(OFFSET($BV88,0,0,$BH$14-5,1),\"<>NA\"),0),1,0))","v":1},{"$f":"IF($BH$14=0,0,IF(COUNTIF(OFFSET($BD88,0,0,MIN($BH$14,5),1),\"O3\")+COUNTIF(OFFSET($BD88,0,0,MIN($BH$14,5),1),\"O3 Cell 1\")+IF($BH$14>5,COUNTIF(OFFSET($BV88,0,0,$BH$14-5,1),\"O3\"),0)+IF($BH$14>5,COUNTIF(OFFSET($BV88,0,0,$BH$14-5,1),\"O3 Cell 1\"),0),1,0))","v":0},{"$f":"IF(OR($AY92=0,AND(COUNTA(D92,F92:G92)=0,COUNTIF(E92,0))),\"NA\",IF(COUNTA(D92:G92),IF(BA92,4,5),IF($BH$15=1,IF(BA92,4,IF(AZ92,5,6)),IF(BD92=\"!error\",IF(BA92,4,5),IF(BA92,\"5B\",6)))))","v":6},{"$f":"$BH$11","v":5},{"$f":"IF(AND(IF($BN$4=\"missing\",10,$BN$4)>=5,$AY92<>\"\"),IF(OR($AY92=0,AND($B92=\"NA\",COUNTA($D92,$F92:$G92)=0,COUNTIF($E92,0)),AND($B92=\"NA\",COUNTA($D92:$G92)=0,IF($BH$14=0,0,COUNTIF(OFFSET($BD88,0,0,MIN($BH$14,5),1),\"NA\")+IF($BH$14>5,COUNTIF(OFFSET($BV88,0,0,$BH$14-5,1),\"NA\"),0))=$BH$14),AND($B92=\"NA\",COUNTA($D92:$G92)=0,IF($BH$14<5,COUNTA(OFFSET($D88,$BH$14,0,MIN(5-$BH$14,$BH$15),4))-COUNTIF(OFFSET($E88,$BH$14,0,MIN(5-$BH$14,$BH$15),1),0),0)+IF($BH$14+$BH$15>5,COUNTA(OFFSET($D93,MAX($BH$14-5,0),0,MIN($BH$14+$BH$15-5,$BH$15),4))-COUNTIF(OFFSET($E93,MAX($BH$14-5,0),0,MIN($BH$14+$BH$15-5,$BH$15),1),0),0)),AND($B92=\"NA\",COUNTA($D92:$G92)=0,IF($BH$14<5,COUNTIF(OFFSET($B88,$BH$14,0,MIN(5-$BH$14,$BH$15),1),\"NA\"),0)+IF($BH$14+$BH$15>5,COUNTIF(OFFSET($B93,MAX($BH$14-5,0),0,MIN($BH$14+$BH$15-5,$BH$15),1),\"NA\"),0)<>$BH$15)),\"NA\",IF($B92=\"\",\"missing\",IF(AND($B92<>\"NA\",COUNTA($D92,$F92:$G92)+COUNTIF($E92,\"<>0\")),UPPER($B92),\"!error\"))),\"\")","v":""},"","","",{"$f":"IF(BD92=\"\",\"\",IF(AY92=0,\"NA\",IF(OR($BH$12=\"!error\",$BH$13=\"!error\",BG92=\"!error\"),\"!error\",IF(BD92=\"NA\",\"NA\",IF(AND(ISNUMBER(BG92),BG92=0),0,IF(AND(ISNUMBER($BH$12),ISNUMBER($BH$13),ISNUMBER(BG92)),$BH$13*$BH$12/BG92,IF(BG92=\"ND\",\"ND\",\"missing\")))))))","v":""},"","","",{"$f":"IF(BD92=\"\",\"\",IF(AY92=0,\"NA\",IF(CW92=\"ND\",\"ND\",IF(OR($BN$12=\"!error\",BD92=\"!error\",AND(BD92=\"missing\",ISNUMBER(BF92)),IF(BE92=1,BF92=\"!error\",0),BI92=\"!error\",BJ92=\"!error\"),\"!error\",IF(OR(BD92=\"NA\",AND(ISNUMBER($BN$12),$BN$12=0),AND(BE92<>0,ISNUMBER(BK92),BK92=0),AND(BE92=1,ISNUMBER(BJ92),BJ92>9),AND(BE92=2,ISNUMBER(BJ92),OR(BJ92<6,BJ92>=9.5)),AND(OR(BE92=3,BE92=4),ISNUMBER(BJ92),OR(BJ92<5.5,BJ92>=9.5))),\"NA\",IF(AND(ISNUMBER($BN$12),BE92<>0,IF(BE92=1,ISNUMBER(BF92),1),ISNUMBER(BI92),ISNUMBER(BJ92)),CT_Giardia(BE92,$BN$12,BI92,BJ92,IF(BE92=1,BF92,)),IF(COUNTIF(BE92,\"<>0\")+COUNT(BF92,BG92,BI92,BJ92)=5,\"!error\",\"missing\")))))))","v":""},{"$f":"IF(BD92=\"\",\"\",IF(OR(AY92=0,AND(ISNUMBER($BN$12),$BN$12=0)),\"NA\",IF(CW92=\"ND\",\"ND\",IF(OR(BK92=\"!error\",BL92=\"!error\",BN92=\"!error\"),\"!error\",IF(BD92=\"NA\",\"NA\",IF(BL92=\"NA\",0,IF(AND(BE92<>99,ISNUMBER(BK92),ISNUMBER(BL92)),BK92/BL92,IF(AND(BE92=99,BN92=0.5),BN92/$BN$12,\"missing\"))))))))","v":""},{"$f":"IF(BD92=\"\",\"\",IF(AY92=0,\"NA\",IF(CW92=\"ND\",\"ND\",IF(OR(BD92=\"!error\",AND(BD92=\"missing\",ISNUMBER(BF92)),BF92=\"!error\",BH92=\"!error\",BI92=\"!error\",BJ92=\"!error\"),\"!error\",IF(BD92=\"NA\",\"NA\",IF(OR(AND(BE92<>0,ISNUMBER(BK92),BK92=0),AND(BE92=1,ISNUMBER(BJ92),BJ92>9),AND(BE92=2,ISNUMBER(BJ92),OR(BJ92<6,BJ92>=9.5)),AND(OR(BE92=3,BE92=4),ISNUMBER(BJ92),OR(BJ92<5.5,BJ92>=9.5))),0,IF(AND(ISNUMBER($BN$12),BE92<>0,ISNUMBER(BF92),ISNUMBER(BH92),ISNUMBER(BI92),ISNUMBER(BJ92)),log_Giardia(BE92,$BN$12,BI92,BJ92,BF92,BH92),IF(COUNTIF(BE92,\"<>0\")+COUNT(BF92,BG92,BI92,BJ92)=5,\"!error\",\"missing\"))))))))","v":""},{"$f":"IF(BD92=\"\",\"\",IF(AY92=0,\"NA\",IF(CW92=\"ND\",\"ND\",IF(OR($BP$12=\"!error\",BD92=\"!error\",AND(BD92=\"missing\",ISNUMBER(BF92)),BI92=\"!error\",BJ92=\"!error\"),\"!error\",IF(OR(BD92=\"NA\",AND(ISNUMBER($BP$12),$BP$12=0),AND(BE92<>0,ISNUMBER(BK92),BK92=0),AND(BE92=1,ISNUMBER(BJ92),BJ92>=10.5),AND(BE92=2,ISNUMBER(BJ92),OR(BJ92<6,BJ92>=9.5)),AND(BE92=3,ISNUMBER(BJ92),OR(BJ92<6,BJ92>9)),AND(BE92=4,ISNUMBER(BJ92),OR(BJ92<6,BJ92>10))),\"NA\",IF(AND(ISNUMBER($BP$12),BE92<>0,ISNUMBER(BI92),ISNUMBER(BJ92)),CT_Virus(BE92,$BP$12,BI92,BJ92),IF(COUNTIF(BE92,\"<>0\")+COUNT(BF92,BG92,BI92,BJ92)=5,\"!error\",\"missing\")))))))","v":""},{"$f":"IF(BD92=\"\",\"\",IF(OR(AY92=0,AND(ISNUMBER($BP$12),$BP$12=0)),\"NA\",IF(CW92=\"ND\",\"ND\",IF(OR(BK92=\"!error\",BO92=\"!error\",BQ92=\"!error\"),\"!error\",IF(BD92=\"NA\",\"NA\",IF(BO92=\"NA\",0,IF(AND(BE92<>99,ISNUMBER(BK92),ISNUMBER(BO92)),BK92/BO92,IF(AND(BE92=99,BQ92=1),BQ92/$BP$12,\"missing\"))))))))","v":""},{"$f":"IF(BD92=\"\",\"\",IF(AY92=0,\"NA\",IF(CW92=\"ND\",\"ND\",IF(OR(BD92=\"!error\",AND(BD92=\"missing\",ISNUMBER(BF92)),BF92=\"!error\",BH92=\"!error\",BI92=\"!error\",BJ92=\"!error\"),\"!error\",IF(BD92=\"NA\",\"NA\",IF(OR(AND(BE92<>0,ISNUMBER(BK92),BK92=0),AND(BE92=1,ISNUMBER(BJ92),BJ92>=10.5),AND(BE92=2,ISNUMBER(BJ92),OR(BJ92<6,BJ92>=9.5)),AND(BE92=3,ISNUMBER(BJ92),OR(BJ92<6,BJ92>9)),AND(BE92=4,ISNUMBER(BJ92),OR(BJ92<6,BJ92>10))),0,IF(AND(ISNUMBER($BP$12),BE92<>0,ISNUMBER(BF92),ISNUMBER(BH92),ISNUMBER(BI92),ISNUMBER(BJ92)),Log_Virus(BE92,$BP$12,BI92,BJ92,BF92,BH92),IF(COUNTIF(BE92,\"<>0\")+COUNT(BF92,BG92,BI92,BJ92)=5,\"!error\",\"missing\"))))))))","v":""},{"$f":"IF($BM$14=0,0,IF(COUNTIF(OFFSET($BD88,0,0,MIN($BM$14,5),1),\"<>NA\")+IF($BM$14>5,COUNTIF(OFFSET($BV88,0,0,$BM$14-5,1),\"<>NA\"),0),1,0))","v":1},{"$f":"IF($BK$14=0,0,IF(COUNTIF(OFFSET($BD88,0,0,MIN($BK$14,5),1),\"O3\")+COUNTIF(OFFSET($BD88,0,0,MIN($BK$14,5),1),\"O3 Cell 1\")+IF($BK$14>5,COUNTIF(OFFSET($BV88,0,0,$BK$14-5,1),\"O3\"),0)+IF($BK$14>5,COUNTIF(OFFSET($BV88,0,0,$BK$14-5,1),\"O3 Cell 1\"),0),1,0))","v":0},{"$f":"IF(OR($AY92=0,AND(COUNTA(D97,F97:G97)=0,COUNTIF(E97,0))),\"NA\",IF(COUNTA(D97:G97),IF(BS92,4,5),IF($BM$15=1,IF(BS92,4,IF(BR92,5,6)),IF(BV92=\"!error\",IF(BS92,4,5),IF(BS92,\"5B\",6)))))","v":6},{"$f":"$BM$11","v":10},{"$f":"IF(AND(IF($BN$4=\"missing\",10,$BN$4)>=10,$AY92<>\"\"),IF(OR($AY92=0,AND($B97=\"NA\",COUNTA($D97,$F97:$G97)=0,COUNTIF($E97,0)),AND($B97=\"NA\",COUNTA($D97:$G97)=0,IF($BM$14=0,0,COUNTIF(OFFSET($BD88,0,0,MIN($BM$14,5),1),\"NA\")+IF($BM$14>5,COUNTIF(OFFSET($BV88,0,0,$BM$14-5,1),\"NA\"),0))=$BM$14),AND($B97=\"NA\",COUNTA($D97:$G97)=0,IF($BM$14<5,COUNTA(OFFSET($D88,$BM$14,0,MIN(5-$BM$14,$BM$15),4))-COUNTIF(OFFSET($E88,$BM$14,0,MIN(5-$BM$14,$BM$15),1),0),0)+IF($BM$14+$BM$15>5,COUNTA(OFFSET($D93,MAX($BM$14-5,0),0,MIN($BM$14+$BM$15-5,$BM$15),4))-COUNTIF(OFFSET($E93,MAX($BM$14-5,0),0,MIN($BM$14+$BM$15-5,$BM$15),1),0),0)),AND($B97=\"NA\",COUNTA($D97:$G97)=0,IF($BM$14<5,COUNTIF(OFFSET($B88,$BM$14,0,MIN(5-$BM$14,$BM$15),1),\"NA\"),0)+IF($BM$14+$BM$15>5,COUNTIF(OFFSET($B93,MAX($BM$14-5,0),0,MIN($BM$14+$BM$15-5,$BM$15),1),\"NA\"),0)<>$BM$15)),\"NA\",IF($B97=\"\",\"missing\",IF(AND($B97<>\"NA\",COUNTA($D97,$F97:$G97)+COUNTIF($E97,\"<>0\")),UPPER($B97),\"!error\"))),\"\")","v":""},"",{"$f":"IF(BV92=\"\",\"\",IF(BV92=\"NA\",\"NA\",IF(ISBLANK($D97),\"missing\",IF(AND(BW92=1,ISNUMBER($D97),$D97>4),4,IF(AND(ISNUMBER($D97),$D97>=0),$D97,IF(AND(ISTEXT($D97),$D97=\"ND\"),\"ND\",\"!error\"))))))","v":""},{"$f":"IF(BV92=\"\",\"\",IF(BV92=\"NA\",\"NA\",IF(ISBLANK($E97),\"missing\",IF(OR(AND(ISBLANK($B97),COUNT(BX92,CA92:CB92)=0,ISNUMBER($E97),$E97=0),AND(ISNUMBER($E97),$E97>0),AND(ISTEXT($E97),$E97=\"ND\")),$E97,\"!error\"))))","v":""},{"$f":"IF(BV92=\"\",\"\",IF(AY92=0,\"NA\",IF(OR($BM$12=\"!error\",$BM$13=\"!error\",BY92=\"!error\"),\"!error\",IF(BV92=\"NA\",\"NA\",IF(AND(ISNUMBER(BY92),BY92=0),0,IF(AND(ISNUMBER($BM$12),ISNUMBER($BM$13),ISNUMBER(BY92)),$BM$13*$BM$12/BY92,IF(BY92=\"ND\",\"ND\",\"missing\")))))))","v":""},{"$f":"IF(BV92=\"\",\"\",IF(BV92=\"NA\",\"NA\",IF(ISBLANK($F97),\"missing\",IF(OR(ISNUMBER($F97),$F97=\"ND\"),$F97,\"!error\"))))","v":""},{"$f":"IF(BV92=\"\",\"\",IF(BV92=\"NA\",\"NA\",IF(ISBLANK($G97),\"missing\",IF(OR(AND(ISNUMBER($G97),$G97>=0,$G97<=14),$G97=\"ND\"),$G97,\"!error\"))))","v":""},"",{"$f":"IF(BV92=\"\",\"\",IF(AY92=0,\"NA\",IF(CX92=\"ND\",\"ND\",IF(OR($BN$12=\"!error\",BV92=\"!error\",AND(BV92=\"missing\",ISNUMBER(BX92)),IF(BW92=1,BX92=\"!error\",0),CA92=\"!error\",CB92=\"!error\"),\"!error\",IF(OR(BV92=\"NA\",AND(ISNUMBER($BN$12),$BN$12=0),AND(BW92<>0,ISNUMBER(CC92),CC92=0),AND(BW92=1,ISNUMBER(CB92),CB92>9),AND(BW92>1,ISNUMBER(CB92),OR(CB92<6,CB92>=9.5))),\"NA\",IF(AND(ISNUMBER($BN$12),BW92<>0,IF(BW92=1,ISNUMBER(BX92),1),ISNUMBER(CA92),ISNUMBER(CB92)),CT_Giardia(BW92,$BN$12,CA92,CB92,IF(BW92=1,BX92,)),IF(COUNTIF(BW92,\"<>0\")+COUNT(BX92,BY92,CA92,CB92)=5,\"!error\",\"missing\")))))))","v":""},{"$f":"IF(BV92=\"\",\"\",IF(OR(AY92=0,AND(ISNUMBER($BN$12),$BN$12=0)),\"NA\",IF(CX92=\"ND\",\"ND\",IF(OR(CC92=\"!error\",CD92=\"!error\",CF92=\"!error\"),\"!error\",IF(BV92=\"NA\",\"NA\",IF(CD92=\"NA\",0,IF(AND(ISNUMBER(CC92),ISNUMBER(CD92)),CC92/CD92,IF(AND(BW92=99,CF92=0.5),CF92/$BN$12,\"missing\"))))))))","v":""},{"$f":"IF(BV92=\"\",\"\",IF(AY92=0,\"NA\",IF(CX92=\"ND\",\"ND\",IF(OR(BV92=\"!error\",AND(BV92=\"missing\",ISNUMBER(BX92)),BX92=\"!error\",BZ92=\"!error\",CA92=\"!error\",CB92=\"!error\"),\"!error\",IF(BV92=\"NA\",\"NA\",IF(OR(AND(BW92<>0,ISNUMBER(CC92),CC92=0),AND(BW92=1,ISNUMBER(CB92),CB92>9),AND(BW92>1,ISNUMBER(CB92),OR(CB92<6,CB92>=9.5))),0,IF(AND(ISNUMBER($BN$12),BW92<>0,ISNUMBER(BX92),ISNUMBER(BZ92),ISNUMBER(CA92),ISNUMBER(CB92)),log_Giardia(BW92,$BN$12,CA92,CB92,BX92,BZ92),IF(COUNTIF(BW92,\"<>0\")+COUNT(BX92,BY92,CA92,CB92)=5,\"!error\",\"missing\"))))))))","v":""},{"$f":"IF(BV92=\"\",\"\",IF(AY92=0,\"NA\",IF(CX92=\"ND\",\"ND\",IF(OR($BP$12=\"!error\",BV92=\"!error\",AND(BV92=\"missing\",ISNUMBER(BX92)),CA92=\"!error\",CB92=\"!error\"),\"!error\",IF(OR(BV92=\"NA\",AND(ISNUMBER($BP$12),$BP$12=0),AND(BW92<>0,ISNUMBER(CC92),CC92=0),AND(BW92=1,ISNUMBER(CB92),OR(CB92<5.5,CB92>=10.5)),AND(OR(BW92=2,BW92=4),ISNUMBER(CB92),OR(CB92<6,CB92>=9.5)),AND(BW92=3,ISNUMBER(CB92),OR(CB92<6,CB92>9))),\"NA\",IF(AND(ISNUMBER($BP$12),BW92<>0,ISNUMBER(CA92),ISNUMBER(CB92)),CT_Virus(BW92,$BP$12,CA92,CB92),IF(COUNTIF(BW92,\"<>0\")+COUNT(BX92,BY92,CA92,CB92)=5,\"!error\",\"missing\")))))))","v":""},{"$f":"IF(BV92=\"\",\"\",IF(OR(AY92=0,AND(ISNUMBER($BP$12),$BP$12=0)),\"NA\",IF(CX92=\"ND\",\"ND\",IF(OR(CC92=\"!error\",CG92=\"!error\",CI92=\"!error\"),\"!error\",IF(BV92=\"NA\",\"NA\",IF(CG92=\"NA\",0,IF(AND(ISNUMBER(CC92),ISNUMBER(CG92)),CC92/CG92,IF(AND(BW92=99,CI92=1),CI92/$BP$12,\"missing\"))))))))","v":""},{"$f":"IF(BV92=\"\",\"\",IF(AY92=0,\"NA\",IF(CX92=\"ND\",\"ND\",IF(OR(BV92=\"!error\",AND(BV92=\"missing\",ISNUMBER(BX92)),BX92=\"!error\",BZ92=\"!error\",CA92=\"!error\",CB92=\"!error\"),\"!error\",IF(BV92=\"NA\",\"NA\",IF(OR(AND(BW92<>0,ISNUMBER(CC92),CC92=0),AND(BW92=1,ISNUMBER(CB92),OR(CB92<5.5,CB92>=10.5)),AND(OR(BW92=2,BW92=4),ISNUMBER(CB92),OR(CB92<6,CB92>=9.5)),AND(BW92=3,ISNUMBER(CB92),OR(CB92<6,CB92>9))),0,IF(AND(ISNUMBER($BP$12),BW92<>0,ISNUMBER(BX92),ISNUMBER(BZ92),ISNUMBER(CA92),ISNUMBER(CB92)),Log_Virus(BW92,$BP$12,CA92,CB92,BX92,BZ92),IF(COUNTIF(BW92,\"<>0\")+COUNT(BX92,BY92,CA92,CB92)=5,\"!error\",\"missing\"))))))))","v":""},null,null,null,null,null,null,null,null,null,null,null,null,null,{"$f":"IF(OR(BF92=\"ND\",BG92=\"ND\",BI92=\"ND\",BJ92=\"ND\"),\"ND\",\"data\")","v":"data"},{"$f":"IF(OR(BX92=\"ND\",BY92=\"ND\",CA92=\"ND\",CB92=\"ND\"),\"ND\",\"data\")","v":"data"}]
[null," ",{"$f":"$H$15","v":6},null,null,null,null,{"$f":"IF($CD88=\"!error\",\"!error\",$CC88)","v":""},{"$f":"$CD88","v":""},{"$f":"$CG88","v":""},{"$f":"$CF88","v":""},{"$f":"$CI88","v":""},null,null,null,null,{"$f":"IF(AND(BW88=1,D93>4,D93<>\"ND\"),\"Note: The inactivation credit in zone D\" & C93 & \" was restricted due to elevated free chlorine levels.\",\"\")","v":""},null,null,null,null,null,null,null,null,null,null,null,null,null,null,null,null,null,null,null,null,null,null,null,null,null,null,null,null,null,null,null,null,null,null,null,null,null,null,null,null,null,null,null,null,null,null,null,null,null,null,null,null,null,null,null,null,null,null,null,null,null,null,null,null,null,null,null,null,null,null,null," Not representative of total log inactivation for all disinfection zones."]
[null," ",{"$f":"$I$15","v":7},null,null,null,null,{"$f":"IF($CD89=\"!error\",\"!error\",$CC89)","v":""},{"$f":"$CD89","v":""},{"$f":"$CG89","v":""},{"$f":"$CF89","v":""},{"$f":"$CI89","v":""},null,null,null,null,{"$f":"IF(AND(BW89=1,D94>4,D94<>\"ND\"),\"Note: The inactivation credit in zone D\" & C94 & \" was restricted due to elevated free chlorine levels.\",\"\")","v":""},null,null,null,null,null,null,null,null,null,null,null,null,null,null,null,null,null,null,null,null,null,null,null,null,null,null,null,null,null,null,null,null,null,null,null,null,null,null,null,null,null,null,null,null,null,null,null,null,null,null,null,null,null,null,null,null,null,null,null,null,null,null,null,null,null,null,null,null,null,null,null,null,null,{"$f":"CL88=\"\"","v":true},null,null,null,{"$f":"CP88=\"\"","v":true}]
[null," ",{"$f":"$J$15","v":8},null,null,null,null,"",{"$f":"$CD90","v":""},{"$f":"$CG90","v":""},{"$f":"$CF90","v":""},{"$f":"$CI90","v":""},null,null,null,null,""]
[null," ",{"$f":"$K$15","v":9},null,null,null,null,"",{"$f":"$CD91","v":""},{"$f":"$CG91","v":""},{"$f":"$CF91","v":""},{"$f":"$CI91","v":""},null,null,null,null,""]
[null," ",{"$f":"$L$15","v":10},null,null,null,null,{"$f":"IF($CC92=\"!error\",\"!error\",$CC92)","v":""},{"$f":"$CD92","v":""},{"$f":"$CG92","v":""},{"$f":"$CF92","v":""},{"$f":"$CI92","v":""},null,null,null,null,""]
[]
[null,null,null,null,null,"DISINFECTION PROCESS DATA "]
[null,"DATE:",null,null,null,{"$f":"OR(AND(COUNTA(D104:G113)=0,C100=\"\"),IsDate(C100))","v":true},"TIME:",null,null,null,null,"Operator Initials:"]
[null,"INDIVIDUAL DISINFECTION ZONES",null,null,null,null,null,null,null,null,null,null,"PLANT TOTAL",null,null,null,null,null,null,null,null,null,null,null,null,null,null,null,null,null,null,null,null,null,null,null,null,null,null,null,null,null,null,null,null,null,null,null,null,"PUMPAGE",null,null,null,null,{"$f":"\"DISINFECTION ZONES  ( D\"&$BD$11&\" - D\"&$BH$11&\" )\"","v":"DISINFECTION ZONES  ( D1 - D5 )"},null,null,null,null,null,null,null,null,null,null,null,null,null,null,null,null,null,{"$f":"\"DISINFECTION ZONES  ( D\"&$BI$11&\" - D\"&$BM$11&\" )\"","v":"DISINFECTION ZONES  ( D6 - D10 )"},null,null,null,null,null,null,null,null,null,null,null,null,null,null,null,"DAILY DISINFECTION DATA SUMMARY"]
[null,null,null,"C","Flow","Temp",null,null,"Giardia","Virus","Giardia","Virus","Giardia","Virus","Inact.",null,null,null,null,null,null,null,null,null,null,null,null,null,null,null,null,null,null,null,null,null,null,null,null,null,null,null,null,null,null,null,null,null,null,null,"RAW",null,null,null,null,null,null,null,null,null,null,null,null,"GIARDIA","GIARDIA","GIARDIA","VIRUS","VIRUS","VIRUS",null,null,null,null,null,null,null,null,null,null,null,null,"GIARDIA","GIARDIA","GIARDIA","VIRUS","VIRUS","VIRUS",null,"GIARDIA",null,"GIARDIA",null,"VIRUS",null,"VIRUS",null,"MINIMUM",null,null,null,"NO DATA"]
[null,"Disinfectant",null,"(mg/L)","(MGD)","(oC)","pH","CTCALC","CTREQD","CTREQD","Log","Log","Log","Log","Ratio",null,null,null,null,null,null,null,null,null,null,null,null,null,null,null,null,null,null,null,null,null,null,null,null,null,null,null,null,null,null,null,null,null,null,"DATE","WATER",null,null,"AT LEAST ONE PRECEDING ZONE <> \"NA\"","DISINFECTANT",null,null,"C","FLOW","T10","TEMP","pH","CTACTUAL","CTREQD","INACT. RATIO","LOG","CTREQD","INACT. RATIO","LOG",null,null,null,"DISINFECTANT",null,null,"C","FLOW","T10","TEMP","pH","CTACTUAL","CTREQD","INACT. RATIO","LOG","CTREQD","INACT. RATIO","LOG",null,"LOG",null,"INACT. RATIO",null,"LOG",null,"INACT. RATIO",null,"INACT. RATIO",null,null,null,{"$f":"\"D\"&$BD$11&\" - D\"&$BH$11","v":"D1 - D5"},{"$f":"\"D\"&$BI$11&\" - D\"&$BM$11","v":"D6 - D10"}]
[null,null,{"$f":"$C$15","v":1},null,null,null,null,{"$f":"IF(BL104=\"!error\",\"!error\",$BK104)","v":"missing"},{"$f":"$BL104","v":"missing"},{"$f":"$BO104","v":"missing"},{"$f":"$BN104","v":"missing"},{"$f":"$BQ104","v":"missing"},{"$f":"IF($CK104=\"\",\"\",IF($CK104=\"NA\",\"NA\",IF($CK104=\"!error\",-99,IF(COUNTIF(CW104:CX108,\"ND\")=$BN$4,\"MD\",IF(ISNUMBER($CK104),FIXED($CK104,2)&IF($CL104=\"*\",\"*\",\" \"),\"\")))))","v":""},{"$f":"IF($CO104=\"\",\"\",IF($CO104=\"NA\",\"NA \",IF($CO104=\"!error\",-99,IF(COUNTIF(CW104:CX108,\"ND\")=$BN$4,\"MD\",IF(ISNUMBER($CO104),FIXED($CO104,2)&IF($CP104=\"*\",\"*\",\" \"),\"\")))))","v":""},{"$f":"IF($CS104=\"\",\"\",IF($CS104=\"NA\",\"NA\",IF($CS104=\"!error\",-99,IF(AND($CW104=\"ND\",$CW105=\"ND\",$CW106=\"ND\",$CW107=\"ND\",$CW108=\"ND\",$CX104=\"ND\",$CX105=\"ND\",$CX106=\"ND\",$CX107=\"ND\",$CX108=\"ND\"),\"ND\",IF(ISNUMBER($CS104),$CS104,\"\")))))","v":""},null,{"$f":"IF(AND(BE104=1,D104>4,D104<>\"ND\"),\"Note: The inactivation credit in zone D\" & C104 & \" was restricted due to elevated free chlorine levels.\",\"\")","v":""},null,null,null,null,null,null,null,null,null,null,null,null,null,null,null,null,null,null,null,null,null,null,null,null,null,null,null,null,null,null,null,null,1,1,{"$f":"IF($BD$14=0,0,IF(COUNTIF(OFFSET($BD104,0,0,MIN($BD$14,5),1),\"<>NA\")+IF($BD$14>5,COUNTIF(OFFSET($BV104,0,0,$BD$14-5,1),\"<>NA\"),0),1,0))","v":0},{"$f":"IF($BD$14=0,0,IF(COUNTIF(OFFSET($BD104,0,0,MIN($BD$14,5),1),\"O3\")+COUNTIF(OFFSET($BD104,0,0,MIN($BD$14,5),1),\"O3 Cell 1\")+IF($BD$14>5,COUNTIF(OFFSET($BV104,0,0,$BD$14-5,1),\"O3\"),0)+IF($BD$14>5,COUNTIF(OFFSET($BV104,0,0,$BD$14-5,1),\"O3 Cell 1\"),0),1,0))","v":0},{"$f":"IF(OR($AY104=0,AND(COUNTA(D104,F104:G104)=0,COUNTIF(E104,0))),\"NA\",\n       IF(COUNTA(D104:G104),IF(BA104,4,\n                                                                     5),\n            IF($BD$15=1,IF(BA104,4,\n                                                        IF(AZ104,5,\n                                                                         6)),\n                    IF(BD104=\"!error\",IF(BA104,4,\n                                                                        5),\n                          IF(BA104,\"5B\",\n                                            6)))))","v":6},{"$f":"$BD$11","v":1},{"$f":"IF(AND(IF($BN$4=\"missing\",10,$BN$4)>=1,$AY104<>\"\"),IF(OR($AY104=0,AND($B104=\"NA\",COUNTA($D104,$F104:$G104)=0,COUNTIF($E104,0)),AND($B104=\"NA\",COUNTA($D104:$G104)=0,IF($BD$14=0,0,COUNTIF(OFFSET($BD104,0,0,MIN($BD$14,5),1),\"NA\")+IF($BD$14>5,COUNTIF(OFFSET($BV104,0,0,$BD$14-5,1),\"NA\"),0))=$BD$14),AND($B104=\"NA\",COUNTA($D104:$G104)=0,IF($BD$14<5,COUNTA(OFFSET($D104,$BD$14,0,MIN(5-$BD$14,$BD$15),4))-COUNTIF(OFFSET($E104,$BD$14,0,MIN(5-$BD$14,$BD$15),1),0),0)+IF($BD$14+$BD$15>5,COUNTA(OFFSET($D109,MAX($BD$14-5,0),0,MIN($BD$14+$BD$15-5,$BD$15),4))-COUNTIF(OFFSET($E109,MAX($BD$14-5,0),0,MIN($BD$14+$BD$15-5,$BD$15),1),0),0)),AND($B104=\"NA\",COUNTA($D104:$G104)=0,IF($BD$14<5,COUNTIF(OFFSET($B104,$BD$14,0,MIN(5-$BD$14,$BD$15),1),\"NA\"),0)+IF($BD$14+$BD$15>5,COUNTIF(OFFSET($B109,MAX($BD$14-5,0),0,MIN($BD$14+$BD$15-5,$BD$15),1),\"NA\"),0)<>$BD$15)),\"NA\",IF($B104=\"\",\"missing\",IF(AND($B104<>\"NA\",COUNTA($D104,$F104:$G104)+COUNTIF($E104,\"<>0\")),UPPER($B104),\"!error\"))),\"\")","v":"missing"},{"$f":"IF(BD104=\"\",\"\",IF(BD104=\"FCL\",1,IF(BD104=\"CLO2\",2,IF(BD104=\"O3 Cell 1\",99,IF(BD104=\"O3\",3,IF(BD104=\"CLA\",4,0))))))","v":0},{"$f":"IF(BD104=\"\",\"\",IF(BD104=\"NA\",\"NA\",IF(ISBLANK($D104),\"missing\",IF(AND(BE104=1,ISNUMBER($D104),$D104>4),4,IF(AND(ISNUMBER($D104),$D104>=0),$D104,IF(AND(ISTEXT($D104),$D104=\"ND\"),\"ND\",\"!error\"))))))","v":"missing"},{"$f":"IF(BD104=\"\",\"\",IF(BD104=\"NA\",\"NA\",IF(ISBLANK($E104),\"missing\",IF(OR(AND(ISBLANK($B104),COUNT(BF104,BI104:BJ104)=0,ISNUMBER($E104),$E104=0),AND(ISNUMBER($E104),$E104>0),AND(ISTEXT($E104),$E104=\"ND\")),$E104,\"!error\"))))","v":"missing"},{"$f":"IF(BD104=\"\",\"\",IF(AY104=0,\"NA\",IF(OR($BD$12=\"!error\",$BD$13=\"!error\",BG104=\"!error\"),\"!error\",IF(BD104=\"NA\",\"NA\",IF(AND(ISNUMBER(BG104),BG104=0),0,IF(AND(ISNUMBER($BD$12),ISNUMBER($BD$13),ISNUMBER(BG104)),$BD$13*$BD$12/BG104,IF(BG104=\"ND\",\"ND\",\"missing\")))))))","v":"missing"},{"$f":"IF(BD104=\"\",\"\",IF(BD104=\"NA\",\"NA\",IF(ISBLANK($F104),\"missing\",IF(OR(ISNUMBER($F104),$F104=\"ND\"),$F104,\"!error\"))))","v":"missing"},{"$f":"IF(BD104=\"\",\"\",IF(BD104=\"NA\",\"NA\",IF(ISBLANK($G104),\"missing\",IF(OR(AND(ISNUMBER($G104),$G104>=0,$G104<=14),$G104=\"ND\"),$G104,\"!error\"))))","v":"missing"},{"$f":"IF(BD104=\"\",\"\",IF(AY104=0,\"NA\",IF(OR(BF104=\"!error\",BH104=\"!error\"),\"!error\",IF(BD104=\"NA\",\"NA\",IF(OR(AND(ISNUMBER(BF104),BF104=0),AND(ISNUMBER(BH104),BH104=0)),0,IF(AND(ISNUMBER(BF104),ISNUMBER(BH104)),BF104*BH104,IF(OR(BF104=\"ND\",BH104=\"ND\"),\"ND\",\"missing\")))))))","v":"missing"},{"$f":"IF(BD104=\"\",\"\",IF(AY104=0,\"NA\",IF(CW104=\"ND\",\"ND\",IF(OR($BN$12=\"!error\",BD104=\"!error\",AND(BD104=\"missing\",ISNUMBER(BF104)),IF(BE104=1,BF104=\"!error\",0),BI104=\"!error\",BJ104=\"!error\"),\"!error\",IF(OR(BD104=\"NA\",AND(ISNUMBER($BN$12),$BN$12=0),AND(BE104<>0,ISNUMBER(BK104),BK104=0),AND(BE104=1,ISNUMBER(BJ104),BJ104>9),AND(BE104=2,ISNUMBER(BJ104),OR(BJ104<6,BJ104>=9.5)),AND(OR(BE104=3,BE104=4),ISNUMBER(BJ104),OR(BJ104<5.5,BJ104>=9.5))),\"NA\",IF(AND(ISNUMBER($BN$12),BE104<>0,IF(BE104=1,ISNUMBER(BF104),1),ISNUMBER(BI104),ISNUMBER(BJ104)),CT_Giardia(BE104,$BN$12,BI104,BJ104,IF(BE104=1,BF104,)),IF(COUNTIF(BE104,\"<>0\")+COUNT(BF104,BG104,BI104,BJ104)=5,\"!error\",\"missing\")))))))","v":"missing"},{"$f":"IF(BD104=\"\",\"\",IF(OR(AY104=0,AND(ISNUMBER($BN$12),$BN$12=0)),\"NA\",IF(CW104=\"ND\",\"ND\",IF(OR(BK104=\"!error\",BL104=\"!error\",BN104=\"!error\"),\"!error\",IF(BD104=\"NA\",\"NA\",IF(BL104=\"NA\",0,IF(AND(BE104<>99,ISNUMBER(BK104),ISNUMBER(BL104)),BK104/BL104,IF(AND(BE104=99,BN104=0.5),BN104/$BN$12,\"missing\"))))))))","v":"missing"},{"$f":"IF(BD104=\"\",\"\",IF(AY104=0,\"NA\",IF(CW104=\"ND\",\"ND\",IF(OR(BD104=\"!error\",AND(BD104=\"missing\",ISNUMBER(BF104)),BF104=\"!error\",BH104=\"!error\",BI104=\"!error\",BJ104=\"!error\"),\"!error\",IF(BD104=\"NA\",\"NA\",IF(OR(AND(BE104<>0,ISNUMBER(BK104),BK104=0),AND(BE104=1,ISNUMBER(BJ104),BJ104>9),AND(BE104=2,ISNUMBER(BJ104),OR(BJ104<6,BJ104>=9.5)),AND(OR(BE104=3,BE104=4),ISNUMBER(BJ104),OR(BJ104<5.5,BJ104>=9.5))),0,IF(AND(ISNUMBER($BN$12),BE104<>0,ISNUMBER(BF104),ISNUMBER(BH104),ISNUMBER(BI104),ISNUMBER(BJ104)),log_Giardia(BE104,$BN$12,BI104,BJ104,BF104,BH104),IF(COUNTIF(BE104,\"<>0\")+COUNT(BF104,BG104,BI104,BJ104)=5,\"!error\",\"missing\"))))))))","v":"missing"},{"$f":"IF(BD104=\"\",\"\",IF(AY104=0,\"NA\",IF(CW104=\"ND\",\"ND\",IF(OR($BP$12=\"!error\",BD104=\"!error\",AND(BD104=\"missing\",ISNUMBER(BF104)),BI104=\"!error\",BJ104=\"!error\"),\"!error\",IF(OR(BD104=\"NA\",AND(ISNUMBER($BP$12),$BP$12=0),AND(BE104<>0,ISNUMBER(BK104),BK104=0),AND(BE104=1,ISNUMBER(BJ104),BJ104>=10.5),AND(BE104=2,ISNUMBER(BJ104),OR(BJ104<6,BJ104>=9.5)),AND(BE104=3,ISNUMBER(BJ104),OR(BJ104<6,BJ104>9)),AND(BE104=4,ISNUMBER(BJ104),OR(BJ104<6,BJ104>10))),\"NA\",IF(AND(ISNUMBER($BP$12),BE104<>0,ISNUMBER(BI104),ISNUMBER(BJ104)),CT_Virus(BE104,$BP$12,BI104,BJ104),IF(COUNTIF(BE104,\"<>0\")+COUNT(BF104,BG104,BI104,BJ104)=5,\"!error\",\"missing\")))))))","v":"missing"},{"$f":"IF(BD104=\"\",\"\",IF(OR(AY104=0,AND(ISNUMBER($BP$12),$BP$12=0)),\"NA\",IF(CW104=\"ND\",\"ND\",IF(OR(BK104=\"!error\",BO104=\"!error\",BQ104=\"!error\"),\"!error\",IF(BD104=\"NA\",\"NA\",IF(BO104=\"NA\",0,IF(AND(BE104<>99,ISNUMBER(BK104),ISNUMBER(BO104)),BK104/BO104,IF(AND(BE104=99,BQ104=1),BQ104/$BP$12,\"missing\"))))))))","v":"missing"},{"$f":"IF(BD104=\"\",\"\",IF(AY104=0,\"NA\",IF(CW104=\"ND\",\"ND\",IF(OR(BD104=\"!error\",AND(BD104=\"missing\",ISNUMBER(BF104)),BF104=\"!error\",BH104=\"!error\",BI104=\"!error\",BJ104=\"!error\"),\"!error\",IF(BD104=\"NA\",\"NA\",IF(OR(AND(BE104<>0,ISNUMBER(BK104),BK104=0),AND(BE104=1,ISNUMBER(BJ104),BJ104>=10.5),AND(BE104=2,ISNUMBER(BJ104),OR(BJ104<6,BJ104>=9.5)),AND(BE104=3,ISNUMBER(BJ104),OR(BJ104<6,BJ104>9)),AND(BE104=4,ISNUMBER(BJ104),OR(BJ104<6,BJ104>10))),0,IF(AND(ISNUMBER($BP$12),BE104<>0,ISNUMBER(BF104),ISNUMBER(BH104),ISNUMBER(BI104),ISNUMBER(BJ104)),Log_Virus(BE104,$BP$12,BI104,BJ104,BF104,BH104),IF(COUNTIF(BE104,\"<>0\")+COUNT(BF104,BG104,BI104,BJ104)=5,\"!error\",\"missing\"))))))))","v":"missing"},{"$f":"IF($BI$14=0,0,IF(COUNTIF(OFFSET($BD104,0,0,MIN($BI$14,5),1),\"<>NA\")+IF($BI$14>5,COUNTIF(OFFSET($BV104,0,0,$BI$14-5,1),\"<>NA\"),0),1,0))","v":1},{"$f":"IF($BI$14=0,0,IF(COUNTIF(OFFSET($BD104,0,0,MIN($BI$14,5),1),\"O3\")+COUNTIF(OFFSET($BD104,0,0,MIN($BI$14,5),1),\"O3 Cell 1\")+IF($BI$14>5,COUNTIF(OFFSET($BV104,0,0,$BI$14-5,1),\"O3\"),0)+IF($BI$14>5,COUNTIF(OFFSET($BV104,0,0,$BI$14-5,1),\"O3 Cell 1\"),0),1,0))","v":0},{"$f":"IF(OR($AY104=0,AND(COUNTA(D109,F109:G109)=0,COUNTIF(E109,0))),\"NA\",IF(COUNTA(D109:G109),IF(BS104,4,5),IF($BI$15=1,IF(BS104,4,IF(BR104,5,6)),IF(BV104=\"!error\",IF(BS104,4,5),IF(BS104,\"5B\",6)))))","v":6},{"$f":"$BI$11","v":6},{"$f":"IF(AND(IF($BN$4=\"missing\",10,$BN$4)>=6,$AY104<>\"\"),IF(OR($AY104=0,AND($B109=\"NA\",COUNTA($D109,$F109:$G109)=0,COUNTIF($E109,0)),AND($B109=\"NA\",COUNTA($D109:$G109)=0,IF($BI$14=0,0,COUNTIF(OFFSET($BD104,0,0,MIN($BI$14,5),1),\"NA\")+IF($BI$14>5,COUNTIF(OFFSET($BV104,0,0,$BI$14-5,1),\"NA\"),0))=$BI$14),AND($B109=\"NA\",COUNTA($D109:$G109)=0,IF($BI$14<5,COUNTA(OFFSET($D104,$BI$14,0,MIN(5-$BI$14,$BI$15),4))-COUNTIF(OFFSET($E104,$BI$14,0,MIN(5-$BI$14,$BI$15),1),0),0)+IF($BI$14+$BI$15>5,COUNTA(OFFSET($D109,MAX($BI$14-5,0),0,MIN($BI$14+$BI$15-5,$BI$15),4))-COUNTIF(OFFSET($E109,MAX($BI$14-5,0),0,MIN($BI$14+$BI$15-5,$BI$15),1),0),0)),AND($B109=\"NA\",COUNTA($D109:$G109)=0,IF($BI$14<5,COUNTIF(OFFSET($B104,$BI$14,0,MIN(5-$BI$14,$BI$15),1),\"NA\"),0)+IF($BI$14+$BI$15>5,COUNTIF(OFFSET($B109,MAX($BI$14-5,0),0,MIN($BI$14+$BI$15-5,$BI$15),1),\"NA\"),0)<>$BI$15)),\"NA\",IF($B109=\"\",\"missing\",IF(AND($B109<>\"NA\",COUNTA($D109,$F109:$G109)+COUNTIF($E109,\"<>0\")),UPPER($B109),\"!error\"))),\"\")","v":""},{"$f":"IF(BV104=\"\",\"\",IF(BV104=\"FCL\",1,IF(BV104=\"CLO2\",2,IF(BV104=\"O3 Cell 1\",99,IF(BV104=\"O3\",3,IF(BV104=\"CLA\",4,0))))))","v":""},{"$f":"IF(BV104=\"\",\"\",IF(BV104=\"NA\",\"NA\",IF(ISBLANK($D109),\"missing\",IF(AND(BW104=1,ISNUMBER($D109),$D109>4),4,IF(AND(ISNUMBER($D109),$D109>=0),$D109,IF(AND(ISTEXT($D109),$D109=\"ND\"),\"ND\",\"!error\"))))))","v":""},{"$f":"IF(BV104=\"\",\"\",IF(BV104=\"NA\",\"NA\",IF(ISBLANK($E109),\"missing\",IF(OR(AND(ISBLANK($B109),COUNT(BX104,CA104:CB104)=0,ISNUMBER($E109),$E109=0),AND(ISNUMBER($E109),$E109>0),AND(ISTEXT($E109),$E109=\"ND\")),$E109,\"!error\"))))","v":""},{"$f":"IF(BV104=\"\",\"\",IF(AY104=0,\"NA\",IF(OR($BI$12=\"!error\",$BI$13=\"!error\",BY104=\"!error\"),\"!error\",IF(BV104=\"NA\",\"NA\",IF(AND(ISNUMBER(BY104),BY104=0),0,IF(AND(ISNUMBER($BI$12),ISNUMBER($BI$13),ISNUMBER(BY104)),$BI$13*$BI$12/BY104,IF(BY104=\"ND\",\"ND\",\"missing\")))))))","v":""},{"$f":"IF(BV104=\"\",\"\",IF(BV104=\"NA\",\"NA\",IF(ISBLANK($F109),\"missing\",IF(OR(ISNUMBER($F109),$F109=\"ND\"),$F109,\"!error\"))))","v":""},{"$f":"IF(BV104=\"\",\"\",IF(BV104=\"NA\",\"NA\",IF(ISBLANK($G109),\"missing\",IF(OR(AND(ISNUMBER($G109),$G109>=0,$G109<=14),$G109=\"ND\"),$G109,\"!error\"))))","v":""},{"$f":"IF(BV104=\"\",\"\",IF(AY104=0,\"NA\",IF(OR(BX104=\"!error\",BZ104=\"!error\"),\"!error\",IF(BV104=\"NA\",\"NA\",IF(OR(AND(ISNUMBER(BX104),BX104=0),AND(ISNUMBER(BZ104),BZ104=0)),0,IF(AND(ISNUMBER(BX104),ISNUMBER(BZ104)),BX104*BZ104,IF(OR(BX104=\"ND\",BZ104=\"ND\"),\"ND\",\"missing\")))))))","v":""},{"$f":"IF(BV104=\"\",\"\",IF(AY104=0,\"NA\",IF(CX104=\"ND\",\"ND\",IF(OR($BN$12=\"!error\",BV104=\"!error\",AND(BV104=\"missing\",ISNUMBER(BX104)),IF(BW104=1,BX104=\"!error\",0),CA104=\"!error\",CB104=\"!error\"),\"!error\",IF(OR(BV104=\"NA\",AND(ISNUMBER($BN$12),$BN$12=0),AND(BW104<>0,ISNUMBER(CC104),CC104=0),AND(BW104=1,ISNUMBER(CB104),CB104>9),AND(BW104>1,ISNUMBER(CB104),OR(CB104<6,CB104>=9.5))),\"NA\",IF(AND(ISNUMBER($BN$12),BW104<>0,IF(BW104=1,ISNUMBER(BX104),1),ISNUMBER(CA104),ISNUMBER(CB104)),CT_Giardia(BW104,$BN$12,CA104,CB104,IF(BW104=1,BX104,)),IF(COUNTIF(BW104,\"<>0\")+COUNT(BX104,BY104,CA104,CB104)=5,\"!error\",\"missing\")))))))","v":""},{"$f":"IF(BV104=\"\",\"\",IF(OR(AY104=0,AND(ISNUMBER($BN$12),$BN$12=0)),\"NA\",IF(CX104=\"ND\",\"ND\",IF(OR(CC104=\"!error\",CD104=\"!error\",CF104=\"!error\"),\"!error\",IF(BV104=\"NA\",\"NA\",IF(CD104=\"NA\",0,IF(AND(ISNUMBER(CC104),ISNUMBER(CD104)),CC104/CD104,IF(AND(BW104=99,CF104=0.5),CF104/$BN$12,\"missing\"))))))))","v":""},{"$f":"IF(BV104=\"\",\"\",IF(AY104=0,\"NA\",IF(CX104=\"ND\",\"ND\",IF(OR(BV104=\"!error\",AND(BV104=\"missing\",ISNUMBER(BX104)),BX104=\"!error\",BZ104=\"!error\",CA104=\"!error\",CB104=\"!error\"),\"!error\",IF(BV104=\"NA\",\"NA\",IF(OR(AND(BW104<>0,ISNUMBER(CC104),CC104=0),AND(BW104=1,ISNUMBER(CB104),CB104>9),AND(BW104>1,ISNUMBER(CB104),OR(CB104<6,CB104>=9.5))),0,IF(AND(ISNUMBER($BN$12),BW104<>0,ISNUMBER(BX104),ISNUMBER(BZ104),ISNUMBER(CA104),ISNUMBER(CB104)),log_Giardia(BW104,$BN$12,CA104,CB104,BX104,BZ104),IF(COUNTIF(BW104,\"<>0\")+COUNT(BX104,BY104,CA104,CB104)=5,\"!error\",\"missing\"))))))))","v":""},{"$f":"IF(BV104=\"\",\"\",IF(AY104=0,\"NA\",IF(CX104=\"ND\",\"ND\",IF(OR($BP$12=\"!error\",BV104=\"!error\",AND(BV104=\"missing\",ISNUMBER(BX104)),CA104=\"!error\",CB104=\"!error\"),\"!error\",IF(OR(BV104=\"NA\",AND(ISNUMBER($BP$12),$BP$12=0),AND(BW104<>0,ISNUMBER(CC104),CC104=0),AND(BW104=1,ISNUMBER(CB104),OR(CB104<5.5,CB104>=10.5)),AND(OR(BW104=2,BW104=4),ISNUMBER(CB104),OR(CB104<6,CB104>=9.5)),AND(BW104=3,ISNUMBER(CB104),OR(CB104<6,CB104>9))),\"NA\",IF(AND(ISNUMBER($BP$12),BW104<>0,ISNUMBER(CA104),ISNUMBER(CB104)),CT_Virus(BW104,$BP$12,CA104,CB104),IF(COUNTIF(BW104,\"<>0\")+COUNT(BX104,BY104,CA104,CB104)=5,\"!error\",\"missing\")))))))","v":""},{"$f":"IF(BV104=\"\",\"\",IF(OR(AY104=0,AND(ISNUMBER($BP$12),$BP$12=0)),\"NA\",IF(CX104=\"ND\",\"ND\",IF(OR(CC104=\"!error\",CG104=\"!error\",CI104=\"!error\"),\"!error\",IF(BV104=\"NA\",\"NA\",IF(CG104=\"NA\",0,IF(AND(ISNUMBER(CC104),ISNUMBER(CG104)),CC104/CG104,IF(AND(BW104=99,CI104=1),CI104/$BP$12,\"missing\"))))))))","v":""},{"$f":"IF(BV104=\"\",\"\",IF(AY104=0,\"NA\",IF(CX104=\"ND\",\"ND\",IF(OR(BV104=\"!error\",AND(BV104=\"missing\",ISNUMBER(BX104)),BX104=\"!error\",BZ104=\"!error\",CA104=\"!error\",CB104=\"!error\"),\"!error\",IF(BV104=\"NA\",\"NA\",IF(OR(AND(BW104<>0,ISNUMBER(CC104),CC104=0),AND(BW104=1,ISNUMBER(CB104),OR(CB104<5.5,CB104>=10.5)),AND(OR(BW104=2,BW104=4),ISNUMBER(CB104),OR(CB104<6,CB104>=9.5)),AND(BW104=3,ISNUMBER(CB104),OR(CB104<6,CB104>9))),0,IF(AND(ISNUMBER($BP$12),BW104<>0,ISNUMBER(BX104),ISNUMBER(BZ104),ISNUMBER(CA104),ISNUMBER(CB104)),Log_Virus(BW104,$BP$12,CA104,CB104,BX104,BZ104),IF(COUNTIF(BW104,\"<>0\")+COUNT(BX104,BY104,CA104,CB104)=5,\"!error\",\"missing\"))))))))","v":""},null,{"$f":"IF(AY104=\"\",\"\",IF(AY104=0,\"NA\",IF(COUNTIF(BN104:BN108,\"!error\")+COUNTIF(CF104:CF108,\"!error\")>0,\"!error\",IF(COUNT(BN104:BN108,CF104:CF108)>0,SUMIFF(BC104:BC108,\">0\",BN104:BN108)+SUMIFF(BU104:BU108,\">0\",CF104:CF108)+MINIF(BC104:BC108,BU104:BU108,\"1?\",BN104:BN108,CF104:CF108)+MINIF(BC104:BC108,BU104:BU108,\"2?\",BN104:BN108,CF104:CF108)+MINIF(BC104:BC108,BU104:BU108,\"3?\",BN104:BN108,CF104:CF108)+MINIF(BC104:BC108,BU104:BU108,\"4?\",BN104:BN108,CF104:CF108)+MINIF(BC104:BC108,BU104:BU108,\"5?\",BN104:BN108,CF104:CF108)+MINIF(BC104:BC108,BU104:BU108,\"6?\",BN104:BN108,CF104:CF108)+MINIF(BC104:BC108,BU104:BU108,\"7?\",BN104:BN108,CF104:CF108)+MINIF(BC104:BC108,BU104:BU108,\"8?\",BN104:BN108,CF104:CF108)+MINIF(BC104:BC108,BU104:BU108,\"9?\",BN104:BN108,CF104:CF108)+MINIF(BC104:BC108,BU104:BU108,\"10?\",BN104:BN108,CF104:CF108),IF(COUNTIF(BN104:BN108,\"NA\")+COUNTIF(CF104:CF108,\"NA\")=IF($AZ$4=\"missing\",10,SUM($BD$4:$BM$4)),0,\"missing\")))))","v":"missing"},{"$f":"IF(AND(ISNUMBER(CK104),COUNT(BN104:BN108,CF104:CF108)+COUNTIF(BN104:BN108,\"NA\")+COUNTIF(CF104:CF108,\"NA\")<IF($AZ$4=\"missing\",10,SUM($BD$4:$BM$4))),\"*\",\"\")","v":""},{"$f":"IF(AY104=\"\",\"\",IF(OR(AY104=0,AND(ISNUMBER($BN$12),$BN$12=0)),\"NA\",IF(COUNTIF(BM104:BM108,\"!error\")+COUNTIF(CE104:CE108,\"!error\")>0,\"!error\",IF(COUNT(BM104:BM108,CE104:CE108)>0,SUMIFF(BC104:BC108,\">0\",BM104:BM108)+SUMIFF(BU104:BU108,\">0\",CE104:CE108)+MINIF(BC104:BC108,BU104:BU108,\"1?\",BM104:BM108,CE104:CE108)+MINIF(BC104:BC108,BU104:BU108,\"2?\",BM104:BM108,CE104:CE108)+MINIF(BC104:BC108,BU104:BU108,\"3?\",BM104:BM108,CE104:CE108)+MINIF(BC104:BC108,BU104:BU108,\"4?\",BM104:BM108,CE104:CE108)+MINIF(BC104:BC108,BU104:BU108,\"5?\",BM104:BM108,CE104:CE108)+MINIF(BC104:BC108,BU104:BU108,\"6?\",BM104:BM108,CE104:CE108)+MINIF(BC104:BC108,BU104:BU108,\"7?\",BM104:BM108,CE104:CE108)+MINIF(BC104:BC108,BU104:BU108,\"8?\",BM104:BM108,CE104:CE108)+MINIF(BC104:BC108,BU104:BU108,\"9?\",BM104:BM108,CE104:CE108)+MINIF(BC104:BC108,BU104:BU108,\"10?\",BM104:BM108,CE104:CE108),IF(COUNTIF(BM104:BM108,\"NA\")+COUNTIF(CE104:CE108,\"NA\")=IF($AZ$4=\"missing\",10,SUM($BD$4:$BM$4)),0,\"missing\")))))","v":"missing"},{"$f":"IF(AND(ISNUMBER(CM104),COUNT(BM104:BM108,CE104:CE108)+COUNTIF(BM104:BM108,\"NA\")+COUNTIF(CE104:CE108,\"NA\")<IF($AZ$4=\"missing\",10,SUM($BD$4:$BM$4))),\"*\",\"\")","v":""},{"$f":"IF(AY104=\"\",\"\",IF(AY104=0,\"NA\",IF(COUNTIF(BQ104:BQ108,\"!error\")+COUNTIF(CI104:CI108,\"!error\")>0,\"!error\",IF(COUNT(BQ104:BQ108,CI104:CI108)>0,SUMIFF(BC104:BC108,\">0\",BQ104:BQ108)+SUMIFF(BU104:BU108,\">0\",CI104:CI108)+MINIF(BC104:BC108,BU104:BU108,\"1?\",BQ104:BQ108,CI104:CI108)+MINIF(BC104:BC108,BU104:BU108,\"2?\",BQ104:BQ108,CI104:CI108)+MINIF(BC104:BC108,BU104:BU108,\"3?\",BQ104:BQ108,CI104:CI108)+MINIF(BC104:BC108,BU104:BU108,\"4?\",BQ104:BQ108,CI104:CI108)+MINIF(BC104:BC108,BU104:BU108,\"5?\",BQ104:BQ108,CI104:CI108)+MINIF(BC104:BC108,BU104:BU108,\"6?\",BQ104:BQ108,CI104:CI108)+MINIF(BC104:BC108,BU104:BU108,\"7?\",BQ104:BQ108,CI104:CI108)+MINIF(BC104:BC108,BU104:BU108,\"8?\",BQ104:BQ108,CI104:CI108)+MINIF(BC104:BC108,BU104:BU108,\"9?\",BQ104:BQ108,CI104:CI108)+MINIF(BC104:BC108,BU104:BU108,\"10?\",BQ104:BQ108,CI104:CI108),IF(COUNTIF(BQ104:BQ108,\"NA\")+COUNTIF(CI104:CI108,\"NA\")=IF($AZ$4=\"missing\",10,SUM($BD$4:$BM$4)),0,\"missing\")))))","v":"missing"},{"$f":"IF(AND(ISNUMBER(CO104),COUNT(BQ104:BQ108,CI104:CI108)+COUNTIF(BQ104:BQ108,\"NA\")+COUNTIF(CI104:CI108,\"NA\")<IF($AZ$4=\"missing\",10,SUM($BD$4:$BM$4))),\"*\",\"\")","v":""},{"$f":"IF(AY104=\"\",\"\",IF(OR(AY104=0,AND(ISNUMBER($BP$12),$BP$12=0)),\"NA\",IF(COUNTIF(BP104:BP108,\"!error\")+COUNTIF(CH104:CH108,\"!error\")>0,\"!error\",IF(COUNT(BP104:BP108,CH104:CH108)>0,SUMIFF(BC104:BC108,\">0\",BP104:BP108)+SUMIFF(BU104:BU108,\">0\",CH104:CH108)+MINIF(BC104:BC108,BU104:BU108,\"1?\",BP104:BP108,CH104:CH108)+MINIF(BC104:BC108,BU104:BU108,\"2?\",BP104:BP108,CH104:CH108)+MINIF(BC104:BC108,BU104:BU108,\"3?\",BP104:BP108,CH104:CH108)+MINIF(BC104:BC108,BU104:BU108,\"4?\",BP104:BP108,CH104:CH108)+MINIF(BC104:BC108,BU104:BU108,\"5?\",BP104:BP108,CH104:CH108)+MINIF(BC104:BC108,BU104:BU108,\"6?\",BP104:BP108,CH104:CH108)+MINIF(BC104:BC108,BU104:BU108,\"7?\",BP104:BP108,CH104:CH108)+MINIF(BC104:BC108,BU104:BU108,\"8?\",BP104:BP108,CH104:CH108)+MINIF(BC104:BC108,BU104:BU108,\"9?\",BP104:BP108,CH104:CH108)+MINIF(BC104:BC108,BU104:BU108,\"10?\",BP104:BP108,CH104:CH108),IF(COUNTIF(BP104:BP108,\"NA\")+COUNTIF(CH104:CH108,\"NA\")=IF($AZ$4=\"missing\",10,SUM($BD$4:$BM$4)),0,\"missing\")))))","v":"missing"},{"$f":"IF(AND(ISNUMBER(CQ104),COUNT(BP104:BP108,CH104:CH108)+COUNTIF(BP104:BP108,\"NA\")+COUNTIF(CH104:CH108,\"NA\")<IF($AZ$4=\"missing\",10,SUM($BD$4:$BM$4))),\"*\",\"\")","v":""},{"$f":"IF(AY104=\"\",\"\",IF(AND(CM104=\"NA\",CQ104=\"NA\"),\"NA\",IF(OR(AND(ISNUMBER(CM104),ISNUMBER(CQ104)),AND(ISNUMBER(CM104),CQ104=\"NA\"),AND(CM104=\"NA\",ISNUMBER(CQ104)),AND(ISNUMBER(CM104),CM104=0),AND(ISNUMBER(CQ104),CQ104=0)),MIN(CM104,CQ104),IF(OR(CM104=\"!error\",CQ104=\"!error\"),\"!error\",\"missing\"))))","v":"missing"},{"$f":"IF(ISNUMBER(CS104),IF(CM104<CQ104,IF(CN104=\"*\",\"*\",\"\"),IF(CQ104<CM104,IF(CR104=\"*\",\"*\",\"\"),IF(AND(CN104=\"*\",CR104=\"*\"),\"*\",\"\"))),\"\")","v":""},{"$f":"IF(ISNUMBER(CS104),IF(CM104<CQ104,\"(G)\",IF(CQ104<CM104,\"(V)\",IF(AND(CN104=\"\",CR104=\"*\"),\"(G)\",IF(AND(CN104=\"*\",CR104=\"\"),\"(V)\",\"(G/V)\")))),\"\")","v":""},null,{"$f":"IF(OR(BF104=\"ND\",BG104=\"ND\",BI104=\"ND\",BJ104=\"ND\"),\"ND\",\"data\")","v":"data"},{"$f":"IF(OR(BX104=\"ND\",BY104=\"ND\",CA104=\"ND\",CB104=\"ND\"),\"ND\",\"data\")","v":"data"}]
[null," ",{"$f":"$D$15","v":2},null,null,null,null,"missing",{"$f":"$BL105","v":"missing"},{"$f":"$BO105","v":"missing"},{"$f":"$BN105","v":"missing"},{"$f":"$BQ105","v":"missing"},null,null,null,null,{"$f":"IF(AND(BE105=1,D105>4,D105<>\"ND\"),\"Note: The inactivation credit in zone D\" & C105 & \" was restricted due to elevated free chlorine levels.\",\"\")","v":""},null,null,null,null,null,null,null,null,null,null,null,null,null,null,null,null,null,null,null,null,null,null,null,null,null,null,null,null,null,null,null,null,null,1,{"$f":"IF($BE$14=0,0,IF(COUNTIF(OFFSET($BD104,0,0,MIN($BE$14,5),1),\"<>NA\")+IF($BE$14>5,COUNTIF(OFFSET($BV104,0,0,$BE$14-5,1),\"<>NA\"),0),1,0))","v":1},{"$f":"IF($BE$14=0,0,IF(COUNTIF(OFFSET($BD104,0,0,MIN($BE$14,5),1),\"O3\")+COUNTIF(OFFSET($BD104,0,0,MIN($BE$14,5),1),\"O3 Cell 1\")+IF($BE$14>5,COUNTIF(OFFSET($BV104,0,0,$BE$14-5,1),\"O3\"),0)+IF($BE$14>5,COUNTIF(OFFSET($BV104,0,0,$BE$14-5,1),\"O3 Cell 1\"),0),1,0))","v":0},{"$f":"IF(OR($AY105=0,AND(COUNTA(D105,F105:G105)=0,COUNTIF(E105,0))),\"NA\",IF(COUNTA(D105:G105),IF(BA105,4,5),IF($BE$15=1,IF(BA105,4,IF(AZ105,5,6)),IF(BD105=\"!error\",IF(BA105,4,5),IF(BA105,\"5B\",6)))))","v":5},{"$f":"$BE$11","v":2},{"$f":"IF(AND(IF($BN$4=\"missing\",10,$BN$4)>=2,$AY105<>\"\"),IF(OR($AY105=0,AND($B105=\"NA\",COUNTA($D105,$F105:$G105)=0,COUNTIF($E105,0)),AND($B105=\"NA\",COUNTA($D105:$G105)=0,IF($BE$14=0,0,COUNTIF(OFFSET($BD104,0,0,MIN($BE$14,5),1),\"NA\")+IF($BE$14>5,COUNTIF(OFFSET($BV104,0,0,$BE$14-5,1),\"NA\"),0))=$BE$14),AND($B105=\"NA\",COUNTA($D105:$G105)=0,IF($BE$14<5,COUNTA(OFFSET($D104,$BE$14,0,MIN(5-$BE$14,$BE$15),4))-COUNTIF(OFFSET($E104,$BE$14,0,MIN(5-$BE$14,$BE$15),1),0),0)+IF($BE$14+$BE$15>5,COUNTA(OFFSET($D109,MAX($BE$14-5,0),0,MIN($BE$14+$BE$15-5,$BE$15),4))-COUNTIF(OFFSET($E109,MAX($BE$14-5,0),0,MIN($BE$14+$BE$15-5,$BE$15),1),0),0)),AND($B105=\"NA\",COUNTA($D105:$G105)=0,IF($BE$14<5,COUNTIF(OFFSET($B104,$BE$14,0,MIN(5-$BE$14,$BE$15),1),\"NA\"),0)+IF($BE$14+$BE$15>5,COUNTIF(OFFSET($B109,MAX($BE$14-5,0),0,MIN($BE$14+$BE$15-5,$BE$15),1),\"NA\"),0)<>$BE$15)),\"NA\",IF($B105=\"\",\"missing\",IF(AND($B105<>\"NA\",COUNTA($D105,$F105:$G105)+COUNTIF($E105,\"<>0\")),UPPER($B105),\"!error\"))),\"\")","v":" "},0,{"$f":"IF(BD105=\"\",\"\",IF(BD105=\"NA\",\"NA\",IF(ISBLANK($D105),\"missing\",IF(AND(BE105=1,ISNUMBER($D105),$D105>4),4,IF(AND(ISNUMBER($D105),$D105>=0),$D105,IF(AND(ISTEXT($D105),$D105=\"ND\"),\"ND\",\"!error\"))))))","v":"missing"},{"$f":"IF(BD105=\"\",\"\",IF(BD105=\"NA\",\"NA\",IF(ISBLANK($E105),\"missing\",IF(OR(AND(ISBLANK($B105),COUNT(BF105,BI105:BJ105)=0,ISNUMBER($E105),$E105=0),AND(ISNUMBER($E105),$E105>0),AND(ISTEXT($E105),$E105=\"ND\")),$E105,\"!error\"))))","v":"missing"},{"$f":"IF(BD105=\"\",\"\",IF(AY105=0,\"NA\",IF(OR($BE$12=\"!error\",$BE$13=\"!error\",BG105=\"!error\"),\"!error\",IF(BD105=\"NA\",\"NA\",IF(AND(ISNUMBER(BG105),BG105=0),0,IF(AND(ISNUMBER($BE$12),ISNUMBER($BE$13),ISNUMBER(BG105)),$BE$13*$BE$12/BG105,IF(BG105=\"ND\",\"ND\",\"missing\")))))))","v":"missing"},{"$f":"IF(BD105=\"\",\"\",IF(BD105=\"NA\",\"NA\",IF(ISBLANK($F105),\"missing\",IF(OR(ISNUMBER($F105),$F105=\"ND\"),$F105,\"!error\"))))","v":"missing"},{"$f":"IF(BD105=\"\",\"\",IF(BD105=\"NA\",\"NA\",IF(ISBLANK($G105),\"missing\",IF(OR(AND(ISNUMBER($G105),$G105>=0,$G105<=14),$G105=\"ND\"),$G105,\"!error\"))))","v":"missing"},"missing",{"$f":"IF(BD105=\"\",\"\",IF(AY105=0,\"NA\",IF(CW105=\"ND\",\"ND\",IF(OR($BN$12=\"!error\",BD105=\"!error\",AND(BD105=\"missing\",ISNUMBER(BF105)),IF(BE105=1,BF105=\"!error\",0),BI105=\"!error\",BJ105=\"!error\"),\"!error\",IF(OR(BD105=\"NA\",AND(ISNUMBER($BN$12),$BN$12=0),AND(BE105<>0,ISNUMBER(BK105),BK105=0),AND(BE105=1,ISNUMBER(BJ105),BJ105>9),AND(BE105=2,ISNUMBER(BJ105),OR(BJ105<6,BJ105>=9.5)),AND(OR(BE105=3,BE105=4),ISNUMBER(BJ105),OR(BJ105<5.5,BJ105>=9.5))),\"NA\",IF(AND(ISNUMBER($BN$12),BE105<>0,IF(BE105=1,ISNUMBER(BF105),1),ISNUMBER(BI105),ISNUMBER(BJ105)),CT_Giardia(BE105,$BN$12,BI105,BJ105,IF(BE105=1,BF105,)),IF(COUNTIF(BE105,\"<>0\")+COUNT(BF105,BG105,BI105,BJ105)=5,\"!error\",\"missing\")))))))","v":"missing"},{"$f":"IF(BD105=\"\",\"\",IF(OR(AY105=0,AND(ISNUMBER($BN$12),$BN$12=0)),\"NA\",IF(CW105=\"ND\",\"ND\",IF(OR(BK105=\"!error\",BL105=\"!error\",BN105=\"!error\"),\"!error\",IF(BD105=\"NA\",\"NA\",IF(BL105=\"NA\",0,IF(AND(BE105<>99,ISNUMBER(BK105),ISNUMBER(BL105)),BK105/BL105,IF(AND(BE105=99,BN105=0.5),BN105/$BN$12,\"missing\"))))))))","v":"missing"},{"$f":"IF(BD105=\"\",\"\",IF(AY105=0,\"NA\",IF(CW105=\"ND\",\"ND\",IF(OR(BD105=\"!error\",AND(BD105=\"missing\",ISNUMBER(BF105)),BF105=\"!error\",BH105=\"!error\",BI105=\"!error\",BJ105=\"!error\"),\"!error\",IF(BD105=\"NA\",\"NA\",IF(OR(AND(BE105<>0,ISNUMBER(BK105),BK105=0),AND(BE105=1,ISNUMBER(BJ105),BJ105>9),AND(BE105=2,ISNUMBER(BJ105),OR(BJ105<6,BJ105>=9.5)),AND(OR(BE105=3,BE105=4),ISNUMBER(BJ105),OR(BJ105<5.5,BJ105>=9.5))),0,IF(AND(ISNUMBER($BN$12),BE105<>0,ISNUMBER(BF105),ISNUMBER(BH105),ISNUMBER(BI105),ISNUMBER(BJ105)),log_Giardia(BE105,$BN$12,BI105,BJ105,BF105,BH105),IF(COUNTIF(BE105,\"<>0\")+COUNT(BF105,BG105,BI105,BJ105)=5,\"!error\",\"missing\"))))))))","v":"missing"},{"$f":"IF(BD105=\"\",\"\",IF(AY105=0,\"NA\",IF(CW105=\"ND\",\"ND\",IF(OR($BP$12=\"!error\",BD105=\"!error\",AND(BD105=\"missing\",ISNUMBER(BF105)),BI105=\"!error\",BJ105=\"!error\"),\"!error\",IF(OR(BD105=\"NA\",AND(ISNUMBER($BP$12),$BP$12=0),AND(BE105<>0,ISNUMBER(BK105),BK105=0),AND(BE105=1,ISNUMBER(BJ105),BJ105>=10.5),AND(BE105=2,ISNUMBER(BJ105),OR(BJ105<6,BJ105>=9.5)),AND(BE105=3,ISNUMBER(BJ105),OR(BJ105<6,BJ105>9)),AND(BE105=4,ISNUMBER(BJ105),OR(BJ105<6,BJ105>10))),\"NA\",IF(AND(ISNUMBER($BP$12),BE105<>0,ISNUMBER(BI105),ISNUMBER(BJ105)),CT_Virus(BE105,$BP$12,BI105,BJ105),IF(COUNTIF(BE105,\"<>0\")+COUNT(BF105,BG105,BI105,BJ105)=5,\"!error\",\"missing\")))))))","v":"missing"},{"$f":"IF(BD105=\"\",\"\",IF(OR(AY105=0,AND(ISNUMBER($BP$12),$BP$12=0)),\"NA\",IF(CW105=\"ND\",\"ND\",IF(OR(BK105=\"!error\",BO105=\"!error\",BQ105=\"!error\"),\"!error\",IF(BD105=\"NA\",\"NA\",IF(BO105=\"NA\",0,IF(AND(BE105<>99,ISNUMBER(BK105),ISNUMBER(BO105)),BK105/BO105,IF(AND(BE105=99,BQ105=1),BQ105/$BP$12,\"missing\"))))))))","v":"missing"},{"$f":"IF(BD105=\"\",\"\",IF(AY105=0,\"NA\",IF(CW105=\"ND\",\"ND\",IF(OR(BD105=\"!error\",AND(BD105=\"missing\",ISNUMBER(BF105)),BF105=\"!error\",BH105=\"!error\",BI105=\"!error\",BJ105=\"!error\"),\"!error\",IF(BD105=\"NA\",\"NA\",IF(OR(AND(BE105<>0,ISNUMBER(BK105),BK105=0),AND(BE105=1,ISNUMBER(BJ105),BJ105>=10.5),AND(BE105=2,ISNUMBER(BJ105),OR(BJ105<6,BJ105>=9.5)),AND(BE105=3,ISNUMBER(BJ105),OR(BJ105<6,BJ105>9)),AND(BE105=4,ISNUMBER(BJ105),OR(BJ105<6,BJ105>10))),0,IF(AND(ISNUMBER($BP$12),BE105<>0,ISNUMBER(BF105),ISNUMBER(BH105),ISNUMBER(BI105),ISNUMBER(BJ105)),Log_Virus(BE105,$BP$12,BI105,BJ105,BF105,BH105),IF(COUNTIF(BE105,\"<>0\")+COUNT(BF105,BG105,BI105,BJ105)=5,\"!error\",\"missing\"))))))))","v":"missing"},{"$f":"IF($BJ$14=0,0,IF(COUNTIF(OFFSET($BD104,0,0,MIN($BJ$14,5),1),\"<>NA\")+IF($BJ$14>5,COUNTIF(OFFSET($BV104,0,0,$BJ$14-5,1),\"<>NA\"),0),1,0))","v":1},{"$f":"IF($BJ$14=0,0,IF(COUNTIF(OFFSET($BD104,0,0,MIN($BJ$14,5),1),\"O3\")+COUNTIF(OFFSET($BD104,0,0,MIN($BJ$14,5),1),\"O3 Cell 1\")+IF($BJ$14>5,COUNTIF(OFFSET($BV104,0,0,$BJ$14-5,1),\"O3\"),0)+IF($BJ$14>5,COUNTIF(OFFSET($BV104,0,0,$BJ$14-5,1),\"O3 Cell 1\"),0),1,0))","v":0},{"$f":"IF(OR($AY105=0,AND(COUNTA(D110,F110:G110)=0,COUNTIF(E110,0))),\"NA\",IF(COUNTA(D110:G110),IF(BS105,4,5),IF($BJ$15=1,IF(BS105,4,IF(BR105,5,6)),IF(BV105=\"!error\",IF(BS105,4,5),IF(BS105,\"5B\",6)))))","v":6},{"$f":"$BJ$11","v":7},{"$f":"IF(AND(IF($BN$4=\"missing\",10,$BN$4)>=7,$AY105<>\"\"),IF(OR($AY105=0,AND($B110=\"NA\",COUNTA($D110,$F110:$G110)=0,COUNTIF($E110,0)),AND($B110=\"NA\",COUNTA($D110:$G110)=0,IF($BJ$14=0,0,COUNTIF(OFFSET($BD104,0,0,MIN($BJ$14,5),1),\"NA\")+IF($BJ$14>5,COUNTIF(OFFSET($BV104,0,0,$BJ$14-5,1),\"NA\"),0))=$BJ$14),AND($B110=\"NA\",COUNTA($D110:$G110)=0,IF($BJ$14<5,COUNTA(OFFSET($D104,$BJ$14,0,MIN(5-$BJ$14,$BJ$15),4))-COUNTIF(OFFSET($E104,$BJ$14,0,MIN(5-$BJ$14,$BJ$15),1),0),0)+IF($BJ$14+$BJ$15>5,COUNTA(OFFSET($D109,MAX($BJ$14-5,0),0,MIN($BJ$14+$BJ$15-5,$BJ$15),4))-COUNTIF(OFFSET($E109,MAX($BJ$14-5,0),0,MIN($BJ$14+$BJ$15-5,$BJ$15),1),0),0)),AND($B110=\"NA\",COUNTA($D110:$G110)=0,IF($BJ$14<5,COUNTIF(OFFSET($B104,$BJ$14,0,MIN(5-$BJ$14,$BJ$15),1),\"NA\"),0)+IF($BJ$14+$BJ$15>5,COUNTIF(OFFSET($B109,MAX($BJ$14-5,0),0,MIN($BJ$14+$BJ$15-5,$BJ$15),1),\"NA\"),0)<>$BJ$15)),\"NA\",IF($B110=\"\",\"missing\",IF(AND($B110<>\"NA\",COUNTA($D110,$F110:$G110)+COUNTIF($E110,\"<>0\")),UPPER($B110),\"!error\"))),\"\")","v":""},"",{"$f":"IF(BV105=\"\",\"\",IF(BV105=\"NA\",\"NA\",IF(ISBLANK($D110),\"missing\",IF(AND(BW105=1,ISNUMBER($D110),$D110>4),4,IF(AND(ISNUMBER($D110),$D110>=0),$D110,IF(AND(ISTEXT($D110),$D110=\"ND\"),\"ND\",\"!error\"))))))","v":""},{"$f":"IF(BV105=\"\",\"\",IF(BV105=\"NA\",\"NA\",IF(ISBLANK($E110),\"missing\",IF(OR(AND(ISBLANK($B110),COUNT(BX105,CA105:CB105)=0,ISNUMBER($E110),$E110=0),AND(ISNUMBER($E110),$E110>0),AND(ISTEXT($E110),$E110=\"ND\")),$E110,\"!error\"))))","v":""},{"$f":"IF(BV105=\"\",\"\",IF(AY105=0,\"NA\",IF(OR($BJ$12=\"!error\",$BJ$13=\"!error\",BY105=\"!error\"),\"!error\",IF(BV105=\"NA\",\"NA\",IF(AND(ISNUMBER(BY105),BY105=0),0,IF(AND(ISNUMBER($BJ$12),ISNUMBER($BJ$13),ISNUMBER(BY105)),$BJ$13*$BJ$12/BY105,IF(BY105=\"ND\",\"ND\",\"missing\")))))))","v":""},{"$f":"IF(BV105=\"\",\"\",IF(BV105=\"NA\",\"NA\",IF(ISBLANK($F110),\"missing\",IF(OR(ISNUMBER($F110),$F110=\"ND\"),$F110,\"!error\"))))","v":""},{"$f":"IF(BV105=\"\",\"\",IF(BV105=\"NA\",\"NA\",IF(ISBLANK($G110),\"missing\",IF(OR(AND(ISNUMBER($G110),$G110>=0,$G110<=14),$G110=\"ND\"),$G110,\"!error\"))))","v":""},"",{"$f":"IF(BV105=\"\",\"\",IF(AY105=0,\"NA\",IF(CX105=\"ND\",\"ND\",IF(OR($BN$12=\"!error\",BV105=\"!error\",AND(BV105=\"missing\",ISNUMBER(BX105)),IF(BW105=1,BX105=\"!error\",0),CA105=\"!error\",CB105=\"!error\"),\"!error\",IF(OR(BV105=\"NA\",AND(ISNUMBER($BN$12),$BN$12=0),AND(BW105<>0,ISNUMBER(CC105),CC105=0),AND(BW105=1,ISNUMBER(CB105),CB105>9),AND(BW105>1,ISNUMBER(CB105),OR(CB105<6,CB105>=9.5))),\"NA\",IF(AND(ISNUMBER($BN$12),BW105<>0,IF(BW105=1,ISNUMBER(BX105),1),ISNUMBER(CA105),ISNUMBER(CB105)),CT_Giardia(BW105,$BN$12,CA105,CB105,IF(BW105=1,BX105,)),IF(COUNTIF(BW105,\"<>0\")+COUNT(BX105,BY105,CA105,CB105)=5,\"!error\",\"missing\")))))))","v":""},{"$f":"IF(BV105=\"\",\"\",IF(OR(AY105=0,AND(ISNUMBER($BN$12),$BN$12=0)),\"NA\",IF(CX105=\"ND\",\"ND\",IF(OR(CC105=\"!error\",CD105=\"!error\",CF105=\"!error\"),\"!error\",IF(BV105=\"NA\",\"NA\",IF(CD105=\"NA\",0,IF(AND(ISNUMBER(CC105),ISNUMBER(CD105)),CC105/CD105,IF(AND(BW105=99,CF105=0.5),CF105/$BN$12,\"missing\"))))))))","v":""},{"$f":"IF(BV105=\"\",\"\",IF(AY105=0,\"NA\",IF(CX105=\"ND\",\"ND\",IF(OR(BV105=\"!error\",AND(BV105=\"missing\",ISNUMBER(BX105)),BX105=\"!error\",BZ105=\"!error\",CA105=\"!error\",CB105=\"!error\"),\"!error\",IF(BV105=\"NA\",\"NA\",IF(OR(AND(BW105<>0,ISNUMBER(CC105),CC105=0),AND(BW105=1,ISNUMBER(CB105),CB105>9),AND(BW105>1,ISNUMBER(CB105),OR(CB105<6,CB105>=9.5))),0,IF(AND(ISNUMBER($BN$12),BW105<>0,ISNUMBER(BX105),ISNUMBER(BZ105),ISNUMBER(CA105),ISNUMBER(CB105)),log_Giardia(BW105,$BN$12,CA105,CB105,BX105,BZ105),IF(COUNTIF(BW105,\"<>0\")+COUNT(BX105,BY105,CA105,CB105)=5,\"!error\",\"missing\"))))))))","v":""},{"$f":"IF(BV105=\"\",\"\",IF(AY105=0,\"NA\",IF(CX105=\"ND\",\"ND\",IF(OR($BP$12=\"!error\",BV105=\"!error\",AND(BV105=\"missing\",ISNUMBER(BX105)),CA105=\"!error\",CB105=\"!error\"),\"!error\",IF(OR(BV105=\"NA\",AND(ISNUMBER($BP$12),$BP$12=0),AND(BW105<>0,ISNUMBER(CC105),CC105=0),AND(BW105=1,ISNUMBER(CB105),OR(CB105<5.5,CB105>=10.5)),AND(OR(BW105=2,BW105=4),ISNUMBER(CB105),OR(CB105<6,CB105>=9.5)),AND(BW105=3,ISNUMBER(CB105),OR(CB105<6,CB105>9))),\"NA\",IF(AND(ISNUMBER($BP$12),BW105<>0,ISNUMBER(CA105),ISNUMBER(CB105)),CT_Virus(BW105,$BP$12,CA105,CB105),IF(COUNTIF(BW105,\"<>0\")+COUNT(BX105,BY105,CA105,CB105)=5,\"!error\",\"missing\")))))))","v":""},{"$f":"IF(BV105=\"\",\"\",IF(OR(AY105=0,AND(ISNUMBER($BP$12),$BP$12=0)),\"NA\",IF(CX105=\"ND\",\"ND\",IF(OR(CC105=\"!error\",CG105=\"!error\",CI105=\"!error\"),\"!error\",IF(BV105=\"NA\",\"NA\",IF(CG105=\"NA\",0,IF(AND(ISNUMBER(CC105),ISNUMBER(CG105)),CC105/CG105,IF(AND(BW105=99,CI105=1),CI105/$BP$12,\"missing\"))))))))","v":""},{"$f":"IF(BV105=\"\",\"\",IF(AY105=0,\"NA\",IF(CX105=\"ND\",\"ND\",IF(OR(BV105=\"!error\",AND(BV105=\"missing\",ISNUMBER(BX105)),BX105=\"!error\",BZ105=\"!error\",CA105=\"!error\",CB105=\"!error\"),\"!error\",IF(BV105=\"NA\",\"NA\",IF(OR(AND(BW105<>0,ISNUMBER(CC105),CC105=0),AND(BW105=1,ISNUMBER(CB105),OR(CB105<5.5,CB105>=10.5)),AND(OR(BW105=2,BW105=4),ISNUMBER(CB105),OR(CB105<6,CB105>=9.5)),AND(BW105=3,ISNUMBER(CB105),OR(CB105<6,CB105>9))),0,IF(AND(ISNUMBER($BP$12),BW105<>0,ISNUMBER(BX105),ISNUMBER(BZ105),ISNUMBER(CA105),ISNUMBER(CB105)),Log_Virus(BW105,$BP$12,CA105,CB105,BX105,BZ105),IF(COUNTIF(BW105,\"<>0\")+COUNT(BX105,BY105,CA105,CB105)=5,\"!error\",\"missing\"))))))))","v":""},null,null,null,null,null,null,null,null,null,null,null,null,null,{"$f":"IF(OR(BF105=\"ND\",BG105=\"ND\",BI105=\"ND\",BJ105=\"ND\"),\"ND\",\"data\")","v":"data"},{"$f":"IF(OR(BX105=\"ND\",BY105=\"ND\",CA105=\"ND\",CB105=\"ND\"),\"ND\",\"data\")","v":"data"}]
[null," ",{"$f":"$E$15","v":3},null,null,null,null,{"$f":"IF(BL106=\"!error\",\"!error\",$BK106)","v":"missing"},"missing","missing","missing","missing",null,null,null,null,"",null,null,null,null,null,null,null,null,null,null,null,null,null,null,null,null,null,null,null,null,null,null,null,null,null,null,null,null,null,null,null,null,null,1,{"$f":"IF($BF$14=0,0,IF(COUNTIF(OFFSET($BD104,0,0,MIN($BF$14,5),1),\"<>NA\")+IF($BF$14>5,COUNTIF(OFFSET($BV104,0,0,$BF$14-5,1),\"<>NA\"),0),1,0))","v":1},{"$f":"IF($BF$14=0,0,IF(COUNTIF(OFFSET($BD104,0,0,MIN($BF$14,5),1),\"O3\")+COUNTIF(OFFSET($BD104,0,0,MIN($BF$14,5),1),\"O3 Cell 1\")+IF($BF$14>5,COUNTIF(OFFSET($BV104,0,0,$BF$14-5,1),\"O3\"),0)+IF($BF$14>5,COUNTIF(OFFSET($BV104,0,0,$BF$14-5,1),\"O3 Cell 1\"),0),1,0))","v":0},{"$f":"IF(OR($AY106=0,AND(COUNTA(D106,F106:G106)=0,COUNTIF(E106,0))),\"NA\",IF(COUNTA(D106:G106),IF(BA106,4,5),IF($BF$15=1,IF(BA106,4,IF(AZ106,5,6)),IF(BD106=\"!error\",IF(BA106,4,5),IF(BA106,\"5B\",6)))))","v":5},{"$f":"$BF$11","v":3},{"$f":"IF(AND(IF($BN$4=\"missing\",10,$BN$4)>=3,$AY106<>\"\"),IF(OR($AY106=0,AND($B106=\"NA\",COUNTA($D106,$F106:$G106)=0,COUNTIF($E106,0)),AND($B106=\"NA\",COUNTA($D106:$G106)=0,IF($BF$14=0,0,COUNTIF(OFFSET($BD104,0,0,MIN($BF$14,5),1),\"NA\")+IF($BF$14>5,COUNTIF(OFFSET($BV104,0,0,$BF$14-5,1),\"NA\"),0))=$BF$14),AND($B106=\"NA\",COUNTA($D106:$G106)=0,IF($BF$14<5,COUNTA(OFFSET($D104,$BF$14,0,MIN(5-$BF$14,$BF$15),4))-COUNTIF(OFFSET($E104,$BF$14,0,MIN(5-$BF$14,$BF$15),1),0),0)+IF($BF$14+$BF$15>5,COUNTA(OFFSET($D109,MAX($BF$14-5,0),0,MIN($BF$14+$BF$15-5,$BF$15),4))-COUNTIF(OFFSET($E109,MAX($BF$14-5,0),0,MIN($BF$14+$BF$15-5,$BF$15),1),0),0)),AND($B106=\"NA\",COUNTA($D106:$G106)=0,IF($BF$14<5,COUNTIF(OFFSET($B104,$BF$14,0,MIN(5-$BF$14,$BF$15),1),\"NA\"),0)+IF($BF$14+$BF$15>5,COUNTIF(OFFSET($B109,MAX($BF$14-5,0),0,MIN($BF$14+$BF$15-5,$BF$15),1),\"NA\"),0)<>$BF$15)),\"NA\",IF($B106=\"\",\"missing\",IF(AND($B106<>\"NA\",COUNTA($D106,$F106:$G106)+COUNTIF($E106,\"<>0\")),UPPER($B106),\"!error\"))),\"\")","v":" "},0,"missing","missing",{"$f":"IF(BD106=\"\",\"\",IF(AY106=0,\"NA\",IF(OR($BF$12=\"!error\",$BF$13=\"!error\",BG106=\"!error\"),\"!error\",IF(BD106=\"NA\",\"NA\",IF(AND(ISNUMBER(BG106),BG106=0),0,IF(AND(ISNUMBER($BF$12),ISNUMBER($BF$13),ISNUMBER(BG106)),$BF$13*$BF$12/BG106,IF(BG106=\"ND\",\"ND\",\"missing\")))))))","v":"missing"},"missing","missing","missing",{"$f":"IF(BD106=\"\",\"\",IF(AY106=0,\"NA\",IF(CW106=\"ND\",\"ND\",IF(OR($BN$12=\"!error\",BD106=\"!error\",AND(BD106=\"missing\",ISNUMBER(BF106)),IF(BE106=1,BF106=\"!error\",0),BI106=\"!error\",BJ106=\"!error\"),\"!error\",IF(OR(BD106=\"NA\",AND(ISNUMBER($BN$12),$BN$12=0),AND(BE106<>0,ISNUMBER(BK106),BK106=0),AND(BE106=1,ISNUMBER(BJ106),BJ106>9),AND(BE106=2,ISNUMBER(BJ106),OR(BJ106<6,BJ106>=9.5)),AND(OR(BE106=3,BE106=4),ISNUMBER(BJ106),OR(BJ106<5.5,BJ106>=9.5))),\"NA\",IF(AND(ISNUMBER($BN$12),BE106<>0,IF(BE106=1,ISNUMBER(BF106),1),ISNUMBER(BI106),ISNUMBER(BJ106)),CT_Giardia(BE106,$BN$12,BI106,BJ106,IF(BE106=1,BF106,)),IF(COUNTIF(BE106,\"<>0\")+COUNT(BF106,BG106,BI106,BJ106)=5,\"!error\",\"missing\")))))))","v":"missing"},{"$f":"IF(BD106=\"\",\"\",IF(OR(AY106=0,AND(ISNUMBER($BN$12),$BN$12=0)),\"NA\",IF(CW106=\"ND\",\"ND\",IF(OR(BK106=\"!error\",BL106=\"!error\",BN106=\"!error\"),\"!error\",IF(BD106=\"NA\",\"NA\",IF(BL106=\"NA\",0,IF(AND(BE106<>99,ISNUMBER(BK106),ISNUMBER(BL106)),BK106/BL106,IF(AND(BE106=99,BN106=0.5),BN106/$BN$12,\"missing\"))))))))","v":"missing"},{"$f":"IF(BD106=\"\",\"\",IF(AY106=0,\"NA\",IF(CW106=\"ND\",\"ND\",IF(OR(BD106=\"!error\",AND(BD106=\"missing\",ISNUMBER(BF106)),BF106=\"!error\",BH106=\"!error\",BI106=\"!error\",BJ106=\"!error\"),\"!error\",IF(BD106=\"NA\",\"NA\",IF(OR(AND(BE106<>0,ISNUMBER(BK106),BK106=0),AND(BE106=1,ISNUMBER(BJ106),BJ106>9),AND(BE106=2,ISNUMBER(BJ106),OR(BJ106<6,BJ106>=9.5)),AND(OR(BE106=3,BE106=4),ISNUMBER(BJ106),OR(BJ106<5.5,BJ106>=9.5))),0,IF(AND(ISNUMBER($BN$12),BE106<>0,ISNUMBER(BF106),ISNUMBER(BH106),ISNUMBER(BI106),ISNUMBER(BJ106)),log_Giardia(BE106,$BN$12,BI106,BJ106,BF106,BH106),IF(COUNTIF(BE106,\"<>0\")+COUNT(BF106,BG106,BI106,BJ106)=5,\"!error\",\"missing\"))))))))","v":"missing"},{"$f":"IF(BD106=\"\",\"\",IF(AY106=0,\"NA\",IF(CW106=\"ND\",\"ND\",IF(OR($BP$12=\"!error\",BD106=\"!error\",AND(BD106=\"missing\",ISNUMBER(BF106)),BI106=\"!error\",BJ106=\"!error\"),\"!error\",IF(OR(BD106=\"NA\",AND(ISNUMBER($BP$12),$BP$12=0),AND(BE106<>0,ISNUMBER(BK106),BK106=0),AND(BE106=1,ISNUMBER(BJ106),BJ106>=10.5),AND(BE106=2,ISNUMBER(BJ106),OR(BJ106<6,BJ106>=9.5)),AND(BE106=3,ISNUMBER(BJ106),OR(BJ106<6,BJ106>9)),AND(BE106=4,ISNUMBER(BJ106),OR(BJ106<6,BJ106>10))),\"NA\",IF(AND(ISNUMBER($BP$12),BE106<>0,ISNUMBER(BI106),ISNUMBER(BJ106)),CT_Virus(BE106,$BP$12,BI106,BJ106),IF(COUNTIF(BE106,\"<>0\")+COUNT(BF106,BG106,BI106,BJ106)=5,\"!error\",\"missing\")))))))","v":"missing"},{"$f":"IF(BD106=\"\",\"\",IF(OR(AY106=0,AND(ISNUMBER($BP$12),$BP$12=0)),\"NA\",IF(CW106=\"ND\",\"ND\",IF(OR(BK106=\"!error\",BO106=\"!error\",BQ106=\"!error\"),\"!error\",IF(BD106=\"NA\",\"NA\",IF(BO106=\"NA\",0,IF(AND(BE106<>99,ISNUMBER(BK106),ISNUMBER(BO106)),BK106/BO106,IF(AND(BE106=99,BQ106=1),BQ106/$BP$12,\"missing\"))))))))","v":"missing"},{"$f":"IF(BD106=\"\",\"\",IF(AY106=0,\"NA\",IF(CW106=\"ND\",\"ND\",IF(OR(BD106=\"!error\",AND(BD106=\"missing\",ISNUMBER(BF106)),BF106=\"!error\",BH106=\"!error\",BI106=\"!error\",BJ106=\"!error\"),\"!error\",IF(BD106=\"NA\",\"NA\",IF(OR(AND(BE106<>0,ISNUMBER(BK106),BK106=0),AND(BE106=1,ISNUMBER(BJ106),BJ106>=10.5),AND(BE106=2,ISNUMBER(BJ106),OR(BJ106<6,BJ106>=9.5)),AND(BE106=3,ISNUMBER(BJ106),OR(BJ106<6,BJ106>9)),AND(BE106=4,ISNUMBER(BJ106),OR(BJ106<6,BJ106>10))),0,IF(AND(ISNUMBER($BP$12),BE106<>0,ISNUMBER(BF106),ISNUMBER(BH106),ISNUMBER(BI106),ISNUMBER(BJ106)),Log_Virus(BE106,$BP$12,BI106,BJ106,BF106,BH106),IF(COUNTIF(BE106,\"<>0\")+COUNT(BF106,BG106,BI106,BJ106)=5,\"!error\",\"missing\"))))))))","v":"missing"},{"$f":"IF($BK$14=0,0,IF(COUNTIF(OFFSET($BD104,0,0,MIN($BK$14,5),1),\"<>NA\")+IF($BK$14>5,COUNTIF(OFFSET($BV104,0,0,$BK$14-5,1),\"<>NA\"),0),1,0))","v":1},{"$f":"IF($BK$14=0,0,IF(COUNTIF(OFFSET($BD104,0,0,MIN($BK$14,5),1),\"O3\")+COUNTIF(OFFSET($BD104,0,0,MIN($BK$14,5),1),\"O3 Cell 1\")+IF($BK$14>5,COUNTIF(OFFSET($BV104,0,0,$BK$14-5,1),\"O3\"),0)+IF($BK$14>5,COUNTIF(OFFSET($BV104,0,0,$BK$14-5,1),\"O3 Cell 1\"),0),1,0))","v":0},{"$f":"IF(OR($AY106=0,AND(COUNTA(D111,F111:G111)=0,COUNTIF(E111,0))),\"NA\",IF(COUNTA(D111:G111),IF(BS106,4,5),IF($BK$15=1,IF(BS106,4,IF(BR106,5,6)),IF(BV106=\"!error\",IF(BS106,4,5),IF(BS106,\"5B\",6)))))","v":6},{"$f":"$BK$11","v":8},{"$f":"IF(AND(IF($BN$4=\"missing\",10,$BN$4)>=8,$AY106<>\"\"),IF(OR($AY106=0,AND($B111=\"NA\",COUNTA($D111,$F111:$G111)=0,COUNTIF($E111,0)),AND($B111=\"NA\",COUNTA($D111:$G111)=0,IF($BK$14=0,0,COUNTIF(OFFSET($BD104,0,0,MIN($BK$14,5),1),\"NA\")+IF($BK$14>5,COUNTIF(OFFSET($BV104,0,0,$BK$14-5,1),\"NA\"),0))=$BK$14),AND($B111=\"NA\",COUNTA($D111:$G111)=0,IF($BK$14<5,COUNTA(OFFSET($D104,$BK$14,0,MIN(5-$BK$14,$BK$15),4))-COUNTIF(OFFSET($E104,$BK$14,0,MIN(5-$BK$14,$BK$15),1),0),0)+IF($BK$14+$BK$15>5,COUNTA(OFFSET($D109,MAX($BK$14-5,0),0,MIN($BK$14+$BK$15-5,$BK$15),4))-COUNTIF(OFFSET($E109,MAX($BK$14-5,0),0,MIN($BK$14+$BK$15-5,$BK$15),1),0),0)),AND($B111=\"NA\",COUNTA($D111:$G111)=0,IF($BK$14<5,COUNTIF(OFFSET($B104,$BK$14,0,MIN(5-$BK$14,$BK$15),1),\"NA\"),0)+IF($BK$14+$BK$15>5,COUNTIF(OFFSET($B109,MAX($BK$14-5,0),0,MIN($BK$14+$BK$15-5,$BK$15),1),\"NA\"),0)<>$BK$15)),\"NA\",IF($B111=\"\",\"missing\",IF(AND($B111<>\"NA\",COUNTA($D111,$F111:$G111)+COUNTIF($E111,\"<>0\")),UPPER($B111),\"!error\"))),\"\")","v":""},"",{"$f":"IF(BV106=\"\",\"\",IF(BV106=\"NA\",\"NA\",IF(ISBLANK($D111),\"missing\",IF(AND(BW106=1,ISNUMBER($D111),$D111>4),4,IF(AND(ISNUMBER($D111),$D111>=0),$D111,IF(AND(ISTEXT($D111),$D111=\"ND\"),\"ND\",\"!error\"))))))","v":""},{"$f":"IF(BV106=\"\",\"\",IF(BV106=\"NA\",\"NA\",IF(ISBLANK($E111),\"missing\",IF(OR(AND(ISBLANK($B111),COUNT(BX106,CA106:CB106)=0,ISNUMBER($E111),$E111=0),AND(ISNUMBER($E111),$E111>0),AND(ISTEXT($E111),$E111=\"ND\")),$E111,\"!error\"))))","v":""},{"$f":"IF(BV106=\"\",\"\",IF(AY106=0,\"NA\",IF(OR($BK$12=\"!error\",$BK$13=\"!error\",BY106=\"!error\"),\"!error\",IF(BV106=\"NA\",\"NA\",IF(AND(ISNUMBER(BY106),BY106=0),0,IF(AND(ISNUMBER($BK$12),ISNUMBER($BK$13),ISNUMBER(BY106)),$BK$13*$BK$12/BY106,IF(BY106=\"ND\",\"ND\",\"missing\")))))))","v":""},{"$f":"IF(BV106=\"\",\"\",IF(BV106=\"NA\",\"NA\",IF(ISBLANK($F111),\"missing\",IF(OR(ISNUMBER($F111),$F111=\"ND\"),$F111,\"!error\"))))","v":""},{"$f":"IF(BV106=\"\",\"\",IF(BV106=\"NA\",\"NA\",IF(ISBLANK($G111),\"missing\",IF(OR(AND(ISNUMBER($G111),$G111>=0,$G111<=14),$G111=\"ND\"),$G111,\"!error\"))))","v":""},"",{"$f":"IF(BV106=\"\",\"\",IF(AY106=0,\"NA\",IF(CX106=\"ND\",\"ND\",IF(OR($BN$12=\"!error\",BV106=\"!error\",AND(BV106=\"missing\",ISNUMBER(BX106)),IF(BW106=1,BX106=\"!error\",0),CA106=\"!error\",CB106=\"!error\"),\"!error\",IF(OR(BV106=\"NA\",AND(ISNUMBER($BN$12),$BN$12=0),AND(BW106<>0,ISNUMBER(CC106),CC106=0),AND(BW106=1,ISNUMBER(CB106),CB106>9),AND(BW106>1,ISNUMBER(CB106),OR(CB106<6,CB106>=9.5))),\"NA\",IF(AND(ISNUMBER($BN$12),BW106<>0,IF(BW106=1,ISNUMBER(BX106),1),ISNUMBER(CA106),ISNUMBER(CB106)),CT_Giardia(BW106,$BN$12,CA106,CB106,IF(BW106=1,BX106,)),IF(COUNTIF(BW106,\"<>0\")+COUNT(BX106,BY106,CA106,CB106)=5,\"!error\",\"missing\")))))))","v":""},{"$f":"IF(BV106=\"\",\"\",IF(OR(AY106=0,AND(ISNUMBER($BN$12),$BN$12=0)),\"NA\",IF(CX106=\"ND\",\"ND\",IF(OR(CC106=\"!error\",CD106=\"!error\",CF106=\"!error\"),\"!error\",IF(BV106=\"NA\",\"NA\",IF(CD106=\"NA\",0,IF(AND(ISNUMBER(CC106),ISNUMBER(CD106)),CC106/CD106,IF(AND(BW106=99,CF106=0.5),CF106/$BN$12,\"missing\"))))))))","v":""},{"$f":"IF(BV106=\"\",\"\",IF(AY106=0,\"NA\",IF(CX106=\"ND\",\"ND\",IF(OR(BV106=\"!error\",AND(BV106=\"missing\",ISNUMBER(BX106)),BX106=\"!error\",BZ106=\"!error\",CA106=\"!error\",CB106=\"!error\"),\"!error\",IF(BV106=\"NA\",\"NA\",IF(OR(AND(BW106<>0,ISNUMBER(CC106),CC106=0),AND(BW106=1,ISNUMBER(CB106),CB106>9),AND(BW106>1,ISNUMBER(CB106),OR(CB106<6,CB106>=9.5))),0,IF(AND(ISNUMBER($BN$12),BW106<>0,ISNUMBER(BX106),ISNUMBER(BZ106),ISNUMBER(CA106),ISNUMBER(CB106)),log_Giardia(BW106,$BN$12,CA106,CB106,BX106,BZ106),IF(COUNTIF(BW106,\"<>0\")+COUNT(BX106,BY106,CA106,CB106)=5,\"!error\",\"missing\"))))))))","v":""},{"$f":"IF(BV106=\"\",\"\",IF(AY106=0,\"NA\",IF(CX106=\"ND\",\"ND\",IF(OR($BP$12=\"!error\",BV106=\"!error\",AND(BV106=\"missing\",ISNUMBER(BX106)),CA106=\"!error\",CB106=\"!error\"),\"!error\",IF(OR(BV106=\"NA\",AND(ISNUMBER($BP$12),$BP$12=0),AND(BW106<>0,ISNUMBER(CC106),CC106=0),AND(BW106=1,ISNUMBER(CB106),OR(CB106<5.5,CB106>=10.5)),AND(OR(BW106=2,BW106=4),ISNUMBER(CB106),OR(CB106<6,CB106>=9.5)),AND(BW106=3,ISNUMBER(CB106),OR(CB106<6,CB106>9))),\"NA\",IF(AND(ISNUMBER($BP$12),BW106<>0,ISNUMBER(CA106),ISNUMBER(CB106)),CT_Virus(BW106,$BP$12,CA106,CB106),IF(COUNTIF(BW106,\"<>0\")+COUNT(BX106,BY106,CA106,CB106)=5,\"!error\",\"missing\")))))))","v":""},{"$f":"IF(BV106=\"\",\"\",IF(OR(AY106=0,AND(ISNUMBER($BP$12),$BP$12=0)),\"NA\",IF(CX106=\"ND\",\"ND\",IF(OR(CC106=\"!error\",CG106=\"!error\",CI106=\"!error\"),\"!error\",IF(BV106=\"NA\",\"NA\",IF(CG106=\"NA\",0,IF(AND(ISNUMBER(CC106),ISNUMBER(CG106)),CC106/CG106,IF(AND(BW106=99,CI106=1),CI106/$BP$12,\"missing\"))))))))","v":""},{"$f":"IF(BV106=\"\",\"\",IF(AY106=0,\"NA\",IF(CX106=\"ND\",\"ND\",IF(OR(BV106=\"!error\",AND(BV106=\"missing\",ISNUMBER(BX106)),BX106=\"!error\",BZ106=\"!error\",CA106=\"!error\",CB106=\"!error\"),\"!error\",IF(BV106=\"NA\",\"NA\",IF(OR(AND(BW106<>0,ISNUMBER(CC106),CC106=0),AND(BW106=1,ISNUMBER(CB106),OR(CB106<5.5,CB106>=10.5)),AND(OR(BW106=2,BW106=4),ISNUMBER(CB106),OR(CB106<6,CB106>=9.5)),AND(BW106=3,ISNUMBER(CB106),OR(CB106<6,CB106>9))),0,IF(AND(ISNUMBER($BP$12),BW106<>0,ISNUMBER(BX106),ISNUMBER(BZ106),ISNUMBER(CA106),ISNUMBER(CB106)),Log_Virus(BW106,$BP$12,CA106,CB106,BX106,BZ106),IF(COUNTIF(BW106,\"<>0\")+COUNT(BX106,BY106,CA106,CB106)=5,\"!error\",\"missing\"))))))))","v":""},null,null,null,null,null,null,null,null,null,null,null,null,null,"data","data"]
[null," ",{"$f":"$F$15","v":4},null,null,null,null,{"$f":"IF(BL107=\"!error\",\"!error\",$BK107)","v":""},"","","","",null,null,null,null,"",null,null,null,null,null,null,null,null,null,null,null,null,null,null,null,null,null,null,null,null,null,null,null,null,null,null,null,null,null,null,null,null,null,1,{"$f":"IF($BG$14=0,0,IF(COUNTIF(OFFSET($BD104,0,0,MIN($BG$14,5),1),\"<>NA\")+IF($BG$14>5,COUNTIF(OFFSET($BV104,0,0,$BG$14-5,1),\"<>NA\"),0),1,0))","v":1},{"$f":"IF($BG$14=0,0,IF(COUNTIF(OFFSET($BD104,0,0,MIN($BG$14,5),1),\"O3\")+COUNTIF(OFFSET($BD104,0,0,MIN($BG$14,5),1),\"O3 Cell 1\")+IF($BG$14>5,COUNTIF(OFFSET($BV104,0,0,$BG$14-5,1),\"O3\"),0)+IF($BG$14>5,COUNTIF(OFFSET($BV104,0,0,$BG$14-5,1),\"O3 Cell 1\"),0),1,0))","v":0},{"$f":"IF(OR($AY107=0,AND(COUNTA(D107,F107:G107)=0,COUNTIF(E107,0))),\"NA\",IF(COUNTA(D107:G107),IF(BA107,4,5),IF($BG$15=1,IF(BA107,4,IF(AZ107,5,6)),IF(BD107=\"!error\",IF(BA107,4,5),IF(BA107,\"5B\",6)))))","v":6},{"$f":"$BG$11","v":4},{"$f":"IF(AND(IF($BN$4=\"missing\",10,$BN$4)>=4,$AY107<>\"\"),IF(OR($AY107=0,AND($B107=\"NA\",COUNTA($D107,$F107:$G107)=0,COUNTIF($E107,0)),AND($B107=\"NA\",COUNTA($D107:$G107)=0,IF($BG$14=0,0,COUNTIF(OFFSET($BD104,0,0,MIN($BG$14,5),1),\"NA\")+IF($BG$14>5,COUNTIF(OFFSET($BV104,0,0,$BG$14-5,1),\"NA\"),0))=$BG$14),AND($B107=\"NA\",COUNTA($D107:$G107)=0,IF($BG$14<5,COUNTA(OFFSET($D104,$BG$14,0,MIN(5-$BG$14,$BG$15),4))-COUNTIF(OFFSET($E104,$BG$14,0,MIN(5-$BG$14,$BG$15),1),0),0)+IF($BG$14+$BG$15>5,COUNTA(OFFSET($D109,MAX($BG$14-5,0),0,MIN($BG$14+$BG$15-5,$BG$15),4))-COUNTIF(OFFSET($E109,MAX($BG$14-5,0),0,MIN($BG$14+$BG$15-5,$BG$15),1),0),0)),AND($B107=\"NA\",COUNTA($D107:$G107)=0,IF($BG$14<5,COUNTIF(OFFSET($B104,$BG$14,0,MIN(5-$BG$14,$BG$15),1),\"NA\"),0)+IF($BG$14+$BG$15>5,COUNTIF(OFFSET($B109,MAX($BG$14-5,0),0,MIN($BG$14+$BG$15-5,$BG$15),1),\"NA\"),0)<>$BG$15)),\"NA\",IF($B107=\"\",\"missing\",IF(AND($B107<>\"NA\",COUNTA($D107,$F107:$G107)+COUNTIF($E107,\"<>0\")),UPPER($B107),\"!error\"))),\"\")","v":""},"","","",{"$f":"IF(BD107=\"\",\"\",IF(AY107=0,\"NA\",IF(OR($BG$12=\"!error\",$BG$13=\"!error\",BG107=\"!error\"),\"!error\",IF(BD107=\"NA\",\"NA\",IF(AND(ISNUMBER(BG107),BG107=0),0,IF(AND(ISNUMBER($BG$12),ISNUMBER($BG$13),ISNUMBER(BG107)),$BG$13*$BG$12/BG107,IF(BG107=\"ND\",\"ND\",\"missing\")))))))","v":""},"","","",{"$f":"IF(BD107=\"\",\"\",IF(AY107=0,\"NA\",IF(CW107=\"ND\",\"ND\",IF(OR($BN$12=\"!error\",BD107=\"!error\",AND(BD107=\"missing\",ISNUMBER(BF107)),IF(BE107=1,BF107=\"!error\",0),BI107=\"!error\",BJ107=\"!error\"),\"!error\",IF(OR(BD107=\"NA\",AND(ISNUMBER($BN$12),$BN$12=0),AND(BE107<>0,ISNUMBER(BK107),BK107=0),AND(BE107=1,ISNUMBER(BJ107),BJ107>9),AND(BE107=2,ISNUMBER(BJ107),OR(BJ107<6,BJ107>=9.5)),AND(OR(BE107=3,BE107=4),ISNUMBER(BJ107),OR(BJ107<5.5,BJ107>=9.5))),\"NA\",IF(AND(ISNUMBER($BN$12),BE107<>0,IF(BE107=1,ISNUMBER(BF107),1),ISNUMBER(BI107),ISNUMBER(BJ107)),CT_Giardia(BE107,$BN$12,BI107,BJ107,IF(BE107=1,BF107,)),IF(COUNTIF(BE107,\"<>0\")+COUNT(BF107,BG107,BI107,BJ107)=5,\"!error\",\"missing\")))))))","v":""},{"$f":"IF(BD107=\"\",\"\",IF(OR(AY107=0,AND(ISNUMBER($BN$12),$BN$12=0)),\"NA\",IF(CW107=\"ND\",\"ND\",IF(OR(BK107=\"!error\",BL107=\"!error\",BN107=\"!error\"),\"!error\",IF(BD107=\"NA\",\"NA\",IF(BL107=\"NA\",0,IF(AND(BE107<>99,ISNUMBER(BK107),ISNUMBER(BL107)),BK107/BL107,IF(AND(BE107=99,BN107=0.5),BN107/$BN$12,\"missing\"))))))))","v":""},{"$f":"IF(BD107=\"\",\"\",IF(AY107=0,\"NA\",IF(CW107=\"ND\",\"ND\",IF(OR(BD107=\"!error\",AND(BD107=\"missing\",ISNUMBER(BF107)),BF107=\"!error\",BH107=\"!error\",BI107=\"!error\",BJ107=\"!error\"),\"!error\",IF(BD107=\"NA\",\"NA\",IF(OR(AND(BE107<>0,ISNUMBER(BK107),BK107=0),AND(BE107=1,ISNUMBER(BJ107),BJ107>9),AND(BE107=2,ISNUMBER(BJ107),OR(BJ107<6,BJ107>=9.5)),AND(OR(BE107=3,BE107=4),ISNUMBER(BJ107),OR(BJ107<5.5,BJ107>=9.5))),0,IF(AND(ISNUMBER($BN$12),BE107<>0,ISNUMBER(BF107),ISNUMBER(BH107),ISNUMBER(BI107),ISNUMBER(BJ107)),log_Giardia(BE107,$BN$12,BI107,BJ107,BF107,BH107),IF(COUNTIF(BE107,\"<>0\")+COUNT(BF107,BG107,BI107,BJ107)=5,\"!error\",\"missing\"))))))))","v":""},{"$f":"IF(BD107=\"\",\"\",IF(AY107=0,\"NA\",IF(CW107=\"ND\",\"ND\",IF(OR($BP$12=\"!error\",BD107=\"!error\",AND(BD107=\"missing\",ISNUMBER(BF107)),BI107=\"!error\",BJ107=\"!error\"),\"!error\",IF(OR(BD107=\"NA\",AND(ISNUMBER($BP$12),$BP$12=0),AND(BE107<>0,ISNUMBER(BK107),BK107=0),AND(BE107=1,ISNUMBER(BJ107),BJ107>=10.5),AND(BE107=2,ISNUMBER(BJ107),OR(BJ107<6,BJ107>=9.5)),AND(BE107=3,ISNUMBER(BJ107),OR(BJ107<6,BJ107>9)),AND(BE107=4,ISNUMBER(BJ107),OR(BJ107<6,BJ107>10))),\"NA\",IF(AND(ISNUMBER($BP$12),BE107<>0,ISNUMBER(BI107),ISNUMBER(BJ107)),CT_Virus(BE107,$BP$12,BI107,BJ107),IF(COUNTIF(BE107,\"<>0\")+COUNT(BF107,BG107,BI107,BJ107)=5,\"!error\",\"missing\")))))))","v":""},{"$f":"IF(BD107=\"\",\"\",IF(OR(AY107=0,AND(ISNUMBER($BP$12),$BP$12=0)),\"NA\",IF(CW107=\"ND\",\"ND\",IF(OR(BK107=\"!error\",BO107=\"!error\",BQ107=\"!error\"),\"!error\",IF(BD107=\"NA\",\"NA\",IF(BO107=\"NA\",0,IF(AND(BE107<>99,ISNUMBER(BK107),ISNUMBER(BO107)),BK107/BO107,IF(AND(BE107=99,BQ107=1),BQ107/$BP$12,\"missing\"))))))))","v":""},{"$f":"IF(BD107=\"\",\"\",IF(AY107=0,\"NA\",IF(CW107=\"ND\",\"ND\",IF(OR(BD107=\"!error\",AND(BD107=\"missing\",ISNUMBER(BF107)),BF107=\"!error\",BH107=\"!error\",BI107=\"!error\",BJ107=\"!error\"),\"!error\",IF(BD107=\"NA\",\"NA\",IF(OR(AND(BE107<>0,ISNUMBER(BK107),BK107=0),AND(BE107=1,ISNUMBER(BJ107),BJ107>=10.5),AND(BE107=2,ISNUMBER(BJ107),OR(BJ107<6,BJ107>=9.5)),AND(BE107=3,ISNUMBER(BJ107),OR(BJ107<6,BJ107>9)),AND(BE107=4,ISNUMBER(BJ107),OR(BJ107<6,BJ107>10))),0,IF(AND(ISNUMBER($BP$12),BE107<>0,ISNUMBER(BF107),ISNUMBER(BH107),ISNUMBER(BI107),ISNUMBER(BJ107)),Log_Virus(BE107,$BP$12,BI107,BJ107,BF107,BH107),IF(COUNTIF(BE107,\"<>0\")+COUNT(BF107,BG107,BI107,BJ107)=5,\"!error\",\"missing\"))))))))","v":""},{"$f":"IF($BL$14=0,0,IF(COUNTIF(OFFSET($BD104,0,0,MIN($BL$14,5),1),\"<>NA\")+IF($BL$14>5,COUNTIF(OFFSET($BV104,0,0,$BL$14-5,1),\"<>NA\"),0),1,0))","v":1},{"$f":"IF($BL$14=0,0,IF(COUNTIF(OFFSET($BD104,0,0,MIN($BL$14,5),1),\"O3\")+COUNTIF(OFFSET($BD104,0,0,MIN($BL$14,5),1),\"O3 Cell 1\")+IF($BL$14>5,COUNTIF(OFFSET($BV104,0,0,$BL$14-5,1),\"O3\"),0)+IF($BL$14>5,COUNTIF(OFFSET($BV104,0,0,$BL$14-5,1),\"O3 Cell 1\"),0),1,0))","v":0},{"$f":"IF(OR($AY107=0,AND(COUNTA(D112,F112:G112)=0,COUNTIF(E112,0))),\"NA\",IF(COUNTA(D112:G112),IF(BS107,4,5),IF($BL$15=1,IF(BS107,4,IF(BR107,5,6)),IF(BV107=\"!error\",IF(BS107,4,5),IF(BS107,\"5B\",6)))))","v":6},{"$f":"$BL$11","v":9},{"$f":"IF(AND(IF($BN$4=\"missing\",10,$BN$4)>=9,$AY107<>\"\"),IF(OR($AY107=0,AND($B112=\"NA\",COUNTA($D112,$F112:$G112)=0,COUNTIF($E112,0)),AND($B112=\"NA\",COUNTA($D112:$G112)=0,IF($BL$14=0,0,COUNTIF(OFFSET($BD104,0,0,MIN($BL$14,5),1),\"NA\")+IF($BL$14>5,COUNTIF(OFFSET($BV104,0,0,$BL$14-5,1),\"NA\"),0))=$BL$14),AND($B112=\"NA\",COUNTA($D112:$G112)=0,IF($BL$14<5,COUNTA(OFFSET($D104,$BL$14,0,MIN(5-$BL$14,$BL$15),4))-COUNTIF(OFFSET($E104,$BL$14,0,MIN(5-$BL$14,$BL$15),1),0),0)+IF($BL$14+$BL$15>5,COUNTA(OFFSET($D109,MAX($BL$14-5,0),0,MIN($BL$14+$BL$15-5,$BL$15),4))-COUNTIF(OFFSET($E109,MAX($BL$14-5,0),0,MIN($BL$14+$BL$15-5,$BL$15),1),0),0)),AND($B112=\"NA\",COUNTA($D112:$G112)=0,IF($BL$14<5,COUNTIF(OFFSET($B104,$BL$14,0,MIN(5-$BL$14,$BL$15),1),\"NA\"),0)+IF($BL$14+$BL$15>5,COUNTIF(OFFSET($B109,MAX($BL$14-5,0),0,MIN($BL$14+$BL$15-5,$BL$15),1),\"NA\"),0)<>$BL$15)),\"NA\",IF($B112=\"\",\"missing\",IF(AND($B112<>\"NA\",COUNTA($D112,$F112:$G112)+COUNTIF($E112,\"<>0\")),UPPER($B112),\"!error\"))),\"\")","v":""},"",{"$f":"IF(BV107=\"\",\"\",IF(BV107=\"NA\",\"NA\",IF(ISBLANK($D112),\"missing\",IF(AND(BW107=1,ISNUMBER($D112),$D112>4),4,IF(AND(ISNUMBER($D112),$D112>=0),$D112,IF(AND(ISTEXT($D112),$D112=\"ND\"),\"ND\",\"!error\"))))))","v":""},{"$f":"IF(BV107=\"\",\"\",IF(BV107=\"NA\",\"NA\",IF(ISBLANK($E112),\"missing\",IF(OR(AND(ISBLANK($B112),COUNT(BX107,CA107:CB107)=0,ISNUMBER($E112),$E112=0),AND(ISNUMBER($E112),$E112>0),AND(ISTEXT($E112),$E112=\"ND\")),$E112,\"!error\"))))","v":""},{"$f":"IF(BV107=\"\",\"\",IF(AY107=0,\"NA\",IF(OR($BL$12=\"!error\",$BL$13=\"!error\",BY107=\"!error\"),\"!error\",IF(BV107=\"NA\",\"NA\",IF(AND(ISNUMBER(BY107),BY107=0),0,IF(AND(ISNUMBER($BL$12),ISNUMBER($BL$13),ISNUMBER(BY107)),$BL$13*$BL$12/BY107,IF(BY107=\"ND\",\"ND\",\"missing\")))))))","v":""},{"$f":"IF(BV107=\"\",\"\",IF(BV107=\"NA\",\"NA\",IF(ISBLANK($F112),\"missing\",IF(OR(ISNUMBER($F112),$F112=\"ND\"),$F112,\"!error\"))))","v":""},{"$f":"IF(BV107=\"\",\"\",IF(BV107=\"NA\",\"NA\",IF(ISBLANK($G112),\"missing\",IF(OR(AND(ISNUMBER($G112),$G112>=0,$G112<=14),$G112=\"ND\"),$G112,\"!error\"))))","v":""},"",{"$f":"IF(BV107=\"\",\"\",IF(AY107=0,\"NA\",IF(CX107=\"ND\",\"ND\",IF(OR($BN$12=\"!error\",BV107=\"!error\",AND(BV107=\"missing\",ISNUMBER(BX107)),IF(BW107=1,BX107=\"!error\",0),CA107=\"!error\",CB107=\"!error\"),\"!error\",IF(OR(BV107=\"NA\",AND(ISNUMBER($BN$12),$BN$12=0),AND(BW107<>0,ISNUMBER(CC107),CC107=0),AND(BW107=1,ISNUMBER(CB107),CB107>9),AND(BW107>1,ISNUMBER(CB107),OR(CB107<6,CB107>=9.5))),\"NA\",IF(AND(ISNUMBER($BN$12),BW107<>0,IF(BW107=1,ISNUMBER(BX107),1),ISNUMBER(CA107),ISNUMBER(CB107)),CT_Giardia(BW107,$BN$12,CA107,CB107,IF(BW107=1,BX107,)),IF(COUNTIF(BW107,\"<>0\")+COUNT(BX107,BY107,CA107,CB107)=5,\"!error\",\"missing\")))))))","v":""},{"$f":"IF(BV107=\"\",\"\",IF(OR(AY107=0,AND(ISNUMBER($BN$12),$BN$12=0)),\"NA\",IF(CX107=\"ND\",\"ND\",IF(OR(CC107=\"!error\",CD107=\"!error\",CF107=\"!error\"),\"!error\",IF(BV107=\"NA\",\"NA\",IF(CD107=\"NA\",0,IF(AND(ISNUMBER(CC107),ISNUMBER(CD107)),CC107/CD107,IF(AND(BW107=99,CF107=0.5),CF107/$BN$12,\"missing\"))))))))","v":""},{"$f":"IF(BV107=\"\",\"\",IF(AY107=0,\"NA\",IF(CX107=\"ND\",\"ND\",IF(OR(BV107=\"!error\",AND(BV107=\"missing\",ISNUMBER(BX107)),BX107=\"!error\",BZ107=\"!error\",CA107=\"!error\",CB107=\"!error\"),\"!error\",IF(BV107=\"NA\",\"NA\",IF(OR(AND(BW107<>0,ISNUMBER(CC107),CC107=0),AND(BW107=1,ISNUMBER(CB107),CB107>9),AND(BW107>1,ISNUMBER(CB107),OR(CB107<6,CB107>=9.5))),0,IF(AND(ISNUMBER($BN$12),BW107<>0,ISNUMBER(BX107),ISNUMBER(BZ107),ISNUMBER(CA107),ISNUMBER(CB107)),log_Giardia(BW107,$BN$12,CA107,CB107,BX107,BZ107),IF(COUNTIF(BW107,\"<>0\")+COUNT(BX107,BY107,CA107,CB107)=5,\"!error\",\"missing\"))))))))","v":""},{"$f":"IF(BV107=\"\",\"\",IF(AY107=0,\"NA\",IF(CX107=\"ND\",\"ND\",IF(OR($BP$12=\"!error\",BV107=\"!error\",AND(BV107=\"missing\",ISNUMBER(BX107)),CA107=\"!error\",CB107=\"!error\"),\"!error\",IF(OR(BV107=\"NA\",AND(ISNUMBER($BP$12),$BP$12=0),AND(BW107<>0,ISNUMBER(CC107),CC107=0),AND(BW107=1,ISNUMBER(CB107),OR(CB107<5.5,CB107>=10.5)),AND(OR(BW107=2,BW107=4),ISNUMBER(CB107),OR(CB107<6,CB107>=9.5)),AND(BW107=3,ISNUMBER(CB107),OR(CB107<6,CB107>9))),\"NA\",IF(AND(ISNUMBER($BP$12),BW107<>0,ISNUMBER(CA107),ISNUMBER(CB107)),CT_Virus(BW107,$BP$12,CA107,CB107),IF(COUNTIF(BW107,\"<>0\")+COUNT(BX107,BY107,CA107,CB107)=5,\"!error\",\"missing\")))))))","v":""},{"$f":"IF(BV107=\"\",\"\",IF(OR(AY107=0,AND(ISNUMBER($BP$12),$BP$12=0)),\"NA\",IF(CX107=\"ND\",\"ND\",IF(OR(CC107=\"!error\",CG107=\"!error\",CI107=\"!error\"),\"!error\",IF(BV107=\"NA\",\"NA\",IF(CG107=\"NA\",0,IF(AND(ISNUMBER(CC107),ISNUMBER(CG107)),CC107/CG107,IF(AND(BW107=99,CI107=1),CI107/$BP$12,\"missing\"))))))))","v":""},{"$f":"IF(BV107=\"\",\"\",IF(AY107=0,\"NA\",IF(CX107=\"ND\",\"ND\",IF(OR(BV107=\"!error\",AND(BV107=\"missing\",ISNUMBER(BX107)),BX107=\"!error\",BZ107=\"!error\",CA107=\"!error\",CB107=\"!error\"),\"!error\",IF(BV107=\"NA\",\"NA\",IF(OR(AND(BW107<>0,ISNUMBER(CC107),CC107=0),AND(BW107=1,ISNUMBER(CB107),OR(CB107<5.5,CB107>=10.5)),AND(OR(BW107=2,BW107=4),ISNUMBER(CB107),OR(CB107<6,CB107>=9.5)),AND(BW107=3,ISNUMBER(CB107),OR(CB107<6,CB107>9))),0,IF(AND(ISNUMBER($BP$12),BW107<>0,ISNUMBER(BX107),ISNUMBER(BZ107),ISNUMBER(CA107),ISNUMBER(CB107)),Log_Virus(BW107,$BP$12,CA107,CB107,BX107,BZ107),IF(COUNTIF(BW107,\"<>0\")+COUNT(BX107,BY107,CA107,CB107)=5,\"!error\",\"missing\"))))))))","v":""},null,null,null,null,null,null,null,null,null,null,null,null,null,"data","data"]
[null," ",{"$f":"$G$15","v":5},null,null,null,null,"","","","","",null,null,null,null,"",null,null,null,null,null,null,null,null,null,null,null,null,null,null,null,null,null,null,null,null,null,null,null,null,null,null,null,null,null,null,null,null,null,1,{"$f":"IF($BH$14=0,0,IF(COUNTIF(OFFSET($BD104,0,0,MIN($BH$14,5),1),\"<>NA\")+IF($BH$14>5,COUNTIF(OFFSET($BV104,0,0,$BH$14-5,1),\"<>NA\"),0),1,0))","v":1},{"$f":"IF($BH$14=0,0,IF(COUNTIF(OFFSET($BD104,0,0,MIN($BH$14,5),1),\"O3\")+COUNTIF(OFFSET($BD104,0,0,MIN($BH$14,5),1),\"O3 Cell 1\")+IF($BH$14>5,COUNTIF(OFFSET($BV104,0,0,$BH$14-5,1),\"O3\"),0)+IF($BH$14>5,COUNTIF(OFFSET($BV104,0,0,$BH$14-5,1),\"O3 Cell 1\"),0),1,0))","v":0},{"$f":"IF(OR($AY108=0,AND(COUNTA(D108,F108:G108)=0,COUNTIF(E108,0))),\"NA\",IF(COUNTA(D108:G108),IF(BA108,4,5),IF($BH$15=1,IF(BA108,4,IF(AZ108,5,6)),IF(BD108=\"!error\",IF(BA108,4,5),IF(BA108,\"5B\",6)))))","v":6},{"$f":"$BH$11","v":5},{"$f":"IF(AND(IF($BN$4=\"missing\",10,$BN$4)>=5,$AY108<>\"\"),IF(OR($AY108=0,AND($B108=\"NA\",COUNTA($D108,$F108:$G108)=0,COUNTIF($E108,0)),AND($B108=\"NA\",COUNTA($D108:$G108)=0,IF($BH$14=0,0,COUNTIF(OFFSET($BD104,0,0,MIN($BH$14,5),1),\"NA\")+IF($BH$14>5,COUNTIF(OFFSET($BV104,0,0,$BH$14-5,1),\"NA\"),0))=$BH$14),AND($B108=\"NA\",COUNTA($D108:$G108)=0,IF($BH$14<5,COUNTA(OFFSET($D104,$BH$14,0,MIN(5-$BH$14,$BH$15),4))-COUNTIF(OFFSET($E104,$BH$14,0,MIN(5-$BH$14,$BH$15),1),0),0)+IF($BH$14+$BH$15>5,COUNTA(OFFSET($D109,MAX($BH$14-5,0),0,MIN($BH$14+$BH$15-5,$BH$15),4))-COUNTIF(OFFSET($E109,MAX($BH$14-5,0),0,MIN($BH$14+$BH$15-5,$BH$15),1),0),0)),AND($B108=\"NA\",COUNTA($D108:$G108)=0,IF($BH$14<5,COUNTIF(OFFSET($B104,$BH$14,0,MIN(5-$BH$14,$BH$15),1),\"NA\"),0)+IF($BH$14+$BH$15>5,COUNTIF(OFFSET($B109,MAX($BH$14-5,0),0,MIN($BH$14+$BH$15-5,$BH$15),1),\"NA\"),0)<>$BH$15)),\"NA\",IF($B108=\"\",\"missing\",IF(AND($B108<>\"NA\",COUNTA($D108,$F108:$G108)+COUNTIF($E108,\"<>0\")),UPPER($B108),\"!error\"))),\"\")","v":""},"","","",{"$f":"IF(BD108=\"\",\"\",IF(AY108=0,\"NA\",IF(OR($BH$12=\"!error\",$BH$13=\"!error\",BG108=\"!error\"),\"!error\",IF(BD108=\"NA\",\"NA\",IF(AND(ISNUMBER(BG108),BG108=0),0,IF(AND(ISNUMBER($BH$12),ISNUMBER($BH$13),ISNUMBER(BG108)),$BH$13*$BH$12/BG108,IF(BG108=\"ND\",\"ND\",\"missing\")))))))","v":""},"","","",{"$f":"IF(BD108=\"\",\"\",IF(AY108=0,\"NA\",IF(CW108=\"ND\",\"ND\",IF(OR($BN$12=\"!error\",BD108=\"!error\",AND(BD108=\"missing\",ISNUMBER(BF108)),IF(BE108=1,BF108=\"!error\",0),BI108=\"!error\",BJ108=\"!error\"),\"!error\",IF(OR(BD108=\"NA\",AND(ISNUMBER($BN$12),$BN$12=0),AND(BE108<>0,ISNUMBER(BK108),BK108=0),AND(BE108=1,ISNUMBER(BJ108),BJ108>9),AND(BE108=2,ISNUMBER(BJ108),OR(BJ108<6,BJ108>=9.5)),AND(OR(BE108=3,BE108=4),ISNUMBER(BJ108),OR(BJ108<5.5,BJ108>=9.5))),\"NA\",IF(AND(ISNUMBER($BN$12),BE108<>0,IF(BE108=1,ISNUMBER(BF108),1),ISNUMBER(BI108),ISNUMBER(BJ108)),CT_Giardia(BE108,$BN$12,BI108,BJ108,IF(BE108=1,BF108,)),IF(COUNTIF(BE108,\"<>0\")+COUNT(BF108,BG108,BI108,BJ108)=5,\"!error\",\"missing\")))))))","v":""},{"$f":"IF(BD108=\"\",\"\",IF(OR(AY108=0,AND(ISNUMBER($BN$12),$BN$12=0)),\"NA\",IF(CW108=\"ND\",\"ND\",IF(OR(BK108=\"!error\",BL108=\"!error\",BN108=\"!error\"),\"!error\",IF(BD108=\"NA\",\"NA\",IF(BL108=\"NA\",0,IF(AND(BE108<>99,ISNUMBER(BK108),ISNUMBER(BL108)),BK108/BL108,IF(AND(BE108=99,BN108=0.5),BN108/$BN$12,\"missing\"))))))))","v":""},{"$f":"IF(BD108=\"\",\"\",IF(AY108=0,\"NA\",IF(CW108=\"ND\",\"ND\",IF(OR(BD108=\"!error\",AND(BD108=\"missing\",ISNUMBER(BF108)),BF108=\"!error\",BH108=\"!error\",BI108=\"!error\",BJ108=\"!error\"),\"!error\",IF(BD108=\"NA\",\"NA\",IF(OR(AND(BE108<>0,ISNUMBER(BK108),BK108=0),AND(BE108=1,ISNUMBER(BJ108),BJ108>9),AND(BE108=2,ISNUMBER(BJ108),OR(BJ108<6,BJ108>=9.5)),AND(OR(BE108=3,BE108=4),ISNUMBER(BJ108),OR(BJ108<5.5,BJ108>=9.5))),0,IF(AND(ISNUMBER($BN$12),BE108<>0,ISNUMBER(BF108),ISNUMBER(BH108),ISNUMBER(BI108),ISNUMBER(BJ108)),log_Giardia(BE108,$BN$12,BI108,BJ108,BF108,BH108),IF(COUNTIF(BE108,\"<>0\")+COUNT(BF108,BG108,BI108,BJ108)=5,\"!error\",\"missing\"))))))))","v":""},{"$f":"IF(BD108=\"\",\"\",IF(AY108=0,\"NA\",IF(CW108=\"ND\",\"ND\",IF(OR($BP$12=\"!error\",BD108=\"!error\",AND(BD108=\"missing\",ISNUMBER(BF108)),BI108=\"!error\",BJ108=\"!error\"),\"!error\",IF(OR(BD108=\"NA\",AND(ISNUMBER($BP$12),$BP$12=0),AND(BE108<>0,ISNUMBER(BK108),BK108=0),AND(BE108=1,ISNUMBER(BJ108),BJ108>=10.5),AND(BE108=2,ISNUMBER(BJ108),OR(BJ108<6,BJ108>=9.5)),AND(BE108=3,ISNUMBER(BJ108),OR(BJ108<6,BJ108>9)),AND(BE108=4,ISNUMBER(BJ108),OR(BJ108<6,BJ108>10))),\"NA\",IF(AND(ISNUMBER($BP$12),BE108<>0,ISNUMBER(BI108),ISNUMBER(BJ108)),CT_Virus(BE108,$BP$12,BI108,BJ108),IF(COUNTIF(BE108,\"<>0\")+COUNT(BF108,BG108,BI108,BJ108)=5,\"!error\",\"missing\")))))))","v":""},{"$f":"IF(BD108=\"\",\"\",IF(OR(AY108=0,AND(ISNUMBER($BP$12),$BP$12=0)),\"NA\",IF(CW108=\"ND\",\"ND\",IF(OR(BK108=\"!error\",BO108=\"!error\",BQ108=\"!error\"),\"!error\",IF(BD108=\"NA\",\"NA\",IF(BO108=\"NA\",0,IF(AND(BE108<>99,ISNUMBER(BK108),ISNUMBER(BO108)),BK108/BO108,IF(AND(BE108=99,BQ108=1),BQ108/$BP$12,\"missing\"))))))))","v":""},{"$f":"IF(BD108=\"\",\"\",IF(AY108=0,\"NA\",IF(CW108=\"ND\",\"ND\",IF(OR(BD108=\"!error\",AND(BD108=\"missing\",ISNUMBER(BF108)),BF108=\"!error\",BH108=\"!error\",BI108=\"!error\",BJ108=\"!error\"),\"!error\",IF(BD108=\"NA\",\"NA\",IF(OR(AND(BE108<>0,ISNUMBER(BK108),BK108=0),AND(BE108=1,ISNUMBER(BJ108),BJ108>=10.5),AND(BE108=2,ISNUMBER(BJ108),OR(BJ108<6,BJ108>=9.5)),AND(BE108=3,ISNUMBER(BJ108),OR(BJ108<6,BJ108>9)),AND(BE108=4,ISNUMBER(BJ108),OR(BJ108<6,BJ108>10))),0,IF(AND(ISNUMBER($BP$12),BE108<>0,ISNUMBER(BF108),ISNUMBER(BH108),ISNUMBER(BI108),ISNUMBER(BJ108)),Log_Virus(BE108,$BP$12,BI108,BJ108,BF108,BH108),IF(COUNTIF(BE108,\"<>0\")+COUNT(BF108,BG108,BI108,BJ108)=5,\"!error\",\"missing\"))))))))","v":""},{"$f":"IF($BM$14=0,0,IF(COUNTIF(OFFSET($BD104,0,0,MIN($BM$14,5),1),\"<>NA\")+IF($BM$14>5,COUNTIF(OFFSET($BV104,0,0,$BM$14-5,1),\"<>NA\"),0),1,0))","v":1},{"$f":"IF($BK$14=0,0,IF(COUNTIF(OFFSET($BD104,0,0,MIN($BK$14,5),1),\"O3\")+COUNTIF(OFFSET($BD104,0,0,MIN($BK$14,5),1),\"O3 Cell 1\")+IF($BK$14>5,COUNTIF(OFFSET($BV104,0,0,$BK$14-5,1),\"O3\"),0)+IF($BK$14>5,COUNTIF(OFFSET($BV104,0,0,$BK$14-5,1),\"O3 Cell 1\"),0),1,0))","v":0},{"$f":"IF(OR($AY108=0,AND(COUNTA(D113,F113:G113)=0,COUNTIF(E113,0))),\"NA\",IF(COUNTA(D113:G113),IF(BS108,4,5),IF($BM$15=1,IF(BS108,4,IF(BR108,5,6)),IF(BV108=\"!error\",IF(BS108,4,5),IF(BS108,\"5B\",6)))))","v":6},{"$f":"$BM$11","v":10},{"$f":"IF(AND(IF($BN$4=\"missing\",10,$BN$4)>=10,$AY108<>\"\"),IF(OR($AY108=0,AND($B113=\"NA\",COUNTA($D113,$F113:$G113)=0,COUNTIF($E113,0)),AND($B113=\"NA\",COUNTA($D113:$G113)=0,IF($BM$14=0,0,COUNTIF(OFFSET($BD104,0,0,MIN($BM$14,5),1),\"NA\")+IF($BM$14>5,COUNTIF(OFFSET($BV104,0,0,$BM$14-5,1),\"NA\"),0))=$BM$14),AND($B113=\"NA\",COUNTA($D113:$G113)=0,IF($BM$14<5,COUNTA(OFFSET($D104,$BM$14,0,MIN(5-$BM$14,$BM$15),4))-COUNTIF(OFFSET($E104,$BM$14,0,MIN(5-$BM$14,$BM$15),1),0),0)+IF($BM$14+$BM$15>5,COUNTA(OFFSET($D109,MAX($BM$14-5,0),0,MIN($BM$14+$BM$15-5,$BM$15),4))-COUNTIF(OFFSET($E109,MAX($BM$14-5,0),0,MIN($BM$14+$BM$15-5,$BM$15),1),0),0)),AND($B113=\"NA\",COUNTA($D113:$G113)=0,IF($BM$14<5,COUNTIF(OFFSET($B104,$BM$14,0,MIN(5-$BM$14,$BM$15),1),\"NA\"),0)+IF($BM$14+$BM$15>5,COUNTIF(OFFSET($B109,MAX($BM$14-5,0),0,MIN($BM$14+$BM$15-5,$BM$15),1),\"NA\"),0)<>$BM$15)),\"NA\",IF($B113=\"\",\"missing\",IF(AND($B113<>\"NA\",COUNTA($D113,$F113:$G113)+COUNTIF($E113,\"<>0\")),UPPER($B113),\"!error\"))),\"\")","v":""},"",{"$f":"IF(BV108=\"\",\"\",IF(BV108=\"NA\",\"NA\",IF(ISBLANK($D113),\"missing\",IF(AND(BW108=1,ISNUMBER($D113),$D113>4),4,IF(AND(ISNUMBER($D113),$D113>=0),$D113,IF(AND(ISTEXT($D113),$D113=\"ND\"),\"ND\",\"!error\"))))))","v":""},{"$f":"IF(BV108=\"\",\"\",IF(BV108=\"NA\",\"NA\",IF(ISBLANK($E113),\"missing\",IF(OR(AND(ISBLANK($B113),COUNT(BX108,CA108:CB108)=0,ISNUMBER($E113),$E113=0),AND(ISNUMBER($E113),$E113>0),AND(ISTEXT($E113),$E113=\"ND\")),$E113,\"!error\"))))","v":""},{"$f":"IF(BV108=\"\",\"\",IF(AY108=0,\"NA\",IF(OR($BM$12=\"!error\",$BM$13=\"!error\",BY108=\"!error\"),\"!error\",IF(BV108=\"NA\",\"NA\",IF(AND(ISNUMBER(BY108),BY108=0),0,IF(AND(ISNUMBER($BM$12),ISNUMBER($BM$13),ISNUMBER(BY108)),$BM$13*$BM$12/BY108,IF(BY108=\"ND\",\"ND\",\"missing\")))))))","v":""},{"$f":"IF(BV108=\"\",\"\",IF(BV108=\"NA\",\"NA\",IF(ISBLANK($F113),\"missing\",IF(OR(ISNUMBER($F113),$F113=\"ND\"),$F113,\"!error\"))))","v":""},{"$f":"IF(BV108=\"\",\"\",IF(BV108=\"NA\",\"NA\",IF(ISBLANK($G113),\"missing\",IF(OR(AND(ISNUMBER($G113),$G113>=0,$G113<=14),$G113=\"ND\"),$G113,\"!error\"))))","v":""},"",{"$f":"IF(BV108=\"\",\"\",IF(AY108=0,\"NA\",IF(CX108=\"ND\",\"ND\",IF(OR($BN$12=\"!error\",BV108=\"!error\",AND(BV108=\"missing\",ISNUMBER(BX108)),IF(BW108=1,BX108=\"!error\",0),CA108=\"!error\",CB108=\"!error\"),\"!error\",IF(OR(BV108=\"NA\",AND(ISNUMBER($BN$12),$BN$12=0),AND(BW108<>0,ISNUMBER(CC108),CC108=0),AND(BW108=1,ISNUMBER(CB108),CB108>9),AND(BW108>1,ISNUMBER(CB108),OR(CB108<6,CB108>=9.5))),\"NA\",IF(AND(ISNUMBER($BN$12),BW108<>0,IF(BW108=1,ISNUMBER(BX108),1),ISNUMBER(CA108),ISNUMBER(CB108)),CT_Giardia(BW108,$BN$12,CA108,CB108,IF(BW108=1,BX108,)),IF(COUNTIF(BW108,\"<>0\")+COUNT(BX108,BY108,CA108,CB108)=5,\"!error\",\"missing\")))))))","v":""},{"$f":"IF(BV108=\"\",\"\",IF(OR(AY108=0,AND(ISNUMBER($BN$12),$BN$12=0)),\"NA\",IF(CX108=\"ND\",\"ND\",IF(OR(CC108=\"!error\",CD108=\"!error\",CF108=\"!error\"),\"!error\",IF(BV108=\"NA\",\"NA\",IF(CD108=\"NA\",0,IF(AND(ISNUMBER(CC108),ISNUMBER(CD108)),CC108/CD108,IF(AND(BW108=99,CF108=0.5),CF108/$BN$12,\"missing\"))))))))","v":""},{"$f":"IF(BV108=\"\",\"\",IF(AY108=0,\"NA\",IF(CX108=\"ND\",\"ND\",IF(OR(BV108=\"!error\",AND(BV108=\"missing\",ISNUMBER(BX108)),BX108=\"!error\",BZ108=\"!error\",CA108=\"!error\",CB108=\"!error\"),\"!error\",IF(BV108=\"NA\",\"NA\",IF(OR(AND(BW108<>0,ISNUMBER(CC108),CC108=0),AND(BW108=1,ISNUMBER(CB108),CB108>9),AND(BW108>1,ISNUMBER(CB108),OR(CB108<6,CB108>=9.5))),0,IF(AND(ISNUMBER($BN$12),BW108<>0,ISNUMBER(BX108),ISNUMBER(BZ108),ISNUMBER(CA108),ISNUMBER(CB108)),log_Giardia(BW108,$BN$12,CA108,CB108,BX108,BZ108),IF(COUNTIF(BW108,\"<>0\")+COUNT(BX108,BY108,CA108,CB108)=5,\"!error\",\"missing\"))))))))","v":""},{"$f":"IF(BV108=\"\",\"\",IF(AY108=0,\"NA\",IF(CX108=\"ND\",\"ND\",IF(OR($BP$12=\"!error\",BV108=\"!error\",AND(BV108=\"missing\",ISNUMBER(BX108)),CA108=\"!error\",CB108=\"!error\"),\"!error\",IF(OR(BV108=\"NA\",AND(ISNUMBER($BP$12),$BP$12=0),AND(BW108<>0,ISNUMBER(CC108),CC108=0),AND(BW108=1,ISNUMBER(CB108),OR(CB108<5.5,CB108>=10.5)),AND(OR(BW108=2,BW108=4),ISNUMBER(CB108),OR(CB108<6,CB108>=9.5)),AND(BW108=3,ISNUMBER(CB108),OR(CB108<6,CB108>9))),\"NA\",IF(AND(ISNUMBER($BP$12),BW108<>0,ISNUMBER(CA108),ISNUMBER(CB108)),CT_Virus(BW108,$BP$12,CA108,CB108),IF(COUNTIF(BW108,\"<>0\")+COUNT(BX108,BY108,CA108,CB108)=5,\"!error\",\"missing\")))))))","v":""},{"$f":"IF(BV108=\"\",\"\",IF(OR(AY108=0,AND(ISNUMBER($BP$12),$BP$12=0)),\"NA\",IF(CX108=\"ND\",\"ND\",IF(OR(CC108=\"!error\",CG108=\"!error\",CI108=\"!error\"),\"!error\",IF(BV108=\"NA\",\"NA\",IF(CG108=\"NA\",0,IF(AND(ISNUMBER(CC108),ISNUMBER(CG108)),CC108/CG108,IF(AND(BW108=99,CI108=1),CI108/$BP$12,\"missing\"))))))))","v":""},{"$f":"IF(BV108=\"\",\"\",IF(AY108=0,\"NA\",IF(CX108=\"ND\",\"ND\",IF(OR(BV108=\"!error\",AND(BV108=\"missing\",ISNUMBER(BX108)),BX108=\"!error\",BZ108=\"!error\",CA108=\"!error\",CB108=\"!error\"),\"!error\",IF(BV108=\"NA\",\"NA\",IF(OR(AND(BW108<>0,ISNUMBER(CC108),CC108=0),AND(BW108=1,ISNUMBER(CB108),OR(CB108<5.5,CB108>=10.5)),AND(OR(BW108=2,BW108=4),ISNUMBER(CB108),OR(CB108<6,CB108>=9.5)),AND(BW108=3,ISNUMBER(CB108),OR(CB108<6,CB108>9))),0,IF(AND(ISNUMBER($BP$12),BW108<>0,ISNUMBER(BX108),ISNUMBER(BZ108),ISNUMBER(CA108),ISNUMBER(CB108)),Log_Virus(BW108,$BP$12,CA108,CB108,BX108,BZ108),IF(COUNTIF(BW108,\"<>0\")+COUNT(BX108,BY108,CA108,CB108)=5,\"!error\",\"missing\"))))))))","v":""},null,null,null,null,null,null,null,null,null,null,null,null,null,{"$f":"IF(OR(BF108=\"ND\",BG108=\"ND\",BI108=\"ND\",BJ108=\"ND\"),\"ND\",\"data\")","v":"data"},{"$f":"IF(OR(BX108=\"ND\",BY108=\"ND\",CA108=\"ND\",CB108=\"ND\"),\"ND\",\"data\")","v":"data"}]
[null," ",{"$f":"$H$15","v":6},null,null,null,null,{"$f":"IF($CD104=\"!error\",\"!error\",$CC104)","v":""},{"$f":"$CD104","v":""},{"$f":"$CG104","v":""},{"$f":"$CF104","v":""},{"$f":"$CI104","v":""},null,null,null,null,{"$f":"IF(AND(BW104=1,D109>4,D109<>\"ND\"),\"Note: The inactivation credit in zone D\" & C109 & \" was restricted due to elevated free chlorine levels.\",\"\")","v":""},null,null,null,null,null,null,null,null,null,null,null,null,null,null,null,null,null,null,null,null,null,null,null,null,null,null,null,null,null,null,null,null,null,null,null,null,null,null,null,null,null,null,null,null,null,null,null,null,null,null,null,null,null,null,null,null,null,null,null,null,null,null,null,null,null,null,null,null,null,null,null," Not representative of total log inactivation for all disinfection zones."]
[null," ",{"$f":"$I$15","v":7},null,null,null,null,{"$f":"IF($CD105=\"!error\",\"!error\",$CC105)","v":""},{"$f":"$CD105","v":""},{"$f":"$CG105","v":""},{"$f":"$CF105","v":""},{"$f":"$CI105","v":""},null,null,null,null,{"$f":"IF(AND(BW105=1,D110>4,D110<>\"ND\"),\"Note: The inactivation credit in zone D\" & C110 & \" was restricted due to elevated free chlorine levels.\",\"\")","v":""},null,null,null,null,null,null,null,null,null,null,null,null,null,null,null,null,null,null,null,null,null,null,null,null,null,null,null,null,null,null,null,null,null,null,null,null,null,null,null,null,null,null,null,null,null,null,null,null,null,null,null,null,null,null,null,null,null,null,null,null,null,null,null,null,null,null,null,null,null,null,null,null,null,{"$f":"CL104=\"\"","v":true},null,null,null,{"$f":"CP104=\"\"","v":true}]
[null," ",{"$f":"$J$15","v":8},null,null,null,null,"",{"$f":"$CD106","v":""},{"$f":"$CG106","v":""},{"$f":"$CF106","v":""},{"$f":"$CI106","v":""},null,null,null,null,""]
[null," ",{"$f":"$K$15","v":9},null,null,null,null,"",{"$f":"$CD107","v":""},{"$f":"$CG107","v":""},{"$f":"$CF107","v":""},{"$f":"$CI107","v":""},null,null,null,null,""]
[null," ",{"$f":"$L$15","v":10},null,null,null,null,{"$f":"IF($CC108=\"!error\",\"!error\",$CC108)","v":""},{"$f":"$CD108","v":""},{"$f":"$CG108","v":""},{"$f":"$CF108","v":""},{"$f":"$CI108","v":""},null,null,null,null,""]

{"sheet":"Sheet1","index":2,"n_rows":0,"n_cols":0,"rows_kept":0,"cut":false,"hidden":false,"merged":[]}