{"text_format":"1","workbook":"xlsx","n_sheets":5,"sheets":["Description","Schematic","T10 Details","Summary","Calculator"],"not_rendered":{"charts":0,"images":2,"macros":1,"external_links":0,"defined_names":5,"comments":5,"pivot_tables":0},"unopened":[],"bounds":{"document_bytes":16777216,"sheet_cells":100000,"rows_first":2000,"rows_last":500,"rows_between":2000,"halvings":0,"cell_chars":16384,"cell_head_chars":4096},"cells_cut":0,"cells_raw":0,"read":"whole","date_system":"1900"}

{"sheet":"Description","index":0,"n_rows":54,"n_cols":50,"rows_kept":54,"cut":false,"hidden":false,"merged":[[51,1,51,5],[51,7,51,8],[0,0,0,8],[1,0,1,8],[2,0,2,8],[3,0,3,8],[9,1,9,5],[6,1,6,5],[8,7,8,8],[6,23,6,29],[7,23,24,29],[49,1,49,8],[50,1,50,8],[10,7,10,8],[6,7,6,8],[9,7,9,8]]}
["CT STUDY"]
["FOR PUBLIC WATER SYSTEMS THAT ARE USING SURFACE WATER SOURCES",null,null,null,null,null,null,null,null,null,null,null,null,null,null,null,null,null,null,"January","February","March","April","May","June","July","August","September","October","November","December"]
["OR GROUND WATER SOURCES UNDER THE INFLUENCE OF SURFACE WATER (cont.)",null,null,null,null,null,null,null,null,null,"Detailed narrative description of the plant treatment processes and disinfection protocol (cont)",null,null,null,null,null,null,null,null,1,2,3,4,5,6,7,8,9,10,11,12,13,14,15,16,17,18,19,20,21,22,23,24,25,26,27,28,29,30,31]
["Description Worksheet",null,null,null,null,null,null,null,null,null,null,null,null,null,null,null,null,null,null,2022,{"$f":"+T4+1","v":2023},{"$f":"+U4+1","v":2024},2025,2026,2027,2028,2029,2030]
[]
["PUBLIC WATER"]
["SYSTEM NAME:",null,null,null,null,null,"PWS ID No.:",null,null,null,null,null,null,null,null,null,null,null,null,null,null,"Reviewer Name"]
[null,null,null,null,null,null,null,null,null,null,null,null,null,null,null,null,null,null,null,null,null,"Reviewer Comments"]
["PLANT NAME",null,null,null,null,null,"Month:"]
["OR NUMBER:",null,null,null,null,null,"Day:"]
[null,null,null,null,null,null,"Year:"]
["Enter a detailed narrative description of the plant treatment processes and disinfection protocol. "]
["Asdfndnasdlsdn asd  sd;klsd as;dlk fjkal;sdjfa s;dljkfas;dljfk ;asdf a  sdflsd;asdfjf sadf sd fasl dfjksadlff sadf sd fl sd;flkj as sdf ;asdlk jfsdf sa  sdfj as;dlkfjas; d a sd; asldkfja;sldjsa  asf asd;flksjdfj; asdlkj ;a"]
[]
[]
[]
[]
[]
[]
[]
[]
[]
[]
[]
[]
[]
[]
[]
[]
[]
[]
[]
[]
[]
[]
[]
[]
[]
[]
[]
[]
[]
[]
[]
[]
[]
[]
[]
[]
["  Submitted by:"]
["  Contact \n  Information:"]
["  Reviewed by:",null,null,null,null,null,"Date:  "]
[]
["TCEQ - (05-01-13)",null,null,null,null,null,null,null,"CT STUDY",null,{"$f":"+A54","v":"TCEQ - (05-01-13)"},null,null,null,null,null,null,null,"CT STUDY","v9","(Excel2019)","2022-08-31"]

{"sheet":"Schematic","index":1,"n_rows":13,"n_cols":11,"rows_kept":13,"cut":false,"hidden":false,"merged":[[8,3,8,7],[8,10,8,13],[0,0,0,13],[1,0,1,13],[2,0,2,13],[3,0,3,13],[6,3,6,7],[6,10,6,13]]}
["CT STUDY"]
["FOR PUBLIC WATER SYSTEMS THAT ARE USING SURFACE WATER SOURCES"]
["OR GROUND WATER SOURCES UNDER THE INFLUENCE OF SURFACE WATER (cont.)"]
["Schematic Worksheet"]
[]
["PUBLIC WATER",null,null,null,null,null,null,null,"PLANT NAME"]
["SYSTEM NAME:",null,null,{"$f":"IF(Description!B7=\"\",\"\",Description!B7)","v":""},null,null,null,null,"OR NUMBER:",null,{"$f":"IF(Description!B10=\"\",\"\",Description!B10)","v":""}]
[]
["PWS ID No.:",null,null,{"$f":"IF(Description!H7=\"\",\"\",Description!H7)","v":""},null,null,null,null,"Date:",null,{"$f":"IF(OR(Description!H7=\"\",Description!H10=\"\",Description!H11=\"\"),\"\",Description!H9&\" \"&Description!H10&\", \"&Description!H11)","v":""}]
[]
["Use this worksheet to create your plant schematic with the Microsoft Drawing Tools."]
["If you are not familiar with the drawing tools, you may create your schematic using any other suitable medium."]
["Please refer to Section 3.3 of the Guidance Manual for instructions and guidance."]

{"sheet":"T10 Details","index":2,"n_rows":3173,"n_cols":19,"rows_kept":3173,"cut":false,"hidden":false,"merged":[[3167,8,3167,9],[3139,4,3139,5],[3139,7,3139,8],[3141,3,3141,9],[3166,8,3166,9],[3108,7,3108,8],[3110,3,3110,9],[3135,8,3135,9],[3136,8,3136,9],[3108,4,3108,5],[2891,4,2891,5],[2891,7,2891,8],[2893,3,2893,9],[3077,4,3077,5],[3077,7,3077,8],[2918,8,2918,9],[2919,8,2919,9],[2922,4,2922,5],[2922,7,2922,8],[2924,3,2924,9],[2949,8,2949,9],[2950,8,2950,9],[2953,4,2953,5],[2953,7,2953,8],[2955,3,2955,9],[2980,8,2980,9],[2981,8,2981,9],[2984,4,2984,5],[2984,7,2984,8],[2986,3,2986,9],[3011,8,3011,9],[3012,8,3012,9],[3015,4,3015,5],[3015,7,3015,8],[2887,8,2887,9],[2862,3,2862,9],[2888,8,2888,9],[2823,4,2823,5],[2823,7,2823,8],[2825,3,2825,9],[2850,8,2850,9],[2763,3,2763,9],[2788,8,2788,9],[2819,8,2819,9],[2820,8,2820,9],[2575,4,2575,5],[2575,7,2575,8],[2577,3,2577,9],[2761,4,2761,5],[2761,7,2761,8],[2602,8,2602,9],[2603,8,2603,9],[2606,4,2606,5],[2606,7,2606,8],[2608,3,2608,9],[2633,8,2633,9],[2634,8,2634,9],[2637,4,2637,5],[2637,7,2637,8],[2639,3,2639,9],[2664,8,2664,9],[2665,8,2665,9],[2668,4,2668,5],[2668,7,2668,8],[2670,3,2670,9],[2695,8,2695,9],[2696,8,2696,9],[2699,4,2699,5],[2699,7,2699,8],[2571,8,2571,9],[2546,3,2546,9],[2572,8,2572,9],[2507,4,2507,5],[2507,7,2507,8],[2509,3,2509,9],[2534,8,2534,9],[2447,3,2447,9],[2472,8,2472,9],[2503,8,2503,9],[2504,8,2504,9],[2259,4,2259,5],[2259,7,2259,8],[2261,3,2261,9],[2445,4,2445,5],[2445,7,2445,8],[2286,8,2286,9],[2287,8,2287,9],[2290,4,2290,5],[2290,7,2290,8],[2292,3,2292,9],[2317,8,2317,9],[2318,8,2318,9],[2321,4,2321,5],[2321,7,2321,8],[2323,3,2323,9],[2348,8,2348,9],[2349,8,2349,9],[2352,4,2352,5],[2352,7,2352,8],[2354,3,2354,9],[2379,8,2379,9],[2380,8,2380,9],[2383,4,2383,5],[2383,7,2383,8],[2255,8,2255,9],[2230,3,2230,9],[2256,8,2256,9],[2191,4,2191,5],[2191,7,2191,8],[2193,3,2193,9],[2218,8,2218,9],[2131,3,2131,9],[2156,8,2156,9],[2187,8,2187,9],[2188,8,2188,9],[1943,4,1943,5],[1943,7,1943,8],[1945,3,1945,9],[2129,4,2129,5],[2129,7,2129,8],[1970,8,1970,9],[1971,8,1971,9],[1974,4,1974,5],[1974,7,1974,8],[1976,3,1976,9],[2001,8,2001,9],[2002,8,2002,9],[2005,4,2005,5],[2005,7,2005,8],[2007,3,2007,9],[2032,8,2032,9],[2033,8,2033,9],[2036,4,2036,5],[2036,7,2036,8],[2038,3,2038,9],[2063,8,2063,9],[2064,8,2064,9],[2067,4,2067,5],[2067,7,2067,8],[1939,8,1939,9],[1914,3,1914,9],[1940,8,1940,9],[1875,4,1875,5],[1875,7,1875,8],[1877,3,1877,9],[1902,8,1902,9],[1815,3,1815,9],[1840,8,1840,9],[1871,8,1871,9],[1872,8,1872,9],[1627,4,1627,5],[1627,7,1627,8],[1629,3,1629,9],[1813,4,1813,5],[1813,7,1813,8],[1654,8,1654,9],[1655,8,1655,9],[1658,4,1658,5],[1658,7,1658,8],[1660,3,1660,9],[1685,8,1685,9],[1686,8,1686,9],[1689,4,1689,5],[1689,7,1689,8],[1691,3,1691,9],[1716,8,1716,9],[1717,8,1717,9],[1720,4,1720,5],[1720,7,1720,8],[1722,3,1722,9],[1747,8,1747,9],[1748,8,1748,9],[1751,4,1751,5],[1751,7,1751,8],[1623,8,1623,9],[1598,3,1598,9],[1624,8,1624,9],[1559,4,1559,5],[1559,7,1559,8],[1561,3,1561,9],[1586,8,1586,9],[1555,8,1555,9],[1556,8,1556,9],[1311,4,1311,5],[1311,7,1311,8],[1313,3,1313,9],[1497,4,1497,5],[1497,7,1497,8],[1338,8,1338,9],[1344,3,1344,9],[1239,8,1239,9],[1240,8,1240,9],[1339,8,1339,9],[1342,4,1342,5],[1342,7,1342,8],[1271,8,1271,9],[1307,8,1307,9],[1282,3,1282,9],[1308,8,1308,9],[1280,4,1280,5],[1369,8,1369,9],[1370,8,1370,9],[1280,7,1280,8],[1373,4,1373,5],[1373,7,1373,8],[1375,3,1375,9],[1400,8,1400,9],[997,3,997,9],[1181,4,1181,5],[1181,7,1181,8],[1022,8,1022,9],[1023,8,1023,9],[1026,4,1026,5],[1026,7,1026,8],[1028,3,1028,9],[1059,3,1059,9],[1084,8,1084,9],[1053,8,1053,9],[1054,8,1054,9],[1057,4,1057,5],[1057,7,1057,8],[1085,8,1085,9],[1088,4,1088,5],[1088,7,1088,8],[1090,3,1090,9],[1115,8,1115,9],[1116,8,1116,9],[1119,4,1119,5],[1119,7,1119,8],[1121,3,1121,9],[1146,8,1146,9],[995,4,995,5],[995,7,995,8],[867,3,867,9],[892,8,892,9],[923,8,923,9],[924,8,924,9],[991,8,991,9],[966,3,966,9],[992,8,992,9],[515,8,515,9],[518,4,518,5],[396,3,396,9],[577,8,577,9],[676,8,676,9],[650,3,650,9],[865,4,865,5],[865,7,865,8],[679,4,679,5],[679,7,679,8],[613,3,613,9],[638,8,638,9],[639,8,639,9],[675,8,675,9],[648,4,648,5],[648,7,648,8],[710,7,710,8],[681,3,681,9],[706,8,706,9],[707,8,707,9],[710,4,710,5],[712,3,712,9],[737,8,737,9],[738,8,738,9],[391,8,391,9],[394,4,394,5],[453,8,453,9],[456,4,456,5],[456,7,456,8],[427,3,427,9],[452,8,452,9],[489,3,489,9],[514,8,514,9],[551,3,551,9],[390,8,390,9],[204,3,204,9],[365,3,365,9],[229,8,229,9],[230,8,230,9],[261,8,261,9],[264,4,264,5],[297,3,297,9],[322,8,322,9],[323,8,323,9],[359,8,359,9],[518,7,518,8],[520,3,520,9],[545,8,545,9],[546,8,546,9],[360,8,360,9],[363,4,363,5],[363,7,363,8],[549,4,549,5],[549,7,549,8],[422,8,422,9],[425,4,425,5],[425,7,425,8],[78,7,78,8],[80,3,80,9],[109,4,109,5],[109,7,109,8],[235,3,235,9],[142,3,142,9],[167,8,167,9],[168,8,168,9],[171,4,171,5],[171,7,171,8],[233,4,233,5],[233,7,233,8],[173,3,173,9],[198,8,198,9],[199,8,199,9],[202,4,202,5],[202,7,202,8],[10,8,10,9],[260,8,260,9],[111,3,111,9],[136,8,136,9],[137,8,137,9],[140,4,140,5],[140,7,140,8],[421,8,421,9],[264,7,264,8],[266,3,266,9],[291,8,291,9],[292,8,292,9],[295,4,295,5],[295,7,295,8],[394,7,394,8],[105,8,105,9],[106,8,106,9],[332,4,332,5],[332,7,332,8],[334,3,334,9],[49,3,49,9],[74,8,74,9],[75,8,75,9],[78,4,78,5],[0,0,0,9],[1,0,1,9],[330,7,330,8],[646,7,646,8],[6,2,6,5],[6,8,6,9],[9,2,9,5],[9,8,9,9],[2,0,2,9],[458,3,458,9],[3,0,3,9],[18,3,18,9],[47,4,47,5],[47,7,47,8],[14,7,14,8],[16,4,16,5],[16,7,16,8],[43,8,43,9],[44,8,44,9],[8,8,8,9],[483,8,483,9],[484,8,484,9],[487,4,487,5],[487,7,487,8],[580,4,580,5],[580,7,580,8],[582,3,582,9],[607,8,607,9],[576,8,576,9],[769,8,769,9],[772,4,772,5],[772,7,772,8],[774,3,774,9],[608,8,608,9],[611,4,611,5],[611,7,611,8],[741,4,741,5],[741,7,741,8],[743,3,743,9],[768,8,768,9],[799,8,799,9],[800,8,800,9],[803,4,803,5],[803,7,803,8],[805,3,805,9],[830,8,830,9],[831,8,831,9],[834,4,834,5],[834,7,834,8],[836,3,836,9],[861,8,861,9],[862,8,862,9],[964,4,964,5],[964,7,964,8],[962,7,962,8],[893,8,893,9],[896,4,896,5],[896,7,896,8],[898,3,898,9],[955,8,955,9],[927,4,927,5],[927,7,927,8],[929,3,929,9],[954,8,954,9],[1147,8,1147,9],[1150,4,1150,5],[1150,7,1150,8],[1152,3,1152,9],[1177,8,1177,9],[1178,8,1178,9],[1278,7,1278,8],[1209,8,1209,9],[1212,4,1212,5],[1212,7,1212,8],[1214,3,1214,9],[1183,3,1183,9],[1208,8,1208,9],[1243,4,1243,5],[1243,7,1243,8],[1245,3,1245,9],[1270,8,1270,9],[1401,8,1401,9],[1404,4,1404,5],[1404,7,1404,8],[1406,3,1406,9],[1431,8,1431,9],[1432,8,1432,9],[1435,4,1435,5],[1435,7,1435,8],[1437,3,1437,9],[1462,8,1462,9],[1463,8,1463,9],[1466,4,1466,5],[1466,7,1466,8],[1468,3,1468,9],[1493,8,1493,9],[1494,8,1494,9],[1596,4,1596,5],[1596,7,1596,8],[1594,7,1594,8],[1525,8,1525,9],[1528,4,1528,5],[1528,7,1528,8],[1530,3,1530,9],[1499,3,1499,9],[1524,8,1524,9],[1587,8,1587,9],[1753,3,1753,9],[1778,8,1778,9],[1779,8,1779,9],[1782,4,1782,5],[1782,7,1782,8],[1784,3,1784,9],[1809,8,1809,9],[1810,8,1810,9],[1912,4,1912,5],[1912,7,1912,8],[1910,7,1910,8],[1841,8,1841,9],[1844,4,1844,5],[1844,7,1844,8],[1846,3,1846,9],[1903,8,1903,9],[2069,3,2069,9],[2094,8,2094,9],[2095,8,2095,9],[2098,4,2098,5],[2098,7,2098,8],[2100,3,2100,9],[2125,8,2125,9],[2126,8,2126,9],[2228,4,2228,5],[2228,7,2228,8],[2226,7,2226,8],[2157,8,2157,9],[2160,4,2160,5],[2160,7,2160,8],[2162,3,2162,9],[2219,8,2219,9],[2385,3,2385,9],[2410,8,2410,9],[2411,8,2411,9],[2414,4,2414,5],[2414,7,2414,8],[2416,3,2416,9],[2441,8,2441,9],[2442,8,2442,9],[2544,4,2544,5],[2544,7,2544,8],[2542,7,2542,8],[2473,8,2473,9],[2476,4,2476,5],[2476,7,2476,8],[2478,3,2478,9],[2535,8,2535,9],[2701,3,2701,9],[2726,8,2726,9],[2727,8,2727,9],[2730,4,2730,5],[2730,7,2730,8],[2732,3,2732,9],[2757,8,2757,9],[2758,8,2758,9],[2860,4,2860,5],[2860,7,2860,8],[2858,7,2858,8],[2789,8,2789,9],[2792,4,2792,5],[2792,7,2792,8],[2794,3,2794,9],[2851,8,2851,9],[3017,3,3017,9],[3042,8,3042,9],[3043,8,3043,9],[3046,4,3046,5],[3046,7,3046,8],[3048,3,3048,9],[3073,8,3073,9],[3074,8,3074,9],[3105,8,3105,9],[3079,3,3079,9],[3104,8,3104,9]]}
["CT STUDY"]
["FOR PUBLIC WATER SYSTEMS THAT ARE USING SURFACE WATER SOURCES"]
["OR GROUND WATER SOURCES UNDER THE INFLUENCE OF SURFACE WATER (cont.)",null,null,null,null,null,null,null,null,null,null,null,"Unit Type","Unit Shape","Disinfectant","Baffling Conditions","Zone","# Units","Current Zone"]
["T10 Details Worksheet",null,null,null,null,null,null,null,null,null,null,null,"Piping","Pipe","Free Chlorine","Unbaffled",1,"1",3]
[null,null,null,null,null,null,null,null,null,null,null,null,"Rapid Mix","Circular","Chloramines","Poor",2,"1"]
["PUBLIC WATER",null,null,null,null,null,null,null,null,null,null,null,"Flocculation","Rectangular","Chlorine Dioxide","Average",3,"1"]
["SYSTEM NAME:",null,{"$f":"IF(Description!B7=\"\",\"\",Description!B7)","v":""},null,null,null,null,"PWS ID No.:",{"$f":"IF(Description!H7=\"\",\"\",Description!H7)","v":""},null,null,null,"Sedimentation","Other","Ozone (any cell)","Superior",4,1]
[null,null,null,null,null,null,null,null,null,null,null,null,"Floc/Sed Comb.",null,"Ozone cell 1","Perfect",5,1]
["PLANT NAME",null,null,null,null,null,null,null,null,null,null,null,"Clarifier",null,null,"Manufacturer Approved",6,1]
["OR NUMBER:",null,{"$f":"IF(Description!B10=\"\",\"\",Description!B10)","v":""},null,null,null,null,"Date:",{"$f":"IF(OR(Description!H7=\"\",Description!H10=\"\",Description!H11=\"\"),\"\",Description!H9&\" \"&Description!H10&\", \"&Description!H11)","v":""},null,null,null,"DAF",null,null,"Tracer Study",7,1]
[null,null,null,null,null,null,null,null,null,null,null,null,"Filter",null,null,"Other",8,1]
["Treatment Plant Capacity",null,null,null,"  mgd",null,null,null,null,null,null,null,"Transfer Well",null,null,null,9,1]
[null,null,null,{"$f":"D12*(1000/1.44)","v":0},"  gpm",null,null,null,null,null,null,null,"Clearwell",null,null,null,10,1]
[null,null,null,null,null,null,null,null,null,null,null,null,"Other"]
["Disinfection Zone:",null,null,{"$f":"CONCATENATE(\"D\",Calculator!$BD$6)","v":"D1"},null,"Disinfectant:"]
[]
[null,"Unit - 1",null,"Type:",null,null,"Shape:"]
[]
[null,null,"Further Description:"]
[]
[null,"Characteristic",null,null,null,null,"Comments"]
[null,"Number of Units"]
[null,"Diameter",null,null,null,{"$f":"IF(H17=\"pipe\",\"  in\",\"  ft\")","v":"  ft"}]
[null,"Length",null,null,null,"  ft"]
[null,"Width",null,null,null,"  ft"]
[null,"Side Water Depth",null,null,null,"  ft"]
[null,"Center Water Depth",null,null,null,"  ft"]
[null,"Media Depth",null,null,null,"  ft"]
[null,"Underdrain Depth",null,null,null,"  ft"]
[null,"Minimum Water Depth Over Media",null,null,null,"  ft"]
[null,"Average Porosity",null,null,null,"  %"]
[null,"Maximum Volume (each)",null,null,{"$f":"IF(OR(E17=\"Clearwell\",E17=\"Transfer Well\"),IF(H17=\"Circular\",PI()*(E23/2)^2*(2*E26+E27)/3*7.4815,IF(H17=\"Rectangular\",E24*E25*E26*7.4815,\"\")),\"\")","v":""},"  gal"]
[null,"Maximum Volume (each)",null,null,null,"  gal"]
[null,"Minimum Operating Level",null,null,null,"  ft"]
[null,"Worst Case Volume (each)",null,null,{"$f":"IF(OR(E17=\"Transfer Well\",E17=\"Clearwell\"),IF(H17=\"Circular\",PI()*(E23/2)^2*(2*E34+E27-(E26-E34))/3*7.4815,IF(H17=\"Rectangular\",E24*E25*E34*7.4815,\"\")),\"\")","v":""},"  gal"]
[null,{"$f":"IF(OR(E17=\"Clearwell\",E17=\"Transfer Well\"),\"Worst Case Volume (each)\", \"Volume (each)\")","v":"Volume (each)"},null,null,null,"  gal"]
[null,"Percent of Maximum Volume",null,null,{"$f":"IF(H17=\"Other\",IF(E33 = 0,\"\",E36/E33*100),IF(OR(E17=\"Clearwell\",E17=\"Transfer Well\"),IF(E32 = 0,\"\",E35/E32*100),\"\"))","v":""},"  %"]
[]
[null,{"$f":" IF(OR(E17=\"Clearwell\",E17=\"Transfer Well\"),\"Worst Case Volume (each)\",\"Volume (each)\")","v":"Volume (each)"},null,null,{"$f":"IF(E17=\"Filter\",IF(H17=\"Circular\",PI()*(E23/2)^2*(E28*E31/100+E30+E29),IF(H17=\"Rectangular\",E24*E25*(E28*E31/100+E30+E29),\"error\")),IF(AND(E17=\"Piping\",H17=\"Pipe\"),PI()*(E23/12/2)^2*E24,IF(H17=\"Circular\",IF(OR(E17=\"Transfer Well\",E17=\"Clearwell\"),E35/7.4815,PI()*(E23/2)^2*(2*E26+E27)/3),IF(H17=\"Rectangular\",IF(OR(E17=\"Transfer Well\",E17=\"Clearwell\"),E35/7.4815,E24*E25*E26),E36/7.4815))))*7.4815","v":0},"  gal"]
[null,"Flow Rate (each)",null,null,null,"  gpm"]
[null,"Detention Time",null,null,{"$f":"IF(OR(E40=\"\",E40=0),0,E39/E40)","v":0},"  min"]
[]
[null,"Baffling Factor",null,null,{"$f":"IF(I44=\"Unbaffled\",0.1,IF(I44=\"Poor\",0.3,IF(I44=\"Average\",0.5,IF(I44=\"Superior\",0.7,IF(I44=\"Perfect\",1,IF(I44=\"\",\" \",I45))))))","v":0.1}]
[null,null,null,null,null,null,null,"Baffling Characteristics:  ","Unbaffled"]
[null,null,null,null,null,null,null,"Approved Baffling Factor:  "]
[null,"T10",null,null,{"$f":"E41*E43","v":0},"  min"]
[]
[null,"Unit - 2",null,"Type:",null,null,"Shape:"]
[]
[null,null,"Further Description:"]
[]
[null,"Characteristic",null,null,null,null,"Comments"]
[null,"Number of Units"]
[null,"Diameter",null,null,null,{"$f":"IF(H48=\"pipe\",\"  in\",\"  ft\")","v":"  ft"}]
[null,"Length",null,null,null,"  ft"]
[null,"Width",null,null,null,"  ft"]
[null,"Side Water Depth",null,null,null,"  ft"]
[null,"Center Water Depth",null,null,null,"  ft"]
[null,"Media Depth",null,null,null,"  ft"]
[null,"Underdrain Depth",null,null,null,"  ft"]
[null,"Minimum Water Depth Over Media",null,null,null,"  ft"]
[null,"Average Porosity",null,null,null,"  %"]
[null,"Maximum Volume (each)",null,null,{"$f":"IF(OR(E48=\"Clearwell\",E48=\"Transfer Well\"),IF(H48=\"Circular\",PI()*(E54/2)^2*(2*E57+E58)/3*7.4815,IF(H48=\"Rectangular\",E55*E56*E57*7.4815,\"\")),\"\")","v":""},"  gal"]
[null,"Maximum Volume (each)",null,null,null,"  gal"]
[null,"Minimum Operating Level",null,null,null,"  ft"]
[null,"Worst Case Volume (each)",null,null,{"$f":"IF(OR(E48=\"Transfer Well\",E48=\"Clearwell\"),IF(H48=\"Circular\",PI()*(E54/2)^2*(2*E65+E58-(E57-E65))/3*7.4815,IF(H48=\"Rectangular\",E55*E56*E65*7.4815,\"\")),\"\")","v":""},"  gal"]
[null,{"$f":"IF(OR(E48=\"Clearwell\",E48=\"Transfer Well\"),\"Worst Case Volume (each)\", \"Volume (each)\")","v":"Volume (each)"},null,null,null,"  gal"]
[null,"Percent of Maximum Volume",null,null,{"$f":"IF(H48=\"Other\",IF(E64 = 0,\"\",E67/E64*100),IF(OR(E48=\"Clearwell\",E48=\"Transfer Well\"),IF(E63 =0,\"\",E66/E63*100),\"\"))","v":""},"  %"]
[]
[null,{"$f":" IF(OR(E48=\"Clearwell\",E48=\"Transfer Well\"),\"Worst Case Volume (each)\",\"Volume (each)\")","v":"Volume (each)"},null,null,{"$f":"IF(E48=\"Filter\",IF(H48=\"Circular\",PI()*(E54/2)^2*(E59*E62/100+E61+E60),IF(H48=\"Rectangular\",E55*E56*(E59*E62/100+E61+E60),\"error\")),IF(AND(E48=\"Piping\",H48=\"Pipe\"),PI()*(E54/12/2)^2*E55,IF(H48=\"Circular\",IF(OR(E48=\"Transfer Well\",E48=\"Clearwell\"),E66/7.4815,PI()*(E54/2)^2*(2*E57+E58)/3),IF(H48=\"Rectangular\",IF(OR(E48=\"Transfer Well\",E48=\"Clearwell\"),E66/7.4815,E55*E56*E57),E67/7.4815))))*7.4815","v":0},"  gal"]
[null,"Flow Rate (each)",null,null,null,"  gpm"]
[null,"Detention Time",null,null,{"$f":"IF(OR(E71=\"\",E71=0),0,E70/E71)","v":0},"  min"]
[]
[null,"Baffling Factor",null,null,{"$f":"IF(I75=\"Unbaffled\",0.1,IF(I75=\"Poor\",0.3,IF(I75=\"Average\",0.5,IF(I75=\"Superior\",0.7,IF(I75=\"Perfect\",1,IF(I75=\"\",\" \",I76))))))","v":0.1}]
[null,null,null,null,null,null,null,"Baffling Characteristics:  ","Unbaffled"]
[null,null,null,null,null,null,null,"Approved Baffling Factor:  "]
[null,"T10",null,null,{"$f":"E72*E74","v":0},"  min"]
[]
[null,"Unit - 3",null,"Type:",null,null,"Shape:"]
[]
[null,null,"Further Description:"]
[]
[null,"Characteristic",null,null,null,null,"Comments"]
[null,"Number of Units"]
[null,"Diameter",null,null,null,{"$f":"IF(H79=\"pipe\",\"  in\",\"  ft\")","v":"  ft"}]
[null,"Length",null,null,null,"  ft"]
[null,"Width",null,null,null,"  ft"]
[null,"Side Water Depth",null,null,null,"  ft"]
[null,"Center Water Depth",null,null,null,"  ft"]
[null,"Media Depth",null,null,null,"  ft"]
[null,"Underdrain Depth",null,null,null,"  ft"]
[null,"Minimum Water Depth Over Media",null,null,null,"  ft"]
[null,"Average Porosity",null,null,null,"  %"]
[null,"Maximum Volume (each)",null,null,{"$f":"IF(OR(E79=\"Clearwell\",E79=\"Transfer Well\"),IF(H79=\"Circular\",PI()*(E85/2)^2*(2*E88+E89)/3*7.4815,IF(H79=\"Rectangular\",E86*E87*E88*7.4815,\"\")),\"\")","v":""},"  gal"]
[null,"Maximum Volume (each)",null,null,null,"  gal"]
[null,"Minimum Operating Level",null,null,null,"  ft"]
[null,"Worst Case Volume (each)",null,null,{"$f":"IF(OR(E79=\"Transfer Well\",E79=\"Clearwell\"),IF(H79=\"Circular\",PI()*(E85/2)^2*(2*E96+E89-(E88-E96))/3*7.4815,IF(H79=\"Rectangular\",E86*E87*E96*7.4815,\"\")),\"\")","v":""},"  gal"]
[null,{"$f":"IF(OR(E79=\"Clearwell\",E79=\"Transfer Well\"),\"Worst Case Volume (each)\", \"Volume (each)\")","v":"Volume (each)"},null,null,null,"  gal"]
[null,"Percent of Maximum Volume",null,null,{"$f":"IF(H79=\"Other\",IF(E95 = 0,\"\",E98/E95*100),IF(OR(E79=\"Clearwell\",E79=\"Transfer Well\"),IF(E94 = 0,\"\",E97/E94*100),\"\"))","v":""},"  %"]
[]
[null,{"$f":" IF(OR(E79=\"Clearwell\",E79=\"Transfer Well\"),\"Worst Case Volume (each)\",\"Volume (each)\")","v":"Volume (each)"},null,null,{"$f":"IF(E79=\"Filter\",IF(H79=\"Circular\",PI()*(E85/2)^2*(E90*E93/100+E92+E91),IF(H79=\"Rectangular\",E86*E87*(E90*E93/100+E92+E91),\"error\")),IF(AND(E79=\"Piping\",H79=\"Pipe\"),PI()*(E85/12/2)^2*E86,IF(H79=\"Circular\",IF(OR(E79=\"Transfer Well\",E79=\"Clearwell\"),E97/7.4815,PI()*(E85/2)^2*(2*E88+E89)/3),IF(H79=\"Rectangular\",IF(OR(E79=\"Transfer Well\",E79=\"Clearwell\"),E97/7.4815,E86*E87*E88),E98/7.4815))))*7.4815","v":0},"  gal"]
[null,"Flow Rate (each)",null,null,null,"  gpm"]
[null,"Detention Time",null,null,{"$f":"IF(OR(E102=\"\",E102=0),0,E101/E102)","v":0},"  min"]
[]
[null,"Baffling Factor",null,null,{"$f":"IF(I106=\"Unbaffled\",0.1,IF(I106=\"Poor\",0.3,IF(I106=\"Average\",0.5,IF(I106=\"Superior\",0.7,IF(I106=\"Perfect\",1,IF(I106=\"\",\" \",I107))))))","v":0.1}]
[null,null,null,null,null,null,null,"Baffling Characteristics:  ","Unbaffled"]
[null,null,null,null,null,null,null,"Approved Baffling Factor:  "]
[null,"T10",null,null,{"$f":"E103*E105","v":0},"  min"]
[]
[null,"Unit - 4",null,"Type:",null,null,"Shape:"]
[]
[null,null,"Further Description:"]
[]
[null,"Characteristic",null,null,null,null,"Comments"]
[null,"Number of Units"]
[null,"Diameter",null,null,null,{"$f":"IF(H110=\"pipe\",\"  in\",\"  ft\")","v":"  ft"}]
[null,"Length",null,null,null,"  ft"]
[null,"Width",null,null,null,"  ft"]
[null,"Side Water Depth",null,null,null,"  ft"]
[null,"Center Water Depth",null,null,null,"  ft"]
[null,"Media Depth",null,null,null,"  ft"]
[null,"Underdrain Depth",null,null,null,"  ft"]
[null,"Minimum Water Depth Over Media",null,null,null,"  ft"]
[null,"Average Porosity",null,null,null,"  %"]
[null,"Maximum Volume (each)",null,null,{"$f":"IF(OR(E110=\"Clearwell\",E110=\"Transfer Well\"),IF(H110=\"Circular\",PI()*(E116/2)^2*(2*E119+E120)/3*7.4815,IF(H110=\"Rectangular\",E117*E118*E119*7.4815,\"\")),\"\")","v":""},"  gal"]
[null,"Maximum Volume (each)",null,null,null,"  gal"]
[null,"Minimum Operating Level",null,null,null,"  ft"]
[null,"Worst Case Volume (each)",null,null,{"$f":"IF(OR(E110=\"Transfer Well\",E110=\"Clearwell\"),IF(H110=\"Circular\",PI()*(E116/2)^2*(2*E127+E120-(E119-E127))/3*7.4815,IF(H110=\"Rectangular\",E117*E118*E127*7.4815,\"\")),\"\")","v":""},"  gal"]
[null,{"$f":"IF(OR(E110=\"Clearwell\",E110=\"Transfer Well\"),\"Worst Case Volume (each)\", \"Volume (each)\")","v":"Volume (each)"},null,null,null,"  gal"]
[null,"Percent of Maximum Volume",null,null,{"$f":"IF(H110=\"Other\",IF(E126 = 0,\"\",E129/E126*100),IF(OR(E110=\"Clearwell\",E110=\"Transfer Well\"),IF(E125 = 0,\"\",E128/E125*100),\"\"))","v":""},"  %"]
[]
[null,{"$f":" IF(OR(E110=\"Clearwell\",E110=\"Transfer Well\"),\"Worst Case Volume (each)\",\"Volume (each)\")","v":"Volume (each)"},null,null,{"$f":"IF(E110=\"Filter\",IF(H110=\"Circular\",PI()*(E116/2)^2*(E121*E124/100+E123+E122),IF(H110=\"Rectangular\",E117*E118*(E121*E124/100+E123+E122),\"error\")),IF(AND(E110=\"Piping\",H110=\"Pipe\"),PI()*(E116/12/2)^2*E117,IF(H110=\"Circular\",IF(OR(E110=\"Transfer Well\",E110=\"Clearwell\"),E128/7.4815,PI()*(E116/2)^2*(2*E119+E120)/3),IF(H110=\"Rectangular\",IF(OR(E110=\"Transfer Well\",E110=\"Clearwell\"),E128/7.4815,E117*E118*E119),E129/7.4815))))*7.4815","v":0},"  gal"]
[null,"Flow Rate (each)",null,null,null,"  gpm"]
[null,"Detention Time",null,null,{"$f":"IF(OR(E133=\"\",E133=0),0,E132/E133)","v":0},"  min"]
[]
[null,"Baffling Factor",null,null,{"$f":"IF(I137=\"Unbaffled\",0.1,IF(I137=\"Poor\",0.3,IF(I137=\"Average\",0.5,IF(I137=\"Superior\",0.7,IF(I137=\"Perfect\",1,IF(I137=\"\",\" \",I138))))))","v":0.1}]
[null,null,null,null,null,null,null,"Baffling Characteristics:  ","Unbaffled"]
[null,null,null,null,null,null,null,"Approved Baffling Factor:  "]
[null,"T10",null,null,{"$f":"E134*E136","v":0},"  min"]
[]
[null,"Unit - 5",null,"Type:",null,null,"Shape:"]
[]
[null,null,"Further Description:"]
[]
[null,"Characteristic",null,null,null,null,"Comments"]
[null,"Number of Units"]
[null,"Diameter",null,null,null,{"$f":"IF(H141=\"pipe\",\"  in\",\"  ft\")","v":"  ft"}]
[null,"Length",null,null,null,"  ft"]
[null,"Width",null,null,null,"  ft"]
[null,"Side Water Depth",null,null,null,"  ft"]
[null,"Center Water Depth",null,null,null,"  ft"]
[null,"Media Depth",null,null,null,"  ft"]
[null,"Underdrain Depth",null,null,null,"  ft"]
[null,"Minimum Water Depth Over Media",null,null,null,"  ft"]
[null,"Average Porosity",null,null,null,"  %"]
[null,"Maximum Volume (each)",null,null,{"$f":"IF(OR(E141=\"Clearwell\",E141=\"Transfer Well\"),IF(H141=\"Circular\",PI()*(E147/2)^2*(2*E150+E151)/3*7.4815,IF(H141=\"Rectangular\",E148*E149*E150*7.4815,\"\")),\"\")","v":""},"  gal"]
[null,"Maximum Volume (each)",null,null,null,"  gal"]
[null,"Minimum Operating Level",null,null,null,"  ft"]
[null,"Worst Case Volume (each)",null,null,{"$f":"IF(OR(E141=\"Transfer Well\",E141=\"Clearwell\"),IF(H141=\"Circular\",PI()*(E147/2)^2*(2*E158+E151-(E150-E158))/3*7.4815,IF(H141=\"Rectangular\",E148*E149*E158*7.4815,\"\")),\"\")","v":""},"  gal"]
[null,{"$f":"IF(OR(E141=\"Clearwell\",E141=\"Transfer Well\"),\"Worst Case Volume (each)\", \"Volume (each)\")","v":"Volume (each)"},null,null,null,"  gal"]
[null,"Percent of Maximum Volume",null,null,{"$f":"IF(H141=\"Other\",IF(E157 = 0,\"\",E160/E157*100),IF(OR(E141=\"Clearwell\",E141=\"Transfer Well\"),IF(E156 = 0,\"\",E159/E156*100),\"\"))","v":""},"  %"]
[]
[null,{"$f":" IF(OR(E141=\"Clearwell\",E141=\"Transfer Well\"),\"Worst Case Volume (each)\",\"Volume (each)\")","v":"Volume (each)"},null,null,{"$f":"IF(E141=\"Filter\",IF(H141=\"Circular\",PI()*(E147/2)^2*(E152*E155/100+E154+E153),IF(H141=\"Rectangular\",E148*E149*(E152*E155/100+E154+E153),\"error\")),IF(AND(E141=\"Piping\",H141=\"Pipe\"),PI()*(E147/12/2)^2*E148,IF(H141=\"Circular\",IF(OR(E141=\"Transfer Well\",E141=\"Clearwell\"),E159/7.4815,PI()*(E147/2)^2*(2*E150+E151)/3),IF(H141=\"Rectangular\",IF(OR(E141=\"Transfer Well\",E141=\"Clearwell\"),E159/7.4815,E148*E149*E150),E160/7.4815))))*7.4815","v":0},"  gal"]
[null,"Flow Rate (each)",null,null,null,"  gpm"]
[null,"Detention Time",null,null,{"$f":"IF(OR(E164=\"\",E164=0),0,E163/E164)","v":0},"  min"]
[]
[null,"Baffling Factor",null,null,{"$f":"IF(I168=\"Unbaffled\",0.1,IF(I168=\"Poor\",0.3,IF(I168=\"Average\",0.5,IF(I168=\"Superior\",0.7,IF(I168=\"Perfect\",1,IF(I168=\"\",\" \",I169))))))","v":0.1}]
[null,null,null,null,null,null,null,"Baffling Characteristics:  ","Unbaffled"]
[null,null,null,null,null,null,null,"Approved Baffling Factor:  "]
[null,"T10",null,null,{"$f":"E165*E167","v":0},"  min"]
[]
[null,"Unit - 6",null,"Type:",null,null,"Shape:"]
[]
[null,null,"Further Description:"]
[]
[null,"Characteristic",null,null,null,null,"Comments"]
[null,"Number of Units"]
[null,"Diameter",null,null,null,{"$f":"IF(H172=\"pipe\",\"  in\",\"  ft\")","v":"  ft"}]
[null,"Length",null,null,null,"  ft"]
[null,"Width",null,null,null,"  ft"]
[null,"Side Water Depth",null,null,null,"  ft"]
[null,"Center Water Depth",null,null,null,"  ft"]
[null,"Media Depth",null,null,null,"  ft"]
[null,"Underdrain Depth",null,null,null,"  ft"]
[null,"Minimum Water Depth Over Media",null,null,null,"  ft"]
[null,"Average Porosity",null,null,null,"  %"]
[null,"Maximum Volume (each)",null,null,{"$f":"IF(OR(E172=\"Clearwell\",E172=\"Transfer Well\"),IF(H172=\"Circular\",PI()*(E178/2)^2*(2*E181+E182)/3*7.4815,IF(H172=\"Rectangular\",E179*E180*E181*7.4815,\"\")),\"\")","v":""},"  gal"]
[null,"Maximum Volume (each)",null,null,null,"  gal"]
[null,"Minimum Operating Level",null,null,null,"  ft"]
[null,"Worst Case Volume (each)",null,null,{"$f":"IF(OR(E172=\"Transfer Well\",E172=\"Clearwell\"),IF(H172=\"Circular\",PI()*(E178/2)^2*(2*E189+E182-(E181-E189))/3*7.4815,IF(H172=\"Rectangular\",E179*E180*E189*7.4815,\"\")),\"\")","v":""},"  gal"]
[null,{"$f":"IF(OR(E172=\"Clearwell\",E172=\"Transfer Well\"),\"Worst Case Volume (each)\", \"Volume (each)\")","v":"Volume (each)"},null,null,null,"  gal"]
[null,"Percent of Maximum Volume",null,null,{"$f":"IF(H172=\"Other\",IF(E188 = 0,\"\",E191/E188*100),IF(OR(E172=\"Clearwell\",E172=\"Transfer Well\"),IF(E187 = 0,\"\",E190/E187*100),\"\"))","v":""},"  %"]
[]
[null,{"$f":" IF(OR(E172=\"Clearwell\",E172=\"Transfer Well\"),\"Worst Case Volume (each)\",\"Volume (each)\")","v":"Volume (each)"},null,null,{"$f":"IF(E172=\"Filter\",IF(H172=\"Circular\",PI()*(E178/2)^2*(E183*E186/100+E185+E184),IF(H172=\"Rectangular\",E179*E180*(E183*E186/100+E185+E184),\"error\")),IF(AND(E172=\"Piping\",H172=\"Pipe\"),PI()*(E178/12/2)^2*E179,IF(H172=\"Circular\",IF(OR(E172=\"Transfer Well\",E172=\"Clearwell\"),E190/7.4815,PI()*(E178/2)^2*(2*E181+E182)/3),IF(H172=\"Rectangular\",IF(OR(E172=\"Transfer Well\",E172=\"Clearwell\"),E190/7.4815,E179*E180*E181),E191/7.4815))))*7.4815","v":0},"  gal"]
[null,"Flow Rate (each)",null,null,null,"  gpm"]
[null,"Detention Time",null,null,{"$f":"IF(OR(E195=\"\",E195=0),0,E194/E195)","v":0},"  min"]
[]
[null,"Baffling Factor",null,null,{"$f":"IF(I199=\"Unbaffled\",0.1,IF(I199=\"Poor\",0.3,IF(I199=\"Average\",0.5,IF(I199=\"Superior\",0.7,IF(I199=\"Perfect\",1,IF(I199=\"\",\" \",I200))))))","v":0.1}]
[null,null,null,null,null,null,null,"Baffling Characteristics:  ","Unbaffled"]
[null,null,null,null,null,null,null,"Approved Baffling Factor:  "]
[null,"T10",null,null,{"$f":"E196*E198","v":0},"  min"]
[]
[null,"Unit - 7",null,"Type:",null,null,"Shape:"]
[]
[null,null,"Further Description:"]
[]
[null,"Characteristic",null,null,null,null,"Comments"]
[null,"Number of Units"]
[null,"Diameter",null,null,null,{"$f":"IF(H203=\"pipe\",\"  in\",\"  ft\")","v":"  ft"}]
[null,"Length",null,null,null,"  ft"]
[null,"Width",null,null,null,"  ft"]
[null,"Side Water Depth",null,null,null,"  ft"]
[null,"Center Water Depth",null,null,null,"  ft"]
[null,"Media Depth",null,null,null,"  ft"]
[null,"Underdrain Depth",null,null,null,"  ft"]
[null,"Minimum Water Depth Over Media",null,null,null,"  ft"]
[null,"Average Porosity",null,null,null,"  %"]
[null,"Maximum Volume (each)",null,null,{"$f":"IF(OR(E203=\"Clearwell\",E203=\"Transfer Well\"),IF(H203=\"Circular\",PI()*(E209/2)^2*(2*E212+E213)/3*7.4815,IF(H203=\"Rectangular\",E210*E211*E212*7.4815,\"\")),\"\")","v":""},"  gal"]
[null,"Maximum Volume (each)",null,null,null,"  gal"]
[null,"Minimum Operating Level",null,null,null,"  ft"]
[null,"Worst Case Volume (each)",null,null,{"$f":"IF(OR(E203=\"Transfer Well\",E203=\"Clearwell\"),IF(H203=\"Circular\",PI()*(E209/2)^2*(2*E220+E213-(E212-E220))/3*7.4815,IF(H203=\"Rectangular\",E210*E211*E220*7.4815,\"\")),\"\")","v":""},"  gal"]
[null,{"$f":"IF(OR(E203=\"Clearwell\",E203=\"Transfer Well\"),\"Worst Case Volume (each)\", \"Volume (each)\")","v":"Volume (each)"},null,null,null,"  gal"]
[null,"Percent of Maximum Volume",null,null,{"$f":"IF(H203=\"Other\",IF(E219 = 0,\"\",E222/E219*100),IF(OR(E203=\"Clearwell\",E203=\"Transfer Well\"),IF(E218 = 0,\"\",E221/E218*100),\"\"))","v":""},"  %"]
[]
[null,{"$f":" IF(OR(E203=\"Clearwell\",E203=\"Transfer Well\"),\"Worst Case Volume (each)\",\"Volume (each)\")","v":"Volume (each)"},null,null,{"$f":"IF(E203=\"Filter\",IF(H203=\"Circular\",PI()*(E209/2)^2*(E214*E217/100+E216+E215),IF(H203=\"Rectangular\",E210*E211*(E214*E217/100+E216+E215),\"error\")),IF(AND(E203=\"Piping\",H203=\"Pipe\"),PI()*(E209/12/2)^2*E210,IF(H203=\"Circular\",IF(OR(E203=\"Transfer Well\",E203=\"Clearwell\"),E221/7.4815,PI()*(E209/2)^2*(2*E212+E213)/3),IF(H203=\"Rectangular\",IF(OR(E203=\"Transfer Well\",E203=\"Clearwell\"),E221/7.4815,E210*E211*E212),E222/7.4815))))*7.4815","v":0},"  gal"]
[null,"Flow Rate (each)",null,null,null,"  gpm"]
[null,"Detention Time",null,null,{"$f":"IF(OR(E226=\"\",E226=0),0,E225/E226)","v":0},"  min"]
[]
[null,"Baffling Factor",null,null,{"$f":"IF(I230=\"Unbaffled\",0.1,IF(I230=\"Poor\",0.3,IF(I230=\"Average\",0.5,IF(I230=\"Superior\",0.7,IF(I230=\"Perfect\",1,IF(I230=\"\",\" \",I231))))))","v":0.1}]
[null,null,null,null,null,null,null,"Baffling Characteristics:  ","Unbaffled"]
[null,null,null,null,null,null,null,"Approved Baffling Factor:  "]
[null,"T10",null,null,{"$f":"E227*E229","v":0},"  min"]
[]
[null,"Unit - 8",null,"Type:",null,null,"Shape:"]
[]
[null,null,"Further Description:"]
[]
[null,"Characteristic",null,null,null,null,"Comments"]
[null,"Number of Units"]
[null,"Diameter",null,null,null,{"$f":"IF(H234=\"pipe\",\"  in\",\"  ft\")","v":"  ft"}]
[null,"Length",null,null,null,"  ft"]
[null,"Width",null,null,null,"  ft"]
[null,"Side Water Depth",null,null,null,"  ft"]
[null,"Center Water Depth",null,null,null,"  ft"]
[null,"Media Depth",null,null,null,"  ft"]
[null,"Underdrain Depth",null,null,null,"  ft"]
[null,"Minimum Water Depth Over Media",null,null,null,"  ft"]
[null,"Average Porosity",null,null,null,"  %"]
[null,"Maximum Volume (each)",null,null,{"$f":"IF(OR(E234=\"Clearwell\",E234=\"Transfer Well\"),IF(H234=\"Circular\",PI()*(E240/2)^2*(2*E243+E244)/3*7.4815,IF(H234=\"Rectangular\",E241*E242*E243*7.4815,\"\")),\"\")","v":""},"  gal"]
[null,"Maximum Volume (each)",null,null,null,"  gal"]
[null,"Minimum Operating Level",null,null,null,"  ft"]
[null,"Worst Case Volume (each)",null,null,{"$f":"IF(OR(E234=\"Transfer Well\",E234=\"Clearwell\"),IF(H234=\"Circular\",PI()*(E240/2)^2*(2*E251+E244-(E243-E251))/3*7.4815,IF(H234=\"Rectangular\",E241*E242*E251*7.4815,\"\")),\"\")","v":""},"  gal"]
[null,{"$f":"IF(OR(E234=\"Clearwell\",E234=\"Transfer Well\"),\"Worst Case Volume (each)\", \"Volume (each)\")","v":"Volume (each)"},null,null,null,"  gal"]
[null,"Percent of Maximum Volume",null,null,{"$f":"IF(H234=\"Other\",IF(E250 = 0,\"\",E253/E250*100),IF(OR(E234=\"Clearwell\",E234=\"Transfer Well\"),IF(E249 = 0,\"\",E252/E249*100),\"\"))","v":""},"  %"]
[]
[null,{"$f":" IF(OR(E234=\"Clearwell\",E234=\"Transfer Well\"),\"Worst Case Volume (each)\",\"Volume (each)\")","v":"Volume (each)"},null,null,{"$f":"IF(E234=\"Filter\",IF(H234=\"Circular\",PI()*(E240/2)^2*(E245*E248/100+E247+E246),IF(H234=\"Rectangular\",E241*E242*(E245*E248/100+E247+E246),\"error\")),IF(AND(E234=\"Piping\",H234=\"Pipe\"),PI()*(E240/12/2)^2*E241,IF(H234=\"Circular\",IF(OR(E234=\"Transfer Well\",E234=\"Clearwell\"),E252/7.4815,PI()*(E240/2)^2*(2*E243+E244)/3),IF(H234=\"Rectangular\",IF(OR(E234=\"Transfer Well\",E234=\"Clearwell\"),E252/7.4815,E241*E242*E243),E253/7.4815))))*7.4815","v":0},"  gal"]
[null,"Flow Rate (each)",null,null,null,"  gpm"]
[null,"Detention Time",null,null,{"$f":"IF(OR(E257=\"\",E257=0),0,E256/E257)","v":0},"  min"]
[]
[null,"Baffling Factor",null,null,{"$f":"IF(I261=\"Unbaffled\",0.1,IF(I261=\"Poor\",0.3,IF(I261=\"Average\",0.5,IF(I261=\"Superior\",0.7,IF(I261=\"Perfect\",1,IF(I261=\"\",\" \",I262))))))","v":0.1}]
[null,null,null,null,null,null,null,"Baffling Characteristics:  ","Unbaffled"]
[null,null,null,null,null,null,null,"Approved Baffling Factor:  "]
[null,"T10",null,null,{"$f":"E258*E260","v":0},"  min"]
[]
[null,"Unit - 9",null,"Type:",null,null,"Shape:"]
[]
[null,null,"Further Description:"]
[]
[null,"Characteristic",null,null,null,null,"Comments"]
[null,"Number of Units"]
[null,"Diameter",null,null,null,{"$f":"IF(H265=\"pipe\",\"  in\",\"  ft\")","v":"  ft"}]
[null,"Length",null,null,null,"  ft"]
[null,"Width",null,null,null,"  ft"]
[null,"Side Water Depth",null,null,null,"  ft"]
[null,"Center Water Depth",null,null,null,"  ft"]
[null,"Media Depth",null,null,null,"  ft"]
[null,"Underdrain Depth",null,null,null,"  ft"]
[null,"Minimum Water Depth Over Media",null,null,null,"  ft"]
[null,"Average Porosity",null,null,null,"  %"]
[null,"Maximum Volume (each)",null,null,{"$f":"IF(OR(E265=\"Clearwell\",E265=\"Transfer Well\"),IF(H265=\"Circular\",PI()*(E271/2)^2*(2*E274+E275)/3*7.4815,IF(H265=\"Rectangular\",E272*E273*E274*7.4815,\"\")),\"\")","v":""},"  gal"]
[null,"Maximum Volume (each)",null,null,null,"  gal"]
[null,"Minimum Operating Level",null,null,null,"  ft"]
[null,"Worst Case Volume (each)",null,null,{"$f":"IF(OR(E265=\"Transfer Well\",E265=\"Clearwell\"),IF(H265=\"Circular\",PI()*(E271/2)^2*(2*E282+E275-(E274-E282))/3*7.4815,IF(H265=\"Rectangular\",E272*E273*E282*7.4815,\"\")),\"\")","v":""},"  gal"]
[null,{"$f":"IF(OR(E265=\"Clearwell\",E265=\"Transfer Well\"),\"Worst Case Volume (each)\", \"Volume (each)\")","v":"Volume (each)"},null,null,null,"  gal"]
[null,"Percent of Maximum Volume",null,null,{"$f":"IF(H265=\"Other\",IF(E281 = 0,\"\",E284/E281*100),IF(OR(E265=\"Clearwell\",E265=\"Transfer Well\"),IF(E280 = 0,\"\",E283/E280*100),\"\"))","v":""},"  %"]
[]
[null,{"$f":" IF(OR(E265=\"Clearwell\",E265=\"Transfer Well\"),\"Worst Case Volume (each)\",\"Volume (each)\")","v":"Volume (each)"},null,null,{"$f":"IF(E265=\"Filter\",IF(H265=\"Circular\",PI()*(E271/2)^2*(E276*E279/100+E278+E277),IF(H265=\"Rectangular\",E272*E273*(E276*E279/100+E278+E277),\"error\")),IF(AND(E265=\"Piping\",H265=\"Pipe\"),PI()*(E271/12/2)^2*E272,IF(H265=\"Circular\",IF(OR(E265=\"Transfer Well\",E265=\"Clearwell\"),E283/7.4815,PI()*(E271/2)^2*(2*E274+E275)/3),IF(H265=\"Rectangular\",IF(OR(E265=\"Transfer Well\",E265=\"Clearwell\"),E283/7.4815,E272*E273*E274),E284/7.4815))))*7.4815","v":0},"  gal"]
[null,"Flow Rate (each)",null,null,null,"  gpm"]
[null,"Detention Time",null,null,{"$f":"IF(OR(E288=\"\",E288=0),0,E287/E288)","v":0},"  min"]
[]
[null,"Baffling Factor",null,null,{"$f":"IF(I292=\"Unbaffled\",0.1,IF(I292=\"Poor\",0.3,IF(I292=\"Average\",0.5,IF(I292=\"Superior\",0.7,IF(I292=\"Perfect\",1,IF(I292=\"\",\" \",I293))))))","v":0.1}]
[null,null,null,null,null,null,null,"Baffling Characteristics:  ","Unbaffled"]
[null,null,null,null,null,null,null,"Approved Baffling Factor:  "]
[null,"T10",null,null,{"$f":"E289*E291","v":0},"  min"]
[]
[null,"Unit - 10",null,"Type:",null,null,"Shape:"]
[]
[null,null,"Further Description:"]
[]
[null,"Characteristic",null,null,null,null,"Comments"]
[null,"Number of Units"]
[null,"Diameter",null,null,null,{"$f":"IF(H296=\"pipe\",\"  in\",\"  ft\")","v":"  ft"}]
[null,"Length",null,null,null,"  ft"]
[null,"Width",null,null,null,"  ft"]
[null,"Side Water Depth",null,null,null,"  ft"]
[null,"Center Water Depth",null,null,null,"  ft"]
[null,"Media Depth",null,null,null,"  ft"]
[null,"Underdrain Depth",null,null,null,"  ft"]
[null,"Minimum Water Depth Over Media",null,null,null,"  ft"]
[null,"Average Porosity",null,null,null,"  %"]
[null,"Maximum Volume (each)",null,null,{"$f":"IF(OR(E296=\"Clearwell\",E296=\"Transfer Well\"),IF(H296=\"Circular\",PI()*(E302/2)^2*(2*E305+E306)/3*7.4815,IF(H296=\"Rectangular\",E303*E304*E305*7.4815,\"\")),\"\")","v":""},"  gal"]
[null,"Maximum Volume (each)",null,null,null,"  gal"]
[null,"Minimum Operating Level",null,null,null,"  ft"]
[null,"Worst Case Volume (each)",null,null,{"$f":"IF(OR(E296=\"Transfer Well\",E296=\"Clearwell\"),IF(H296=\"Circular\",PI()*(E302/2)^2*(2*E313+E306-(E305-E313))/3*7.4815,IF(H296=\"Rectangular\",E303*E304*E313*7.4815,\"\")),\"\")","v":""},"  gal"]
[null,{"$f":"IF(OR(E296=\"Clearwell\",E296=\"Transfer Well\"),\"Worst Case Volume (each)\", \"Volume (each)\")","v":"Volume (each)"},null,null,null,"  gal"]
[null,"Percent of Maximum Volume",null,null,{"$f":"IF(H296=\"Other\",IF(E312 = 0,\"\",E315/E312*100),IF(OR(E296=\"Clearwell\",E296=\"Transfer Well\"),IF(E311 =0,\"\",E314/E311*100),\"\"))","v":""},"  %"]
[]
[null,{"$f":" IF(OR(E296=\"Clearwell\",E296=\"Transfer Well\"),\"Worst Case Volume (each)\",\"Volume (each)\")","v":"Volume (each)"},null,null,{"$f":"IF(E296=\"Filter\",IF(H296=\"Circular\",PI()*(E302/2)^2*(E307*E310/100+E309+E308),IF(H296=\"Rectangular\",E303*E304*(E307*E310/100+E309+E308),\"error\")),IF(AND(E296=\"Piping\",H296=\"Pipe\"),PI()*(E302/12/2)^2*E303,IF(H296=\"Circular\",IF(OR(E296=\"Transfer Well\",E296=\"Clearwell\"),E314/7.4815,PI()*(E302/2)^2*(2*E305+E306)/3),IF(H296=\"Rectangular\",IF(OR(E296=\"Transfer Well\",E296=\"Clearwell\"),E314/7.4815,E303*E304*E305),E315/7.4815))))*7.4815","v":0},"  gal"]
[null,"Flow Rate (each)",null,null,null,"  gpm"]
[null,"Detention Time",null,null,{"$f":"IF(OR(E319=\"\",E319=0),0,E318/E319)","v":0},"  min"]
[]
[null,"Baffling Factor",null,null,{"$f":"IF(I323=\"Unbaffled\",0.1,IF(I323=\"Poor\",0.3,IF(I323=\"Average\",0.5,IF(I323=\"Superior\",0.7,IF(I323=\"Perfect\",1,IF(I323=\"\",\" \",I324))))))","v":0.1}]
[null,null,null,null,null,null,null,"Baffling Characteristics:  ","Unbaffled"]
[null,null,null,null,null,null,null,"Approved Baffling Factor:  "]
[null,"T10",null,null,{"$f":"E320*E322","v":0},"  min"]
[]
[null,{"$f":"CONCATENATE(D15,\" FLOW RATE\")","v":"D1 FLOW RATE"},null,null,{"$f":"MaxUnitFlow(E46,E77,E108,E139,E170,E201,E232,E263,E294,E325,E40,E71,E102,E133,E164,E195,E226,E257,E288,E319)*60*24/10^6","v":0},"  mgd"]
[]
[null,{"$f":"CONCATENATE(\"T10 SUM FOR \",D15)","v":"T10 SUM FOR D1"},null,null,{"$f":"SUM(E46,E77,E108,E139,E170,E201,E232,E263,E294,E325)","v":0},"  min"]
[]
["Disinfection Zone:",null,null,{"$f":"CONCATENATE(\"D\",Calculator!$BE$6)","v":"D2"},null,"Disinfectant:"]
[]
[null,"Unit - 1",null,"Type:",null,null,"Shape:"]
[]
[null,null,"Further Description:"]
[]
[null,"Characteristic",null,null,null,null,"Comments"]
[null,"Number of Units"]
[null,"Diameter",null,null,null,{"$f":"IF(H333=\"pipe\",\"  in\",\"  ft\")","v":"  ft"}]
[null,"Length",null,null,null,"  ft"]
[null,"Width",null,null,null,"  ft"]
[null,"Side Water Depth",null,null,null,"  ft"]
[null,"Center Water Depth",null,null,null,"  ft"]
[null,"Media Depth",null,null,null,"  ft"]
[null,"Underdrain Depth",null,null,null,"  ft"]
[null,"Minimum Water Depth Over Media",null,null,null,"  ft"]
[null,"Average Porosity",null,null,null,"  %"]
[null,"Maximum Volume (each)",null,null,{"$f":"IF(OR(E333=\"Clearwell\",E333=\"Transfer Well\"),IF(H333=\"Circular\",PI()*(E339/2)^2*(2*E342+E343)/3*7.4815,IF(H333=\"Rectangular\",E340*E341*E342*7.4815,\"\")),\"\")","v":""},"  gal"]
[null,"Maximum Volume (each)",null,null,null,"  gal"]
[null,"Minimum Operating Level",null,null,null,"  ft"]
[null,"Worst Case Volume (each)",null,null,{"$f":"IF(OR(E333=\"Transfer Well\",E333=\"Clearwell\"),IF(H333=\"Circular\",PI()*(E339/2)^2*(2*E350+E343-(E342-E350))/3*7.4815,IF(H333=\"Rectangular\",E340*E341*E350*7.4815,\"\")),\"\")","v":""},"  gal"]
[null,{"$f":"IF(OR(E333=\"Clearwell\",E333=\"Transfer Well\"),\"Worst Case Volume (each)\", \"Volume (each)\")","v":"Volume (each)"},null,null,null,"  gal"]
[null,"Percent of Maximum Volume",null,null,{"$f":"IF(H333=\"Other\",IF(E349 = 0,\"\",E352/E349*100),IF(OR(E333=\"Clearwell\",E333=\"Transfer Well\"),IF(E348 = 0,\"\",E351/E348*100),\"\"))","v":""},"  %"]
[]
[null,{"$f":" IF(OR(E333=\"Clearwell\",E333=\"Transfer Well\"),\"Worst Case Volume (each)\",\"Volume (each)\")","v":"Volume (each)"},null,null,{"$f":"IF(E333=\"Filter\",IF(H333=\"Circular\",PI()*(E339/2)^2*(E344*E347/100+E346+E345),IF(H333=\"Rectangular\",E340*E341*(E344*E347/100+E346+E345),\"error\")),IF(AND(E333=\"Piping\",H333=\"Pipe\"),PI()*(E339/12/2)^2*E340,IF(H333=\"Circular\",IF(OR(E333=\"Transfer Well\",E333=\"Clearwell\"),E351/7.4815,PI()*(E339/2)^2*(2*E342+E343)/3),IF(H333=\"Rectangular\",IF(OR(E333=\"Transfer Well\",E333=\"Clearwell\"),E351/7.4815,E340*E341*E342),E352/7.4815))))*7.4815","v":0},"  gal"]
[null,"Flow Rate (each)",null,null,null,"  gpm"]
[null,"Detention Time",null,null,{"$f":"IF(OR(E356=\"\",E356=0),0,E355/E356)","v":0},"  min"]
[]
[null,"Baffling Factor",null,null,{"$f":"IF(I360=\"Unbaffled\",0.1,IF(I360=\"Poor\",0.3,IF(I360=\"Average\",0.5,IF(I360=\"Superior\",0.7,IF(I360=\"Perfect\",1,IF(I360=\"\",\" \",I361))))))","v":0.1}]
[null,null,null,null,null,null,null,"Baffling Characteristics:  ","Unbaffled"]
[null,null,null,null,null,null,null,"Approved Baffling Factor:  "]
[null,"T10",null,null,{"$f":"E357*E359","v":0},"  min"]
[]
[null,"Unit - 2",null,"Type:",null,null,"Shape:"]
[]
[null,null,"Further Description:"]
[]
[null,"Characteristic",null,null,null,null,"Comments"]
[null,"Number of Units"]
[null,"Diameter",null,null,null,{"$f":"IF(H364=\"pipe\",\"  in\",\"  ft\")","v":"  ft"}]
[null,"Length",null,null,null,"  ft"]
[null,"Width",null,null,null,"  ft"]
[null,"Side Water Depth",null,null,null,"  ft"]
[null,"Center Water Depth",null,null,null,"  ft"]
[null,"Media Depth",null,null,null,"  ft"]
[null,"Underdrain Depth",null,null,null,"  ft"]
[null,"Minimum Water Depth Over Media",null,null,null,"  ft"]
[null,"Average Porosity",null,null,null,"  %"]
[null,"Maximum Volume (each)",null,null,{"$f":"IF(OR(E364=\"Clearwell\",E364=\"Transfer Well\"),IF(H364=\"Circular\",PI()*(E370/2)^2*(2*E373+E374)/3*7.4815,IF(H364=\"Rectangular\",E371*E372*E373*7.4815,\"\")),\"\")","v":""},"  gal"]
[null,"Maximum Volume (each)",null,null,null,"  gal"]
[null,"Minimum Operating Level",null,null,null,"  ft"]
[null,"Worst Case Volume (each)",null,null,{"$f":"IF(OR(E364=\"Transfer Well\",E364=\"Clearwell\"),IF(H364=\"Circular\",PI()*(E370/2)^2*(2*E381+E374-(E373-E381))/3*7.4815,IF(H364=\"Rectangular\",E371*E372*E381*7.4815,\"\")),\"\")","v":""},"  gal"]
[null,{"$f":"IF(OR(E364=\"Clearwell\",E364=\"Transfer Well\"),\"Worst Case Volume (each)\", \"Volume (each)\")","v":"Volume (each)"},null,null,null,"  gal"]
[null,"Percent of Maximum Volume",null,null,{"$f":"IF(H364=\"Other\",IF(E380 = 0,\"\",E383/E380*100),IF(OR(E364=\"Clearwell\",E364=\"Transfer Well\"),IF(E379 =0,\"\",E382/E379*100),\"\"))","v":""},"  %"]
[]
[null,{"$f":" IF(OR(E364=\"Clearwell\",E364=\"Transfer Well\"),\"Worst Case Volume (each)\",\"Volume (each)\")","v":"Volume (each)"},null,null,{"$f":"IF(E364=\"Filter\",IF(H364=\"Circular\",PI()*(E370/2)^2*(E375*E378/100+E377+E376),IF(H364=\"Rectangular\",E371*E372*(E375*E378/100+E377+E376),\"error\")),IF(AND(E364=\"Piping\",H364=\"Pipe\"),PI()*(E370/12/2)^2*E371,IF(H364=\"Circular\",IF(OR(E364=\"Transfer Well\",E364=\"Clearwell\"),E382/7.4815,PI()*(E370/2)^2*(2*E373+E374)/3),IF(H364=\"Rectangular\",IF(OR(E364=\"Transfer Well\",E364=\"Clearwell\"),E382/7.4815,E371*E372*E373),E383/7.4815))))*7.4815","v":0},"  gal"]
[null,"Flow Rate (each)",null,null,null,"  gpm"]
[null,"Detention Time",null,null,{"$f":"IF(OR(E387=\"\",E387=0),0,E386/E387)","v":0},"  min"]
[]
[null,"Baffling Factor",null,null,{"$f":"IF(I391=\"Unbaffled\",0.1,IF(I391=\"Poor\",0.3,IF(I391=\"Average\",0.5,IF(I391=\"Superior\",0.7,IF(I391=\"Perfect\",1,IF(I391=\"\",\" \",I392))))))","v":0.1}]
[null,null,null,null,null,null,null,"Baffling Characteristics:  ","Unbaffled"]
[null,null,null,null,null,null,null,"Approved Baffling Factor:  "]
[null,"T10",null,null,{"$f":"E388*E390","v":0},"  min"]
[]
[null,"Unit - 3",null,"Type:",null,null,"Shape:"]
[]
[null,null,"Further Description:"]
[]
[null,"Characteristic",null,null,null,null,"Comments"]
[null,"Number of Units"]
[null,"Diameter",null,null,null,{"$f":"IF(H395=\"pipe\",\"  in\",\"  ft\")","v":"  ft"}]
[null,"Length",null,null,null,"  ft"]
[null,"Width",null,null,null,"  ft"]
[null,"Side Water Depth",null,null,null,"  ft"]
[null,"Center Water Depth",null,null,null,"  ft"]
[null,"Media Depth",null,null,null,"  ft"]
[null,"Underdrain Depth",null,null,null,"  ft"]
[null,"Minimum Water Depth Over Media",null,null,null,"  ft"]
[null,"Average Porosity",null,null,null,"  %"]
[null,"Maximum Volume (each)",null,null,{"$f":"IF(OR(E395=\"Clearwell\",E395=\"Transfer Well\"),IF(H395=\"Circular\",PI()*(E401/2)^2*(2*E404+E405)/3*7.4815,IF(H395=\"Rectangular\",E402*E403*E404*7.4815,\"\")),\"\")","v":""},"  gal"]
[null,"Maximum Volume (each)",null,null,null,"  gal"]
[null,"Minimum Operating Level",null,null,null,"  ft"]
[null,"Worst Case Volume (each)",null,null,{"$f":"IF(OR(E395=\"Transfer Well\",E395=\"Clearwell\"),IF(H395=\"Circular\",PI()*(E401/2)^2*(2*E412+E405-(E404-E412))/3*7.4815,IF(H395=\"Rectangular\",E402*E403*E412*7.4815,\"\")),\"\")","v":""},"  gal"]
[null,{"$f":"IF(OR(E395=\"Clearwell\",E395=\"Transfer Well\"),\"Worst Case Volume (each)\", \"Volume (each)\")","v":"Volume (each)"},null,null,null,"  gal"]
[null,"Percent of Maximum Volume",null,null,{"$f":"IF(H395=\"Other\",IF(E411 = 0,\"\",E414/E411*100),IF(OR(E395=\"Clearwell\",E395=\"Transfer Well\"),IF(E410 = 0,\"\",E413/E410*100),\"\"))","v":""},"  %"]
[]
[null,{"$f":" IF(OR(E395=\"Clearwell\",E395=\"Transfer Well\"),\"Worst Case Volume (each)\",\"Volume (each)\")","v":"Volume (each)"},null,null,{"$f":"IF(E395=\"Filter\",IF(H395=\"Circular\",PI()*(E401/2)^2*(E406*E409/100+E408+E407),IF(H395=\"Rectangular\",E402*E403*(E406*E409/100+E408+E407),\"error\")),IF(AND(E395=\"Piping\",H395=\"Pipe\"),PI()*(E401/12/2)^2*E402,IF(H395=\"Circular\",IF(OR(E395=\"Transfer Well\",E395=\"Clearwell\"),E413/7.4815,PI()*(E401/2)^2*(2*E404+E405)/3),IF(H395=\"Rectangular\",IF(OR(E395=\"Transfer Well\",E395=\"Clearwell\"),E413/7.4815,E402*E403*E404),E414/7.4815))))*7.4815","v":0},"  gal"]
[null,"Flow Rate (each)",null,null,null,"  gpm"]
[null,"Detention Time",null,null,{"$f":"IF(OR(E418=\"\",E418=0),0,E417/E418)","v":0},"  min"]
[]
[null,"Baffling Factor",null,null,{"$f":"IF(I422=\"Unbaffled\",0.1,IF(I422=\"Poor\",0.3,IF(I422=\"Average\",0.5,IF(I422=\"Superior\",0.7,IF(I422=\"Perfect\",1,IF(I422=\"\",\" \",I423))))))","v":0.1}]
[null,null,null,null,null,null,null,"Baffling Characteristics:  ","Unbaffled"]
[null,null,null,null,null,null,null,"Approved Baffling Factor:  "]
[null,"T10",null,null,{"$f":"E419*E421","v":0},"  min"]
[]
[null,"Unit - 4",null,"Type:",null,null,"Shape:"]
[]
[null,null,"Further Description:"]
[]
[null,"Characteristic",null,null,null,null,"Comments"]
[null,"Number of Units"]
[null,"Diameter",null,null,null,{"$f":"IF(H426=\"pipe\",\"  in\",\"  ft\")","v":"  ft"}]
[null,"Length",null,null,null,"  ft"]
[null,"Width",null,null,null,"  ft"]
[null,"Side Water Depth",null,null,null,"  ft"]
[null,"Center Water Depth",null,null,null,"  ft"]
[null,"Media Depth",null,null,null,"  ft"]
[null,"Underdrain Depth",null,null,null,"  ft"]
[null,"Minimum Water Depth Over Media",null,null,null,"  ft"]
[null,"Average Porosity",null,null,null,"  %"]
[null,"Maximum Volume (each)",null,null,{"$f":"IF(OR(E426=\"Clearwell\",E426=\"Transfer Well\"),IF(H426=\"Circular\",PI()*(E432/2)^2*(2*E435+E436)/3*7.4815,IF(H426=\"Rectangular\",E433*E434*E435*7.4815,\"\")),\"\")","v":""},"  gal"]
[null,"Maximum Volume (each)",null,null,null,"  gal"]
[null,"Minimum Operating Level",null,null,null,"  ft"]
[null,"Worst Case Volume (each)",null,null,{"$f":"IF(OR(E426=\"Transfer Well\",E426=\"Clearwell\"),IF(H426=\"Circular\",PI()*(E432/2)^2*(2*E443+E436-(E435-E443))/3*7.4815,IF(H426=\"Rectangular\",E433*E434*E443*7.4815,\"\")),\"\")","v":""},"  gal"]
[null,{"$f":"IF(OR(E426=\"Clearwell\",E426=\"Transfer Well\"),\"Worst Case Volume (each)\", \"Volume (each)\")","v":"Volume (each)"},null,null,null,"  gal"]
[null,"Percent of Maximum Volume",null,null,{"$f":"IF(H426=\"Other\",IF(E442 = 0,\"\",E445/E442*100),IF(OR(E426=\"Clearwell\",E426=\"Transfer Well\"),IF(E441 = 0,\"\",E444/E441*100),\"\"))","v":""},"  %"]
[]
[null,{"$f":" IF(OR(E426=\"Clearwell\",E426=\"Transfer Well\"),\"Worst Case Volume (each)\",\"Volume (each)\")","v":"Volume (each)"},null,null,{"$f":"IF(E426=\"Filter\",IF(H426=\"Circular\",PI()*(E432/2)^2*(E437*E440/100+E439+E438),IF(H426=\"Rectangular\",E433*E434*(E437*E440/100+E439+E438),\"error\")),IF(AND(E426=\"Piping\",H426=\"Pipe\"),PI()*(E432/12/2)^2*E433,IF(H426=\"Circular\",IF(OR(E426=\"Transfer Well\",E426=\"Clearwell\"),E444/7.4815,PI()*(E432/2)^2*(2*E435+E436)/3),IF(H426=\"Rectangular\",IF(OR(E426=\"Transfer Well\",E426=\"Clearwell\"),E444/7.4815,E433*E434*E435),E445/7.4815))))*7.4815","v":0},"  gal"]
[null,"Flow Rate (each)",null,null,null,"  gpm"]
[null,"Detention Time",null,null,{"$f":"IF(OR(E449=\"\",E449=0),0,E448/E449)","v":0},"  min"]
[]
[null,"Baffling Factor",null,null,{"$f":"IF(I453=\"Unbaffled\",0.1,IF(I453=\"Poor\",0.3,IF(I453=\"Average\",0.5,IF(I453=\"Superior\",0.7,IF(I453=\"Perfect\",1,IF(I453=\"\",\" \",I454))))))","v":0.1}]
[null,null,null,null,null,null,null,"Baffling Characteristics:  ","Unbaffled"]
[null,null,null,null,null,null,null,"Approved Baffling Factor:  "]
[null,"T10",null,null,{"$f":"E450*E452","v":0},"  min"]
[]
[null,"Unit - 5",null,"Type:",null,null,"Shape:"]
[]
[null,null,"Further Description:"]
[]
[null,"Characteristic",null,null,null,null,"Comments"]
[null,"Number of Units"]
[null,"Diameter",null,null,null,{"$f":"IF(H457=\"pipe\",\"  in\",\"  ft\")","v":"  ft"}]
[null,"Length",null,null,null,"  ft"]
[null,"Width",null,null,null,"  ft"]
[null,"Side Water Depth",null,null,null,"  ft"]
[null,"Center Water Depth",null,null,null,"  ft"]
[null,"Media Depth",null,null,null,"  ft"]
[null,"Underdrain Depth",null,null,null,"  ft"]
[null,"Minimum Water Depth Over Media",null,null,null,"  ft"]
[null,"Average Porosity",null,null,null,"  %"]
[null,"Maximum Volume (each)",null,null,{"$f":"IF(OR(E457=\"Clearwell\",E457=\"Transfer Well\"),IF(H457=\"Circular\",PI()*(E463/2)^2*(2*E466+E467)/3*7.4815,IF(H457=\"Rectangular\",E464*E465*E466*7.4815,\"\")),\"\")","v":""},"  gal"]
[null,"Maximum Volume (each)",null,null,null,"  gal"]
[null,"Minimum Operating Level",null,null,null,"  ft"]
[null,"Worst Case Volume (each)",null,null,{"$f":"IF(OR(E457=\"Transfer Well\",E457=\"Clearwell\"),IF(H457=\"Circular\",PI()*(E463/2)^2*(2*E474+E467-(E466-E474))/3*7.4815,IF(H457=\"Rectangular\",E464*E465*E474*7.4815,\"\")),\"\")","v":""},"  gal"]
[null,{"$f":"IF(OR(E457=\"Clearwell\",E457=\"Transfer Well\"),\"Worst Case Volume (each)\", \"Volume (each)\")","v":"Volume (each)"},null,null,null,"  gal"]
[null,"Percent of Maximum Volume",null,null,{"$f":"IF(H457=\"Other\",IF(E473 = 0,\"\",E476/E473*100),IF(OR(E457=\"Clearwell\",E457=\"Transfer Well\"),IF(E472 = 0,\"\",E475/E472*100),\"\"))","v":""},"  %"]
[]
[null,{"$f":" IF(OR(E457=\"Clearwell\",E457=\"Transfer Well\"),\"Worst Case Volume (each)\",\"Volume (each)\")","v":"Volume (each)"},null,null,{"$f":"IF(E457=\"Filter\",IF(H457=\"Circular\",PI()*(E463/2)^2*(E468*E471/100+E470+E469),IF(H457=\"Rectangular\",E464*E465*(E468*E471/100+E470+E469),\"error\")),IF(AND(E457=\"Piping\",H457=\"Pipe\"),PI()*(E463/12/2)^2*E464,IF(H457=\"Circular\",IF(OR(E457=\"Transfer Well\",E457=\"Clearwell\"),E475/7.4815,PI()*(E463/2)^2*(2*E466+E467)/3),IF(H457=\"Rectangular\",IF(OR(E457=\"Transfer Well\",E457=\"Clearwell\"),E475/7.4815,E464*E465*E466),E476/7.4815))))*7.4815","v":0},"  gal"]
[null,"Flow Rate (each)",null,null,null,"  gpm"]
[null,"Detention Time",null,null,{"$f":"IF(OR(E480=\"\",E480=0),0,E479/E480)","v":0},"  min"]
[]
[null,"Baffling Factor",null,null,{"$f":"IF(I484=\"Unbaffled\",0.1,IF(I484=\"Poor\",0.3,IF(I484=\"Average\",0.5,IF(I484=\"Superior\",0.7,IF(I484=\"Perfect\",1,IF(I484=\"\",\" \",I485))))))","v":0.1}]
[null,null,null,null,null,null,null,"Baffling Characteristics:  ","Unbaffled"]
[null,null,null,null,null,null,null,"Approved Baffling Factor:  "]
[null,"T10",null,null,{"$f":"E481*E483","v":0},"  min"]
[]
[null,"Unit - 6",null,"Type:",null,null,"Shape:"]
[]
[null,null,"Further Description:"]
[]
[null,"Characteristic",null,null,null,null,"Comments"]
[null,"Number of Units"]
[null,"Diameter",null,null,null,{"$f":"IF(H488=\"pipe\",\"  in\",\"  ft\")","v":"  ft"}]
[null,"Length",null,null,null,"  ft"]
[null,"Width",null,null,null,"  ft"]
[null,"Side Water Depth",null,null,null,"  ft"]
[null,"Center Water Depth",null,null,null,"  ft"]
[null,"Media Depth",null,null,null,"  ft"]
[null,"Underdrain Depth",null,null,null,"  ft"]
[null,"Minimum Water Depth Over Media",null,null,null,"  ft"]
[null,"Average Porosity",null,null,null,"  %"]
[null,"Maximum Volume (each)",null,null,{"$f":"IF(OR(E488=\"Clearwell\",E488=\"Transfer Well\"),IF(H488=\"Circular\",PI()*(E494/2)^2*(2*E497+E498)/3*7.4815,IF(H488=\"Rectangular\",E495*E496*E497*7.4815,\"\")),\"\")","v":""},"  gal"]
[null,"Maximum Volume (each)",null,null,null,"  gal"]
[null,"Minimum Operating Level",null,null,null,"  ft"]
[null,"Worst Case Volume (each)",null,null,{"$f":"IF(OR(E488=\"Transfer Well\",E488=\"Clearwell\"),IF(H488=\"Circular\",PI()*(E494/2)^2*(2*E505+E498-(E497-E505))/3*7.4815,IF(H488=\"Rectangular\",E495*E496*E505*7.4815,\"\")),\"\")","v":""},"  gal"]
[null,{"$f":"IF(OR(E488=\"Clearwell\",E488=\"Transfer Well\"),\"Worst Case Volume (each)\", \"Volume (each)\")","v":"Volume (each)"},null,null,null,"  gal"]
[null,"Percent of Maximum Volume",null,null,{"$f":"IF(H488=\"Other\",IF(E504 = 0,\"\",E507/E504*100),IF(OR(E488=\"Clearwell\",E488=\"Transfer Well\"),IF(E503 = 0,\"\",E506/E503*100),\"\"))","v":""},"  %"]
[]
[null,{"$f":" IF(OR(E488=\"Clearwell\",E488=\"Transfer Well\"),\"Worst Case Volume (each)\",\"Volume (each)\")","v":"Volume (each)"},null,null,{"$f":"IF(E488=\"Filter\",IF(H488=\"Circular\",PI()*(E494/2)^2*(E499*E502/100+E501+E500),IF(H488=\"Rectangular\",E495*E496*(E499*E502/100+E501+E500),\"error\")),IF(AND(E488=\"Piping\",H488=\"Pipe\"),PI()*(E494/12/2)^2*E495,IF(H488=\"Circular\",IF(OR(E488=\"Transfer Well\",E488=\"Clearwell\"),E506/7.4815,PI()*(E494/2)^2*(2*E497+E498)/3),IF(H488=\"Rectangular\",IF(OR(E488=\"Transfer Well\",E488=\"Clearwell\"),E506/7.4815,E495*E496*E497),E507/7.4815))))*7.4815","v":0},"  gal"]
[null,"Flow Rate (each)",null,null,null,"  gpm"]
[null,"Detention Time",null,null,{"$f":"IF(OR(E511=\"\",E511=0),0,E510/E511)","v":0},"  min"]
[]
[null,"Baffling Factor",null,null,{"$f":"IF(I515=\"Unbaffled\",0.1,IF(I515=\"Poor\",0.3,IF(I515=\"Average\",0.5,IF(I515=\"Superior\",0.7,IF(I515=\"Perfect\",1,IF(I515=\"\",\" \",I516))))))","v":0.1}]
[null,null,null,null,null,null,null,"Baffling Characteristics:  ","Unbaffled"]
[null,null,null,null,null,null,null,"Approved Baffling Factor:  "]
[null,"T10",null,null,{"$f":"E512*E514","v":0},"  min"]
[]
[null,"Unit - 7",null,"Type:",null,null,"Shape:"]
[]
[null,null,"Further Description:"]
[]
[null,"Characteristic",null,null,null,null,"Comments"]
[null,"Number of Units"]
[null,"Diameter",null,null,null,{"$f":"IF(H519=\"pipe\",\"  in\",\"  ft\")","v":"  ft"}]
[null,"Length",null,null,null,"  ft"]
[null,"Width",null,null,null,"  ft"]
[null,"Side Water Depth",null,null,null,"  ft"]
[null,"Center Water Depth",null,null,null,"  ft"]
[null,"Media Depth",null,null,null,"  ft"]
[null,"Underdrain Depth",null,null,null,"  ft"]
[null,"Minimum Water Depth Over Media",null,null,null,"  ft"]
[null,"Average Porosity",null,null,null,"  %"]
[null,"Maximum Volume (each)",null,null,{"$f":"IF(OR(E519=\"Clearwell\",E519=\"Transfer Well\"),IF(H519=\"Circular\",PI()*(E525/2)^2*(2*E528+E529)/3*7.4815,IF(H519=\"Rectangular\",E526*E527*E528*7.4815,\"\")),\"\")","v":""},"  gal"]
[null,"Maximum Volume (each)",null,null,null,"  gal"]
[null,"Minimum Operating Level",null,null,null,"  ft"]
[null,"Worst Case Volume (each)",null,null,{"$f":"IF(OR(E519=\"Transfer Well\",E519=\"Clearwell\"),IF(H519=\"Circular\",PI()*(E525/2)^2*(2*E536+E529-(E528-E536))/3*7.4815,IF(H519=\"Rectangular\",E526*E527*E536*7.4815,\"\")),\"\")","v":""},"  gal"]
[null,{"$f":"IF(OR(E519=\"Clearwell\",E519=\"Transfer Well\"),\"Worst Case Volume (each)\", \"Volume (each)\")","v":"Volume (each)"},null,null,null,"  gal"]
[null,"Percent of Maximum Volume",null,null,{"$f":"IF(H519=\"Other\",IF(E535 = 0,\"\",E538/E535*100),IF(OR(E519=\"Clearwell\",E519=\"Transfer Well\"),IF(E534 = 0,\"\",E537/E534*100),\"\"))","v":""},"  %"]
[]
[null,{"$f":" IF(OR(E519=\"Clearwell\",E519=\"Transfer Well\"),\"Worst Case Volume (each)\",\"Volume (each)\")","v":"Volume (each)"},null,null,{"$f":"IF(E519=\"Filter\",IF(H519=\"Circular\",PI()*(E525/2)^2*(E530*E533/100+E532+E531),IF(H519=\"Rectangular\",E526*E527*(E530*E533/100+E532+E531),\"error\")),IF(AND(E519=\"Piping\",H519=\"Pipe\"),PI()*(E525/12/2)^2*E526,IF(H519=\"Circular\",IF(OR(E519=\"Transfer Well\",E519=\"Clearwell\"),E537/7.4815,PI()*(E525/2)^2*(2*E528+E529)/3),IF(H519=\"Rectangular\",IF(OR(E519=\"Transfer Well\",E519=\"Clearwell\"),E537/7.4815,E526*E527*E528),E538/7.4815))))*7.4815","v":0},"  gal"]
[null,"Flow Rate (each)",null,null,null,"  gpm"]
[null,"Detention Time",null,null,{"$f":"IF(OR(E542=\"\",E542=0),0,E541/E542)","v":0},"  min"]
[]
[null,"Baffling Factor",null,null,{"$f":"IF(I546=\"Unbaffled\",0.1,IF(I546=\"Poor\",0.3,IF(I546=\"Average\",0.5,IF(I546=\"Superior\",0.7,IF(I546=\"Perfect\",1,IF(I546=\"\",\" \",I547))))))","v":0.1}]
[null,null,null,null,null,null,null,"Baffling Characteristics:  ","Unbaffled"]
[null,null,null,null,null,null,null,"Approved Baffling Factor:  "]
[null,"T10",null,null,{"$f":"E543*E545","v":0},"  min"]
[]
[null,"Unit - 8",null,"Type:",null,null,"Shape:"]
[]
[null,null,"Further Description:"]
[]
[null,"Characteristic",null,null,null,null,"Comments"]
[null,"Number of Units"]
[null,"Diameter",null,null,null,{"$f":"IF(H550=\"pipe\",\"  in\",\"  ft\")","v":"  ft"}]
[null,"Length",null,null,null,"  ft"]
[null,"Width",null,null,null,"  ft"]
[null,"Side Water Depth",null,null,null,"  ft"]
[null,"Center Water Depth",null,null,null,"  ft"]
[null,"Media Depth",null,null,null,"  ft"]
[null,"Underdrain Depth",null,null,null,"  ft"]
[null,"Minimum Water Depth Over Media",null,null,null,"  ft"]
[null,"Average Porosity",null,null,null,"  %"]
[null,"Maximum Volume (each)",null,null,{"$f":"IF(OR(E550=\"Clearwell\",E550=\"Transfer Well\"),IF(H550=\"Circular\",PI()*(E556/2)^2*(2*E559+E560)/3*7.4815,IF(H550=\"Rectangular\",E557*E558*E559*7.4815,\"\")),\"\")","v":""},"  gal"]
[null,"Maximum Volume (each)",null,null,null,"  gal"]
[null,"Minimum Operating Level",null,null,null,"  ft"]
[null,"Worst Case Volume (each)",null,null,{"$f":"IF(OR(E550=\"Transfer Well\",E550=\"Clearwell\"),IF(H550=\"Circular\",PI()*(E556/2)^2*(2*E567+E560-(E559-E567))/3*7.4815,IF(H550=\"Rectangular\",E557*E558*E567*7.4815,\"\")),\"\")","v":""},"  gal"]
[null,{"$f":"IF(OR(E550=\"Clearwell\",E550=\"Transfer Well\"),\"Worst Case Volume (each)\", \"Volume (each)\")","v":"Volume (each)"},null,null,null,"  gal"]
[null,"Percent of Maximum Volume",null,null,{"$f":"IF(H550=\"Other\",IF(E566 = 0,\"\",E569/E566*100),IF(OR(E550=\"Clearwell\",E550=\"Transfer Well\"),IF(E565 = 0,\"\",E568/E565*100),\"\"))","v":""},"  %"]
[]
[null,{"$f":" IF(OR(E550=\"Clearwell\",E550=\"Transfer Well\"),\"Worst Case Volume (each)\",\"Volume (each)\")","v":"Volume (each)"},null,null,{"$f":"IF(E550=\"Filter\",IF(H550=\"Circular\",PI()*(E556/2)^2*(E561*E564/100+E563+E562),IF(H550=\"Rectangular\",E557*E558*(E561*E564/100+E563+E562),\"error\")),IF(AND(E550=\"Piping\",H550=\"Pipe\"),PI()*(E556/12/2)^2*E557,IF(H550=\"Circular\",IF(OR(E550=\"Transfer Well\",E550=\"Clearwell\"),E568/7.4815,PI()*(E556/2)^2*(2*E559+E560)/3),IF(H550=\"Rectangular\",IF(OR(E550=\"Transfer Well\",E550=\"Clearwell\"),E568/7.4815,E557*E558*E559),E569/7.4815))))*7.4815","v":0},"  gal"]
[null,"Flow Rate (each)",null,null,null,"  gpm"]
[null,"Detention Time",null,null,{"$f":"IF(OR(E573=\"\",E573=0),0,E572/E573)","v":0},"  min"]
[]
[null,"Baffling Factor",null,null,{"$f":"IF(I577=\"Unbaffled\",0.1,IF(I577=\"Poor\",0.3,IF(I577=\"Average\",0.5,IF(I577=\"Superior\",0.7,IF(I577=\"Perfect\",1,IF(I577=\"\",\" \",I578))))))","v":0.1}]
[null,null,null,null,null,null,null,"Baffling Characteristics:  ","Unbaffled"]
[null,null,null,null,null,null,null,"Approved Baffling Factor:  "]
[null,"T10",null,null,{"$f":"E574*E576","v":0},"  min"]
[]
[null,"Unit - 9",null,"Type:",null,null,"Shape:"]
[]
[null,null,"Further Description:"]
[]
[null,"Characteristic",null,null,null,null,"Comments"]
[null,"Number of Units"]
[null,"Diameter",null,null,null,{"$f":"IF(H581=\"pipe\",\"  in\",\"  ft\")","v":"  ft"}]
[null,"Length",null,null,null,"  ft"]
[null,"Width",null,null,null,"  ft"]
[null,"Side Water Depth",null,null,null,"  ft"]
[null,"Center Water Depth",null,null,null,"  ft"]
[null,"Media Depth",null,null,null,"  ft"]
[null,"Underdrain Depth",null,null,null,"  ft"]
[null,"Minimum Water Depth Over Media",null,null,null,"  ft"]
[null,"Average Porosity",null,null,null,"  %"]
[null,"Maximum Volume (each)",null,null,{"$f":"IF(OR(E581=\"Clearwell\",E581=\"Transfer Well\"),IF(H581=\"Circular\",PI()*(E587/2)^2*(2*E590+E591)/3*7.4815,IF(H581=\"Rectangular\",E588*E589*E590*7.4815,\"\")),\"\")","v":""},"  gal"]
[null,"Maximum Volume (each)",null,null,null,"  gal"]
[null,"Minimum Operating Level",null,null,null,"  ft"]
[null,"Worst Case Volume (each)",null,null,{"$f":"IF(OR(E581=\"Transfer Well\",E581=\"Clearwell\"),IF(H581=\"Circular\",PI()*(E587/2)^2*(2*E598+E591-(E590-E598))/3*7.4815,IF(H581=\"Rectangular\",E588*E589*E598*7.4815,\"\")),\"\")","v":""},"  gal"]
[null,{"$f":"IF(OR(E581=\"Clearwell\",E581=\"Transfer Well\"),\"Worst Case Volume (each)\", \"Volume (each)\")","v":"Volume (each)"},null,null,null,"  gal"]
[null,"Percent of Maximum Volume",null,null,{"$f":"IF(H581=\"Other\",IF(E597 = 0,\"\",E600/E597*100),IF(OR(E581=\"Clearwell\",E581=\"Transfer Well\"),IF(E596 = 0,\"\",E599/E596*100),\"\"))","v":""},"  %"]
[]
[null,{"$f":" IF(OR(E581=\"Clearwell\",E581=\"Transfer Well\"),\"Worst Case Volume (each)\",\"Volume (each)\")","v":"Volume (each)"},null,null,{"$f":"IF(E581=\"Filter\",IF(H581=\"Circular\",PI()*(E587/2)^2*(E592*E595/100+E594+E593),IF(H581=\"Rectangular\",E588*E589*(E592*E595/100+E594+E593),\"error\")),IF(AND(E581=\"Piping\",H581=\"Pipe\"),PI()*(E587/12/2)^2*E588,IF(H581=\"Circular\",IF(OR(E581=\"Transfer Well\",E581=\"Clearwell\"),E599/7.4815,PI()*(E587/2)^2*(2*E590+E591)/3),IF(H581=\"Rectangular\",IF(OR(E581=\"Transfer Well\",E581=\"Clearwell\"),E599/7.4815,E588*E589*E590),E600/7.4815))))*7.4815","v":0},"  gal"]
[null,"Flow Rate (each)",null,null,null,"  gpm"]
[null,"Detention Time",null,null,{"$f":"IF(OR(E604=\"\",E604=0),0,E603/E604)","v":0},"  min"]
[]
[null,"Baffling Factor",null,null,{"$f":"IF(I608=\"Unbaffled\",0.1,IF(I608=\"Poor\",0.3,IF(I608=\"Average\",0.5,IF(I608=\"Superior\",0.7,IF(I608=\"Perfect\",1,IF(I608=\"\",\" \",I609))))))","v":0.1}]
[null,null,null,null,null,null,null,"Baffling Characteristics:  ","Unbaffled"]
[null,null,null,null,null,null,null,"Approved Baffling Factor:  "]
[null,"T10",null,null,{"$f":"E605*E607","v":0},"  min"]
[]
[null,"Unit - 10",null,"Type:",null,null,"Shape:"]
[]
[null,null,"Further Description:"]
[]
[null,"Characteristic",null,null,null,null,"Comments"]
[null,"Number of Units"]
[null,"Diameter",null,null,null,{"$f":"IF(H612=\"pipe\",\"  in\",\"  ft\")","v":"  ft"}]
[null,"Length",null,null,null,"  ft"]
[null,"Width",null,null,null,"  ft"]
[null,"Side Water Depth",null,null,null,"  ft"]
[null,"Center Water Depth",null,null,null,"  ft"]
[null,"Media Depth",null,null,null,"  ft"]
[null,"Underdrain Depth",null,null,null,"  ft"]
[null,"Minimum Water Depth Over Media",null,null,null,"  ft"]
[null,"Average Porosity",null,null,null,"  %"]
[null,"Maximum Volume (each)",null,null,{"$f":"IF(OR(E612=\"Clearwell\",E612=\"Transfer Well\"),IF(H612=\"Circular\",PI()*(E618/2)^2*(2*E621+E622)/3*7.4815,IF(H612=\"Rectangular\",E619*E620*E621*7.4815,\"\")),\"\")","v":""},"  gal"]
[null,"Maximum Volume (each)",null,null,null,"  gal"]
[null,"Minimum Operating Level",null,null,null,"  ft"]
[null,"Worst Case Volume (each)",null,null,{"$f":"IF(OR(E612=\"Transfer Well\",E612=\"Clearwell\"),IF(H612=\"Circular\",PI()*(E618/2)^2*(2*E629+E622-(E621-E629))/3*7.4815,IF(H612=\"Rectangular\",E619*E620*E629*7.4815,\"\")),\"\")","v":""},"  gal"]
[null,{"$f":"IF(OR(E612=\"Clearwell\",E612=\"Transfer Well\"),\"Worst Case Volume (each)\", \"Volume (each)\")","v":"Volume (each)"},null,null,null,"  gal"]
[null,"Percent of Maximum Volume",null,null,{"$f":"IF(H612=\"Other\",IF(E628 = 0,\"\",E631/E628*100),IF(OR(E612=\"Clearwell\",E612=\"Transfer Well\"),IF(E627 =0,\"\",E630/E627*100),\"\"))","v":""},"  %"]
[]
[null,{"$f":" IF(OR(E612=\"Clearwell\",E612=\"Transfer Well\"),\"Worst Case Volume (each)\",\"Volume (each)\")","v":"Volume (each)"},null,null,{"$f":"IF(E612=\"Filter\",IF(H612=\"Circular\",PI()*(E618/2)^2*(E623*E626/100+E625+E624),IF(H612=\"Rectangular\",E619*E620*(E623*E626/100+E625+E624),\"error\")),IF(AND(E612=\"Piping\",H612=\"Pipe\"),PI()*(E618/12/2)^2*E619,IF(H612=\"Circular\",IF(OR(E612=\"Transfer Well\",E612=\"Clearwell\"),E630/7.4815,PI()*(E618/2)^2*(2*E621+E622)/3),IF(H612=\"Rectangular\",IF(OR(E612=\"Transfer Well\",E612=\"Clearwell\"),E630/7.4815,E619*E620*E621),E631/7.4815))))*7.4815","v":0},"  gal"]
[null,"Flow Rate (each)",null,null,null,"  gpm"]
[null,"Detention Time",null,null,{"$f":"IF(OR(E635=\"\",E635=0),0,E634/E635)","v":0},"  min"]
[]
[null,"Baffling Factor",null,null,{"$f":"IF(I639=\"Unbaffled\",0.1,IF(I639=\"Poor\",0.3,IF(I639=\"Average\",0.5,IF(I639=\"Superior\",0.7,IF(I639=\"Perfect\",1,IF(I639=\"\",\" \",I640))))))","v":0.1}]
[null,null,null,null,null,null,null,"Baffling Characteristics:  ","Unbaffled"]
[null,null,null,null,null,null,null,"Approved Baffling Factor:  "]
[null,"T10",null,null,{"$f":"E636*E638","v":0},"  min"]
[]
[null,{"$f":"CONCATENATE(D331,\" FLOW RATE\")","v":"D2 FLOW RATE"},null,null,{"$f":"MaxUnitFlow(E362,E393,E424,E455,E486,E517,E548,E579,E610,E641,E356,E387,E418,E449,E480,E511,E542,E573,E604,E635)*60*24/10^6","v":0},"  mgd"]
[]
[null,{"$f":"CONCATENATE(\"T10 SUM FOR \",D331)","v":"T10 SUM FOR D2"},null,null,{"$f":"SUM(E362,E393,E424,E455,E486,E517,E548,E579,E610,E641)","v":0},"  min"]
[]
["Disinfection Zone:",null,null,{"$f":"CONCATENATE(\"D\",Calculator!$BF$6)","v":"D3"},null,"Disinfectant:"]
[]
[null,"Unit - 1",null,"Type:",null,null,"Shape:"]
[]
[null,null,"Further Description:"]
[]
[null,"Characteristic",null,null,null,null,"Comments"]
[null,"Number of Units"]
[null,"Diameter",null,null,null,{"$f":"IF(H649=\"pipe\",\"  in\",\"  ft\")","v":"  ft"}]
[null,"Length",null,null,null,"  ft"]
[null,"Width",null,null,null,"  ft"]
[null,"Side Water Depth",null,null,null,"  ft"]
[null,"Center Water Depth",null,null,null,"  ft"]
[null,"Media Depth",null,null,null,"  ft"]
[null,"Underdrain Depth",null,null,null,"  ft"]
[null,"Minimum Water Depth Over Media",null,null,null,"  ft"]
[null,"Average Porosity",null,null,null,"  %"]
[null,"Maximum Volume (each)",null,null,{"$f":"IF(OR(E649=\"Clearwell\",E649=\"Transfer Well\"),IF(H649=\"Circular\",PI()*(E655/2)^2*(2*E658+E659)/3*7.4815,IF(H649=\"Rectangular\",E656*E657*E658*7.4815,\"\")),\"\")","v":""},"  gal"]
[null,"Maximum Volume (each)",null,null,null,"  gal"]
[null,"Minimum Operating Level",null,null,null,"  ft"]
[null,"Worst Case Volume (each)",null,null,{"$f":"IF(OR(E649=\"Transfer Well\",E649=\"Clearwell\"),IF(H649=\"Circular\",PI()*(E655/2)^2*(2*E666+E659-(E658-E666))/3*7.4815,IF(H649=\"Rectangular\",E656*E657*E666*7.4815,\"\")),\"\")","v":""},"  gal"]
[null,{"$f":"IF(OR(E649=\"Clearwell\",E649=\"Transfer Well\"),\"Worst Case Volume (each)\", \"Volume (each)\")","v":"Volume (each)"},null,null,null,"  gal"]
[null,"Percent of Maximum Volume",null,null,{"$f":"IF(H649=\"Other\",IF(E665 = 0,\"\",E668/E665*100),IF(OR(E649=\"Clearwell\",E649=\"Transfer Well\"),IF(E664 = 0,\"\",E667/E664*100),\"\"))","v":""},"  %"]
[]
[null,{"$f":" IF(OR(E649=\"Clearwell\",E649=\"Transfer Well\"),\"Worst Case Volume (each)\",\"Volume (each)\")","v":"Volume (each)"},null,null,{"$f":"IF(E649=\"Filter\",IF(H649=\"Circular\",PI()*(E655/2)^2*(E660*E663/100+E662+E661),IF(H649=\"Rectangular\",E656*E657*(E660*E663/100+E662+E661),\"error\")),IF(AND(E649=\"Piping\",H649=\"Pipe\"),PI()*(E655/12/2)^2*E656,IF(H649=\"Circular\",IF(OR(E649=\"Transfer Well\",E649=\"Clearwell\"),E667/7.4815,PI()*(E655/2)^2*(2*E658+E659)/3),IF(H649=\"Rectangular\",IF(OR(E649=\"Transfer Well\",E649=\"Clearwell\"),E667/7.4815,E656*E657*E658),E668/7.4815))))*7.4815","v":0},"  gal"]
[null,"Flow Rate (each)",null,null,null,"  gpm"]
[null,"Detention Time",null,null,{"$f":"IF(OR(E672=\"\",E672=0),0,E671/E672)","v":0},"  min"]
[]
[null,"Baffling Factor",null,null,{"$f":"IF(I676=\"Unbaffled\",0.1,IF(I676=\"Poor\",0.3,IF(I676=\"Average\",0.5,IF(I676=\"Superior\",0.7,IF(I676=\"Perfect\",1,IF(I676=\"\",\" \",I677))))))","v":0.1}]
[null,null,null,null,null,null,null,"Baffling Characteristics:  ","Unbaffled"]
[null,null,null,null,null,null,null,"Approved Baffling Factor:  "]
[null,"T10",null,null,{"$f":"E673*E675","v":0},"  min"]
[]
[null,"Unit - 2",null,"Type:",null,null,"Shape:"]
[]
[null,null,"Further Description:"]
[]
[null,"Characteristic",null,null,null,null,"Comments"]
[null,"Number of Units"]
[null,"Diameter",null,null,null,{"$f":"IF(H680=\"pipe\",\"  in\",\"  ft\")","v":"  ft"}]
[null,"Length",null,null,null,"  ft"]
[null,"Width",null,null,null,"  ft"]
[null,"Side Water Depth",null,null,null,"  ft"]
[null,"Center Water Depth",null,null,null,"  ft"]
[null,"Media Depth",null,null,null,"  ft"]
[null,"Underdrain Depth",null,null,null,"  ft"]
[null,"Minimum Water Depth Over Media",null,null,null,"  ft"]
[null,"Average Porosity",null,null,null,"  %"]
[null,"Maximum Volume (each)",null,null,{"$f":"IF(OR(E680=\"Clearwell\",E680=\"Transfer Well\"),IF(H680=\"Circular\",PI()*(E686/2)^2*(2*E689+E690)/3*7.4815,IF(H680=\"Rectangular\",E687*E688*E689*7.4815,\"\")),\"\")","v":""},"  gal"]
[null,"Maximum Volume (each)",null,null,null,"  gal"]
[null,"Minimum Operating Level",null,null,null,"  ft"]
[null,"Worst Case Volume (each)",null,null,{"$f":"IF(OR(E680=\"Transfer Well\",E680=\"Clearwell\"),IF(H680=\"Circular\",PI()*(E686/2)^2*(2*E697+E690-(E689-E697))/3*7.4815,IF(H680=\"Rectangular\",E687*E688*E697*7.4815,\"\")),\"\")","v":""},"  gal"]
[null,{"$f":"IF(OR(E680=\"Clearwell\",E680=\"Transfer Well\"),\"Worst Case Volume (each)\", \"Volume (each)\")","v":"Volume (each)"},null,null,null,"  gal"]
[null,"Percent of Maximum Volume",null,null,{"$f":"IF(H680=\"Other\",IF(E696 = 0,\"\",E699/E696*100),IF(OR(E680=\"Clearwell\",E680=\"Transfer Well\"),IF(E695 =0,\"\",E698/E695*100),\"\"))","v":""},"  %"]
[]
[null,{"$f":" IF(OR(E680=\"Clearwell\",E680=\"Transfer Well\"),\"Worst Case Volume (each)\",\"Volume (each)\")","v":"Volume (each)"},null,null,{"$f":"IF(E680=\"Filter\",IF(H680=\"Circular\",PI()*(E686/2)^2*(E691*E694/100+E693+E692),IF(H680=\"Rectangular\",E687*E688*(E691*E694/100+E693+E692),\"error\")),IF(AND(E680=\"Piping\",H680=\"Pipe\"),PI()*(E686/12/2)^2*E687,IF(H680=\"Circular\",IF(OR(E680=\"Transfer Well\",E680=\"Clearwell\"),E698/7.4815,PI()*(E686/2)^2*(2*E689+E690)/3),IF(H680=\"Rectangular\",IF(OR(E680=\"Transfer Well\",E680=\"Clearwell\"),E698/7.4815,E687*E688*E689),E699/7.4815))))*7.4815","v":0},"  gal"]
[null,"Flow Rate (each)",null,null,null,"  gpm"]
[null,"Detention Time",null,null,{"$f":"IF(OR(E703=\"\",E703=0),0,E702/E703)","v":0},"  min"]
[]
[null,"Baffling Factor",null,null,{"$f":"IF(I707=\"Unbaffled\",0.1,IF(I707=\"Poor\",0.3,IF(I707=\"Average\",0.5,IF(I707=\"Superior\",0.7,IF(I707=\"Perfect\",1,IF(I707=\"\",\" \",I708))))))","v":0.1}]
[null,null,null,null,null,null,null,"Baffling Characteristics:  ","Unbaffled"]
[null,null,null,null,null,null,null,"Approved Baffling Factor:  "]
[null,"T10",null,null,{"$f":"E704*E706","v":0},"  min"]
[]
[null,"Unit - 3",null,"Type:",null,null,"Shape:"]
[]
[null,null,"Further Description:"]
[]
[null,"Characteristic",null,null,null,null,"Comments"]
[null,"Number of Units"]
[null,"Diameter",null,null,null,{"$f":"IF(H711=\"pipe\",\"  in\",\"  ft\")","v":"  ft"}]
[null,"Length",null,null,null,"  ft"]
[null,"Width",null,null,null,"  ft"]
[null,"Side Water Depth",null,null,null,"  ft"]
[null,"Center Water Depth",null,null,null,"  ft"]
[null,"Media Depth",null,null,null,"  ft"]
[null,"Underdrain Depth",null,null,null,"  ft"]
[null,"Minimum Water Depth Over Media",null,null,null,"  ft"]
[null,"Average Porosity",null,null,null,"  %"]
[null,"Maximum Volume (each)",null,null,{"$f":"IF(OR(E711=\"Clearwell\",E711=\"Transfer Well\"),IF(H711=\"Circular\",PI()*(E717/2)^2*(2*E720+E721)/3*7.4815,IF(H711=\"Rectangular\",E718*E719*E720*7.4815,\"\")),\"\")","v":""},"  gal"]
[null,"Maximum Volume (each)",null,null,null,"  gal"]
[null,"Minimum Operating Level",null,null,null,"  ft"]
[null,"Worst Case Volume (each)",null,null,{"$f":"IF(OR(E711=\"Transfer Well\",E711=\"Clearwell\"),IF(H711=\"Circular\",PI()*(E717/2)^2*(2*E728+E721-(E720-E728))/3*7.4815,IF(H711=\"Rectangular\",E718*E719*E728*7.4815,\"\")),\"\")","v":""},"  gal"]
[null,{"$f":"IF(OR(E711=\"Clearwell\",E711=\"Transfer Well\"),\"Worst Case Volume (each)\", \"Volume (each)\")","v":"Volume (each)"},null,null,null,"  gal"]
[null,"Percent of Maximum Volume",null,null,{"$f":"IF(H711=\"Other\",IF(E727 = 0,\"\",E730/E727*100),IF(OR(E711=\"Clearwell\",E711=\"Transfer Well\"),IF(E726 = 0,\"\",E729/E726*100),\"\"))","v":""},"  %"]
[]
[null,{"$f":" IF(OR(E711=\"Clearwell\",E711=\"Transfer Well\"),\"Worst Case Volume (each)\",\"Volume (each)\")","v":"Volume (each)"},null,null,{"$f":"IF(E711=\"Filter\",IF(H711=\"Circular\",PI()*(E717/2)^2*(E722*E725/100+E724+E723),IF(H711=\"Rectangular\",E718*E719*(E722*E725/100+E724+E723),\"error\")),IF(AND(E711=\"Piping\",H711=\"Pipe\"),PI()*(E717/12/2)^2*E718,IF(H711=\"Circular\",IF(OR(E711=\"Transfer Well\",E711=\"Clearwell\"),E729/7.4815,PI()*(E717/2)^2*(2*E720+E721)/3),IF(H711=\"Rectangular\",IF(OR(E711=\"Transfer Well\",E711=\"Clearwell\"),E729/7.4815,E718*E719*E720),E730/7.4815))))*7.4815","v":0},"  gal"]
[null,"Flow Rate (each)",null,null,null,"  gpm"]
[null,"Detention Time",null,null,{"$f":"IF(OR(E734=\"\",E734=0),0,E733/E734)","v":0},"  min"]
[]
[null,"Baffling Factor",null,null,{"$f":"IF(I738=\"Unbaffled\",0.1,IF(I738=\"Poor\",0.3,IF(I738=\"Average\",0.5,IF(I738=\"Superior\",0.7,IF(I738=\"Perfect\",1,IF(I738=\"\",\" \",I739))))))","v":0.1}]
[null,null,null,null,null,null,null,"Baffling Characteristics:  ","Unbaffled"]
[null,null,null,null,null,null,null,"Approved Baffling Factor:  "]
[null,"T10",null,null,{"$f":"E735*E737","v":0},"  min"]
[]
[null,"Unit - 4",null,"Type:",null,null,"Shape:"]
[]
[null,null,"Further Description:"]
[]
[null,"Characteristic",null,null,null,null,"Comments"]
[null,"Number of Units"]
[null,"Diameter",null,null,null,{"$f":"IF(H742=\"pipe\",\"  in\",\"  ft\")","v":"  ft"}]
[null,"Length",null,null,null,"  ft"]
[null,"Width",null,null,null,"  ft"]
[null,"Side Water Depth",null,null,null,"  ft"]
[null,"Center Water Depth",null,null,null,"  ft"]
[null,"Media Depth",null,null,null,"  ft"]
[null,"Underdrain Depth",null,null,null,"  ft"]
[null,"Minimum Water Depth Over Media",null,null,null,"  ft"]
[null,"Average Porosity",null,null,null,"  %"]
[null,"Maximum Volume (each)",null,null,{"$f":"IF(OR(E742=\"Clearwell\",E742=\"Transfer Well\"),IF(H742=\"Circular\",PI()*(E748/2)^2*(2*E751+E752)/3*7.4815,IF(H742=\"Rectangular\",E749*E750*E751*7.4815,\"\")),\"\")","v":""},"  gal"]
[null,"Maximum Volume (each)",null,null,null,"  gal"]
[null,"Minimum Operating Level",null,null,null,"  ft"]
[null,"Worst Case Volume (each)",null,null,{"$f":"IF(OR(E742=\"Transfer Well\",E742=\"Clearwell\"),IF(H742=\"Circular\",PI()*(E748/2)^2*(2*E759+E752-(E751-E759))/3*7.4815,IF(H742=\"Rectangular\",E749*E750*E759*7.4815,\"\")),\"\")","v":""},"  gal"]
[null,{"$f":"IF(OR(E742=\"Clearwell\",E742=\"Transfer Well\"),\"Worst Case Volume (each)\", \"Volume (each)\")","v":"Volume (each)"},null,null,null,"  gal"]
[null,"Percent of Maximum Volume",null,null,{"$f":"IF(H742=\"Other\",IF(E758 = 0,\"\",E761/E758*100),IF(OR(E742=\"Clearwell\",E742=\"Transfer Well\"),IF(E757 = 0,\"\",E760/E757*100),\"\"))","v":""},"  %"]
[]
[null,{"$f":" IF(OR(E742=\"Clearwell\",E742=\"Transfer Well\"),\"Worst Case Volume (each)\",\"Volume (each)\")","v":"Volume (each)"},null,null,{"$f":"IF(E742=\"Filter\",IF(H742=\"Circular\",PI()*(E748/2)^2*(E753*E756/100+E755+E754),IF(H742=\"Rectangular\",E749*E750*(E753*E756/100+E755+E754),\"error\")),IF(AND(E742=\"Piping\",H742=\"Pipe\"),PI()*(E748/12/2)^2*E749,IF(H742=\"Circular\",IF(OR(E742=\"Transfer Well\",E742=\"Clearwell\"),E760/7.4815,PI()*(E748/2)^2*(2*E751+E752)/3),IF(H742=\"Rectangular\",IF(OR(E742=\"Transfer Well\",E742=\"Clearwell\"),E760/7.4815,E749*E750*E751),E761/7.4815))))*7.4815","v":0},"  gal"]
[null,"Flow Rate (each)",null,null,null,"  gpm"]
[null,"Detention Time",null,null,{"$f":"IF(OR(E765=\"\",E765=0),0,E764/E765)","v":0},"  min"]
[]
[null,"Baffling Factor",null,null,{"$f":"IF(I769=\"Unbaffled\",0.1,IF(I769=\"Poor\",0.3,IF(I769=\"Average\",0.5,IF(I769=\"Superior\",0.7,IF(I769=\"Perfect\",1,IF(I769=\"\",\" \",I770))))))","v":0.1}]
[null,null,null,null,null,null,null,"Baffling Characteristics:  ","Unbaffled"]
[null,null,null,null,null,null,null,"Approved Baffling Factor:  "]
[null,"T10",null,null,{"$f":"E766*E768","v":0},"  min"]
[]
[null,"Unit - 5",null,"Type:",null,null,"Shape:"]
[]
[null,null,"Further Description:"]
[]
[null,"Characteristic",null,null,null,null,"Comments"]
[null,"Number of Units"]
[null,"Diameter",null,null,null,{"$f":"IF(H773=\"pipe\",\"  in\",\"  ft\")","v":"  ft"}]
[null,"Length",null,null,null,"  ft"]
[null,"Width",null,null,null,"  ft"]
[null,"Side Water Depth",null,null,null,"  ft"]
[null,"Center Water Depth",null,null,null,"  ft"]
[null,"Media Depth",null,null,null,"  ft"]
[null,"Underdrain Depth",null,null,null,"  ft"]
[null,"Minimum Water Depth Over Media",null,null,null,"  ft"]
[null,"Average Porosity",null,null,null,"  %"]
[null,"Maximum Volume (each)",null,null,{"$f":"IF(OR(E773=\"Clearwell\",E773=\"Transfer Well\"),IF(H773=\"Circular\",PI()*(E779/2)^2*(2*E782+E783)/3*7.4815,IF(H773=\"Rectangular\",E780*E781*E782*7.4815,\"\")),\"\")","v":""},"  gal"]
[null,"Maximum Volume (each)",null,null,null,"  gal"]
[null,"Minimum Operating Level",null,null,null,"  ft"]
[null,"Worst Case Volume (each)",null,null,{"$f":"IF(OR(E773=\"Transfer Well\",E773=\"Clearwell\"),IF(H773=\"Circular\",PI()*(E779/2)^2*(2*E790+E783-(E782-E790))/3*7.4815,IF(H773=\"Rectangular\",E780*E781*E790*7.4815,\"\")),\"\")","v":""},"  gal"]
[null,{"$f":"IF(OR(E773=\"Clearwell\",E773=\"Transfer Well\"),\"Worst Case Volume (each)\", \"Volume (each)\")","v":"Volume (each)"},null,null,null,"  gal"]
[null,"Percent of Maximum Volume",null,null,{"$f":"IF(H773=\"Other\",IF(E789 = 0,\"\",E792/E789*100),IF(OR(E773=\"Clearwell\",E773=\"Transfer Well\"),IF(E788 = 0,\"\",E791/E788*100),\"\"))","v":""},"  %"]
[]
[null,{"$f":" IF(OR(E773=\"Clearwell\",E773=\"Transfer Well\"),\"Worst Case Volume (each)\",\"Volume (each)\")","v":"Volume (each)"},null,null,{"$f":"IF(E773=\"Filter\",IF(H773=\"Circular\",PI()*(E779/2)^2*(E784*E787/100+E786+E785),IF(H773=\"Rectangular\",E780*E781*(E784*E787/100+E786+E785),\"error\")),IF(AND(E773=\"Piping\",H773=\"Pipe\"),PI()*(E779/12/2)^2*E780,IF(H773=\"Circular\",IF(OR(E773=\"Transfer Well\",E773=\"Clearwell\"),E791/7.4815,PI()*(E779/2)^2*(2*E782+E783)/3),IF(H773=\"Rectangular\",IF(OR(E773=\"Transfer Well\",E773=\"Clearwell\"),E791/7.4815,E780*E781*E782),E792/7.4815))))*7.4815","v":0},"  gal"]
[null,"Flow Rate (each)",null,null,null,"  gpm"]
[null,"Detention Time",null,null,{"$f":"IF(OR(E796=\"\",E796=0),0,E795/E796)","v":0},"  min"]
[]
[null,"Baffling Factor",null,null,{"$f":"IF(I800=\"Unbaffled\",0.1,IF(I800=\"Poor\",0.3,IF(I800=\"Average\",0.5,IF(I800=\"Superior\",0.7,IF(I800=\"Perfect\",1,IF(I800=\"\",\" \",I801))))))","v":0.1}]
[null,null,null,null,null,null,null,"Baffling Characteristics:  ","Unbaffled"]
[null,null,null,null,null,null,null,"Approved Baffling Factor:  "]
[null,"T10",null,null,{"$f":"E797*E799","v":0},"  min"]
[]
[null,"Unit - 6",null,"Type:",null,null,"Shape:"]
[]
[null,null,"Further Description:"]
[]
[null,"Characteristic",null,null,null,null,"Comments"]
[null,"Number of Units"]
[null,"Diameter",null,null,null,{"$f":"IF(H804=\"pipe\",\"  in\",\"  ft\")","v":"  ft"}]
[null,"Length",null,null,null,"  ft"]
[null,"Width",null,null,null,"  ft"]
[null,"Side Water Depth",null,null,null,"  ft"]
[null,"Center Water Depth",null,null,null,"  ft"]
[null,"Media Depth",null,null,null,"  ft"]
[null,"Underdrain Depth",null,null,null,"  ft"]
[null,"Minimum Water Depth Over Media",null,null,null,"  ft"]
[null,"Average Porosity",null,null,null,"  %"]
[null,"Maximum Volume (each)",null,null,{"$f":"IF(OR(E804=\"Clearwell\",E804=\"Transfer Well\"),IF(H804=\"Circular\",PI()*(E810/2)^2*(2*E813+E814)/3*7.4815,IF(H804=\"Rectangular\",E811*E812*E813*7.4815,\"\")),\"\")","v":""},"  gal"]
[null,"Maximum Volume (each)",null,null,null,"  gal"]
[null,"Minimum Operating Level",null,null,null,"  ft"]
[null,"Worst Case Volume (each)",null,null,{"$f":"IF(OR(E804=\"Transfer Well\",E804=\"Clearwell\"),IF(H804=\"Circular\",PI()*(E810/2)^2*(2*E821+E814-(E813-E821))/3*7.4815,IF(H804=\"Rectangular\",E811*E812*E821*7.4815,\"\")),\"\")","v":""},"  gal"]
[null,{"$f":"IF(OR(E804=\"Clearwell\",E804=\"Transfer Well\"),\"Worst Case Volume (each)\", \"Volume (each)\")","v":"Volume (each)"},null,null,null,"  gal"]
[null,"Percent of Maximum Volume",null,null,{"$f":"IF(H804=\"Other\",IF(E820 = 0,\"\",E823/E820*100),IF(OR(E804=\"Clearwell\",E804=\"Transfer Well\"),IF(E819 = 0,\"\",E822/E819*100),\"\"))","v":""},"  %"]
[]
[null,{"$f":" IF(OR(E804=\"Clearwell\",E804=\"Transfer Well\"),\"Worst Case Volume (each)\",\"Volume (each)\")","v":"Volume (each)"},null,null,{"$f":"IF(E804=\"Filter\",IF(H804=\"Circular\",PI()*(E810/2)^2*(E815*E818/100+E817+E816),IF(H804=\"Rectangular\",E811*E812*(E815*E818/100+E817+E816),\"error\")),IF(AND(E804=\"Piping\",H804=\"Pipe\"),PI()*(E810/12/2)^2*E811,IF(H804=\"Circular\",IF(OR(E804=\"Transfer Well\",E804=\"Clearwell\"),E822/7.4815,PI()*(E810/2)^2*(2*E813+E814)/3),IF(H804=\"Rectangular\",IF(OR(E804=\"Transfer Well\",E804=\"Clearwell\"),E822/7.4815,E811*E812*E813),E823/7.4815))))*7.4815","v":0},"  gal"]
[null,"Flow Rate (each)",null,null,null,"  gpm"]
[null,"Detention Time",null,null,{"$f":"IF(OR(E827=\"\",E827=0),0,E826/E827)","v":0},"  min"]
[]
[null,"Baffling Factor",null,null,{"$f":"IF(I831=\"Unbaffled\",0.1,IF(I831=\"Poor\",0.3,IF(I831=\"Average\",0.5,IF(I831=\"Superior\",0.7,IF(I831=\"Perfect\",1,IF(I831=\"\",\" \",I832))))))","v":0.1}]
[null,null,null,null,null,null,null,"Baffling Characteristics:  ","Unbaffled"]
[null,null,null,null,null,null,null,"Approved Baffling Factor:  "]
[null,"T10",null,null,{"$f":"E828*E830","v":0},"  min"]
[]
[null,"Unit - 7",null,"Type:",null,null,"Shape:"]
[]
[null,null,"Further Description:"]
[]
[null,"Characteristic",null,null,null,null,"Comments"]
[null,"Number of Units"]
[null,"Diameter",null,null,null,{"$f":"IF(H835=\"pipe\",\"  in\",\"  ft\")","v":"  ft"}]
[null,"Length",null,null,null,"  ft"]
[null,"Width",null,null,null,"  ft"]
[null,"Side Water Depth",null,null,null,"  ft"]
[null,"Center Water Depth",null,null,null,"  ft"]
[null,"Media Depth",null,null,null,"  ft"]
[null,"Underdrain Depth",null,null,null,"  ft"]
[null,"Minimum Water Depth Over Media",null,null,null,"  ft"]
[null,"Average Porosity",null,null,null,"  %"]
[null,"Maximum Volume (each)",null,null,{"$f":"IF(OR(E835=\"Clearwell\",E835=\"Transfer Well\"),IF(H835=\"Circular\",PI()*(E841/2)^2*(2*E844+E845)/3*7.4815,IF(H835=\"Rectangular\",E842*E843*E844*7.4815,\"\")),\"\")","v":""},"  gal"]
[null,"Maximum Volume (each)",null,null,null,"  gal"]
[null,"Minimum Operating Level",null,null,null,"  ft"]
[null,"Worst Case Volume (each)",null,null,{"$f":"IF(OR(E835=\"Transfer Well\",E835=\"Clearwell\"),IF(H835=\"Circular\",PI()*(E841/2)^2*(2*E852+E845-(E844-E852))/3*7.4815,IF(H835=\"Rectangular\",E842*E843*E852*7.4815,\"\")),\"\")","v":""},"  gal"]
[null,{"$f":"IF(OR(E835=\"Clearwell\",E835=\"Transfer Well\"),\"Worst Case Volume (each)\", \"Volume (each)\")","v":"Volume (each)"},null,null,null,"  gal"]
[null,"Percent of Maximum Volume",null,null,{"$f":"IF(H835=\"Other\",IF(E851 = 0,\"\",E854/E851*100),IF(OR(E835=\"Clearwell\",E835=\"Transfer Well\"),IF(E850 = 0,\"\",E853/E850*100),\"\"))","v":""},"  %"]
[]
[null,{"$f":" IF(OR(E835=\"Clearwell\",E835=\"Transfer Well\"),\"Worst Case Volume (each)\",\"Volume (each)\")","v":"Volume (each)"},null,null,{"$f":"IF(E835=\"Filter\",IF(H835=\"Circular\",PI()*(E841/2)^2*(E846*E849/100+E848+E847),IF(H835=\"Rectangular\",E842*E843*(E846*E849/100+E848+E847),\"error\")),IF(AND(E835=\"Piping\",H835=\"Pipe\"),PI()*(E841/12/2)^2*E842,IF(H835=\"Circular\",IF(OR(E835=\"Transfer Well\",E835=\"Clearwell\"),E853/7.4815,PI()*(E841/2)^2*(2*E844+E845)/3),IF(H835=\"Rectangular\",IF(OR(E835=\"Transfer Well\",E835=\"Clearwell\"),E853/7.4815,E842*E843*E844),E854/7.4815))))*7.4815","v":0},"  gal"]
[null,"Flow Rate (each)",null,null,null,"  gpm"]
[null,"Detention Time",null,null,{"$f":"IF(OR(E858=\"\",E858=0),0,E857/E858)","v":0},"  min"]
[]
[null,"Baffling Factor",null,null,{"$f":"IF(I862=\"Unbaffled\",0.1,IF(I862=\"Poor\",0.3,IF(I862=\"Average\",0.5,IF(I862=\"Superior\",0.7,IF(I862=\"Perfect\",1,IF(I862=\"\",\" \",I863))))))","v":0.1}]
[null,null,null,null,null,null,null,"Baffling Characteristics:  ","Unbaffled"]
[null,null,null,null,null,null,null,"Approved Baffling Factor:  "]
[null,"T10",null,null,{"$f":"E859*E861","v":0},"  min"]
[]
[null,"Unit - 8",null,"Type:",null,null,"Shape:"]
[]
[null,null,"Further Description:"]
[]
[null,"Characteristic",null,null,null,null,"Comments"]
[null,"Number of Units"]
[null,"Diameter",null,null,null,{"$f":"IF(H866=\"pipe\",\"  in\",\"  ft\")","v":"  ft"}]
[null,"Length",null,null,null,"  ft"]
[null,"Width",null,null,null,"  ft"]
[null,"Side Water Depth",null,null,null,"  ft"]
[null,"Center Water Depth",null,null,null,"  ft"]
[null,"Media Depth",null,null,null,"  ft"]
[null,"Underdrain Depth",null,null,null,"  ft"]
[null,"Minimum Water Depth Over Media",null,null,null,"  ft"]
[null,"Average Porosity",null,null,null,"  %"]
[null,"Maximum Volume (each)",null,null,{"$f":"IF(OR(E866=\"Clearwell\",E866=\"Transfer Well\"),IF(H866=\"Circular\",PI()*(E872/2)^2*(2*E875+E876)/3*7.4815,IF(H866=\"Rectangular\",E873*E874*E875*7.4815,\"\")),\"\")","v":""},"  gal"]
[null,"Maximum Volume (each)",null,null,null,"  gal"]
[null,"Minimum Operating Level",null,null,null,"  ft"]
[null,"Worst Case Volume (each)",null,null,{"$f":"IF(OR(E866=\"Transfer Well\",E866=\"Clearwell\"),IF(H866=\"Circular\",PI()*(E872/2)^2*(2*E883+E876-(E875-E883))/3*7.4815,IF(H866=\"Rectangular\",E873*E874*E883*7.4815,\"\")),\"\")","v":""},"  gal"]
[null,{"$f":"IF(OR(E866=\"Clearwell\",E866=\"Transfer Well\"),\"Worst Case Volume (each)\", \"Volume (each)\")","v":"Volume (each)"},null,null,null,"  gal"]
[null,"Percent of Maximum Volume",null,null,{"$f":"IF(H866=\"Other\",IF(E882 = 0,\"\",E885/E882*100),IF(OR(E866=\"Clearwell\",E866=\"Transfer Well\"),IF(E881 = 0,\"\",E884/E881*100),\"\"))","v":""},"  %"]
[]
[null,{"$f":" IF(OR(E866=\"Clearwell\",E866=\"Transfer Well\"),\"Worst Case Volume (each)\",\"Volume (each)\")","v":"Volume (each)"},null,null,{"$f":"IF(E866=\"Filter\",IF(H866=\"Circular\",PI()*(E872/2)^2*(E877*E880/100+E879+E878),IF(H866=\"Rectangular\",E873*E874*(E877*E880/100+E879+E878),\"error\")),IF(AND(E866=\"Piping\",H866=\"Pipe\"),PI()*(E872/12/2)^2*E873,IF(H866=\"Circular\",IF(OR(E866=\"Transfer Well\",E866=\"Clearwell\"),E884/7.4815,PI()*(E872/2)^2*(2*E875+E876)/3),IF(H866=\"Rectangular\",IF(OR(E866=\"Transfer Well\",E866=\"Clearwell\"),E884/7.4815,E873*E874*E875),E885/7.4815))))*7.4815","v":0},"  gal"]
[null,"Flow Rate (each)",null,null,null,"  gpm"]
[null,"Detention Time",null,null,{"$f":"IF(OR(E889=\"\",E889=0),0,E888/E889)","v":0},"  min"]
[]
[null,"Baffling Factor",null,null,{"$f":"IF(I893=\"Unbaffled\",0.1,IF(I893=\"Poor\",0.3,IF(I893=\"Average\",0.5,IF(I893=\"Superior\",0.7,IF(I893=\"Perfect\",1,IF(I893=\"\",\" \",I894))))))","v":0.1}]
[null,null,null,null,null,null,null,"Baffling Characteristics:  ","Unbaffled"]
[null,null,null,null,null,null,null,"Approved Baffling Factor:  "]
[null,"T10",null,null,{"$f":"E890*E892","v":0},"  min"]
[]
[null,"Unit - 9",null,"Type:",null,null,"Shape:"]
[]
[null,null,"Further Description:"]
[]
[null,"Characteristic",null,null,null,null,"Comments"]
[null,"Number of Units"]
[null,"Diameter",null,null,null,{"$f":"IF(H897=\"pipe\",\"  in\",\"  ft\")","v":"  ft"}]
[null,"Length",null,null,null,"  ft"]
[null,"Width",null,null,null,"  ft"]
[null,"Side Water Depth",null,null,null,"  ft"]
[null,"Center Water Depth",null,null,null,"  ft"]
[null,"Media Depth",null,null,null,"  ft"]
[null,"Underdrain Depth",null,null,null,"  ft"]
[null,"Minimum Water Depth Over Media",null,null,null,"  ft"]
[null,"Average Porosity",null,null,null,"  %"]
[null,"Maximum Volume (each)",null,null,{"$f":"IF(OR(E897=\"Clearwell\",E897=\"Transfer Well\"),IF(H897=\"Circular\",PI()*(E903/2)^2*(2*E906+E907)/3*7.4815,IF(H897=\"Rectangular\",E904*E905*E906*7.4815,\"\")),\"\")","v":""},"  gal"]
[null,"Maximum Volume (each)",null,null,null,"  gal"]
[null,"Minimum Operating Level",null,null,null,"  ft"]
[null,"Worst Case Volume (each)",null,null,{"$f":"IF(OR(E897=\"Transfer Well\",E897=\"Clearwell\"),IF(H897=\"Circular\",PI()*(E903/2)^2*(2*E914+E907-(E906-E914))/3*7.4815,IF(H897=\"Rectangular\",E904*E905*E914*7.4815,\"\")),\"\")","v":""},"  gal"]
[null,{"$f":"IF(OR(E897=\"Clearwell\",E897=\"Transfer Well\"),\"Worst Case Volume (each)\", \"Volume (each)\")","v":"Volume (each)"},null,null,null,"  gal"]
[null,"Percent of Maximum Volume",null,null,{"$f":"IF(H897=\"Other\",IF(E913 = 0,\"\",E916/E913*100),IF(OR(E897=\"Clearwell\",E897=\"Transfer Well\"),IF(E912 = 0,\"\",E915/E912*100),\"\"))","v":""},"  %"]
[]
[null,{"$f":" IF(OR(E897=\"Clearwell\",E897=\"Transfer Well\"),\"Worst Case Volume (each)\",\"Volume (each)\")","v":"Volume (each)"},null,null,{"$f":"IF(E897=\"Filter\",IF(H897=\"Circular\",PI()*(E903/2)^2*(E908*E911/100+E910+E909),IF(H897=\"Rectangular\",E904*E905*(E908*E911/100+E910+E909),\"error\")),IF(AND(E897=\"Piping\",H897=\"Pipe\"),PI()*(E903/12/2)^2*E904,IF(H897=\"Circular\",IF(OR(E897=\"Transfer Well\",E897=\"Clearwell\"),E915/7.4815,PI()*(E903/2)^2*(2*E906+E907)/3),IF(H897=\"Rectangular\",IF(OR(E897=\"Transfer Well\",E897=\"Clearwell\"),E915/7.4815,E904*E905*E906),E916/7.4815))))*7.4815","v":0},"  gal"]
[null,"Flow Rate (each)",null,null,null,"  gpm"]
[null,"Detention Time",null,null,{"$f":"IF(OR(E920=\"\",E920=0),0,E919/E920)","v":0},"  min"]
[]
[null,"Baffling Factor",null,null,{"$f":"IF(I924=\"Unbaffled\",0.1,IF(I924=\"Poor\",0.3,IF(I924=\"Average\",0.5,IF(I924=\"Superior\",0.7,IF(I924=\"Perfect\",1,IF(I924=\"\",\" \",I925))))))","v":0.1}]
[null,null,null,null,null,null,null,"Baffling Characteristics:  ","Unbaffled"]
[null,null,null,null,null,null,null,"Approved Baffling Factor:  "]
[null,"T10",null,null,{"$f":"E921*E923","v":0},"  min"]
[]
[null,"Unit - 10",null,"Type:",null,null,"Shape:"]
[]
[null,null,"Further Description:"]
[]
[null,"Characteristic",null,null,null,null,"Comments"]
[null,"Number of Units"]
[null,"Diameter",null,null,null,{"$f":"IF(H928=\"pipe\",\"  in\",\"  ft\")","v":"  ft"}]
[null,"Length",null,null,null,"  ft"]
[null,"Width",null,null,null,"  ft"]
[null,"Side Water Depth",null,null,null,"  ft"]
[null,"Center Water Depth",null,null,null,"  ft"]
[null,"Media Depth",null,null,null,"  ft"]
[null,"Underdrain Depth",null,null,null,"  ft"]
[null,"Minimum Water Depth Over Media",null,null,null,"  ft"]
[null,"Average Porosity",null,null,null,"  %"]
[null,"Maximum Volume (each)",null,null,{"$f":"IF(OR(E928=\"Clearwell\",E928=\"Transfer Well\"),IF(H928=\"Circular\",PI()*(E934/2)^2*(2*E937+E938)/3*7.4815,IF(H928=\"Rectangular\",E935*E936*E937*7.4815,\"\")),\"\")","v":""},"  gal"]
[null,"Maximum Volume (each)",null,null,null,"  gal"]
[null,"Minimum Operating Level",null,null,null,"  ft"]
[null,"Worst Case Volume (each)",null,null,{"$f":"IF(OR(E928=\"Transfer Well\",E928=\"Clearwell\"),IF(H928=\"Circular\",PI()*(E934/2)^2*(2*E945+E938-(E937-E945))/3*7.4815,IF(H928=\"Rectangular\",E935*E936*E945*7.4815,\"\")),\"\")","v":""},"  gal"]
[null,{"$f":"IF(OR(E928=\"Clearwell\",E928=\"Transfer Well\"),\"Worst Case Volume (each)\", \"Volume (each)\")","v":"Volume (each)"},null,null,null,"  gal"]
[null,"Percent of Maximum Volume",null,null,{"$f":"IF(H928=\"Other\",IF(E944 = 0,\"\",E947/E944*100),IF(OR(E928=\"Clearwell\",E928=\"Transfer Well\"),IF(E943 =0,\"\",E946/E943*100),\"\"))","v":""},"  %"]
[]
[null,{"$f":" IF(OR(E928=\"Clearwell\",E928=\"Transfer Well\"),\"Worst Case Volume (each)\",\"Volume (each)\")","v":"Volume (each)"},null,null,{"$f":"IF(E928=\"Filter\",IF(H928=\"Circular\",PI()*(E934/2)^2*(E939*E942/100+E941+E940),IF(H928=\"Rectangular\",E935*E936*(E939*E942/100+E941+E940),\"error\")),IF(AND(E928=\"Piping\",H928=\"Pipe\"),PI()*(E934/12/2)^2*E935,IF(H928=\"Circular\",IF(OR(E928=\"Transfer Well\",E928=\"Clearwell\"),E946/7.4815,PI()*(E934/2)^2*(2*E937+E938)/3),IF(H928=\"Rectangular\",IF(OR(E928=\"Transfer Well\",E928=\"Clearwell\"),E946/7.4815,E935*E936*E937),E947/7.4815))))*7.4815","v":0},"  gal"]
[null,"Flow Rate (each)",null,null,null,"  gpm"]
[null,"Detention Time",null,null,{"$f":"IF(OR(E951=\"\",E951=0),0,E950/E951)","v":0},"  min"]
[]
[null,"Baffling Factor",null,null,{"$f":"IF(I955=\"Unbaffled\",0.1,IF(I955=\"Poor\",0.3,IF(I955=\"Average\",0.5,IF(I955=\"Superior\",0.7,IF(I955=\"Perfect\",1,IF(I955=\"\",\" \",I956))))))","v":0.1}]
[null,null,null,null,null,null,null,"Baffling Characteristics:  ","Unbaffled"]
[null,null,null,null,null,null,null,"Approved Baffling Factor:  "]
[null,"T10",null,null,{"$f":"E952*E954","v":0},"  min"]
[]
[null,{"$f":"CONCATENATE(D647,\" FLOW RATE\")","v":"D3 FLOW RATE"},null,null,{"$f":"MaxUnitFlow(E678,E709,E740,E771,E802,E833,E864,E895,E926,E957,E672,E703,E734,E765,E796,E827,E858,E889,E920,E951)*60*24/10^6","v":0},"  mgd"]
[]
[null,{"$f":"CONCATENATE(\"T10 SUM FOR \",D647)","v":"T10 SUM FOR D3"},null,null,{"$f":"SUM(E678,E709,E740,E771,E802,E833,E864,E895,E926,E957)","v":0},"  min"]
[]
["Disinfection Zone:",null,null,{"$f":"CONCATENATE(\"D\",Calculator!$BG$6)","v":"D4"},null,"Disinfectant:"]
[]
[null,"Unit - 1",null,"Type:",null,null,"Shape:"]
[]
[null,null,"Further Description:"]
[]
[null,"Characteristic",null,null,null,null,"Comments"]
[null,"Number of Units"]
[null,"Diameter",null,null,null,{"$f":"IF(H965=\"pipe\",\"  in\",\"  ft\")","v":"  ft"}]
[null,"Length",null,null,null,"  ft"]
[null,"Width",null,null,null,"  ft"]
[null,"Side Water Depth",null,null,null,"  ft"]
[null,"Center Water Depth",null,null,null,"  ft"]
[null,"Media Depth",null,null,null,"  ft"]
[null,"Underdrain Depth",null,null,null,"  ft"]
[null,"Minimum Water Depth Over Media",null,null,null,"  ft"]
[null,"Average Porosity",null,null,null,"  %"]
[null,"Maximum Volume (each)",null,null,{"$f":"IF(OR(E965=\"Clearwell\",E965=\"Transfer Well\"),IF(H965=\"Circular\",PI()*(E971/2)^2*(2*E974+E975)/3*7.4815,IF(H965=\"Rectangular\",E972*E973*E974*7.4815,\"\")),\"\")","v":""},"  gal"]
[null,"Maximum Volume (each)",null,null,null,"  gal"]
[null,"Minimum Operating Level",null,null,null,"  ft"]
[null,"Worst Case Volume (each)",null,null,{"$f":"IF(OR(E965=\"Transfer Well\",E965=\"Clearwell\"),IF(H965=\"Circular\",PI()*(E971/2)^2*(2*E982+E975-(E974-E982))/3*7.4815,IF(H965=\"Rectangular\",E972*E973*E982*7.4815,\"\")),\"\")","v":""},"  gal"]
[null,{"$f":"IF(OR(E965=\"Clearwell\",E965=\"Transfer Well\"),\"Worst Case Volume (each)\", \"Volume (each)\")","v":"Volume (each)"},null,null,null,"  gal"]
[null,"Percent of Maximum Volume",null,null,{"$f":"IF(H965=\"Other\",IF(E981 = 0,\"\",E984/E981*100),IF(OR(E965=\"Clearwell\",E965=\"Transfer Well\"),IF(E980 = 0,\"\",E983/E980*100),\"\"))","v":""},"  %"]
[]
[null,{"$f":" IF(OR(E965=\"Clearwell\",E965=\"Transfer Well\"),\"Worst Case Volume (each)\",\"Volume (each)\")","v":"Volume (each)"},null,null,{"$f":"IF(E965=\"Filter\",IF(H965=\"Circular\",PI()*(E971/2)^2*(E976*E979/100+E978+E977),IF(H965=\"Rectangular\",E972*E973*(E976*E979/100+E978+E977),\"error\")),IF(AND(E965=\"Piping\",H965=\"Pipe\"),PI()*(E971/12/2)^2*E972,IF(H965=\"Circular\",IF(OR(E965=\"Transfer Well\",E965=\"Clearwell\"),E983/7.4815,PI()*(E971/2)^2*(2*E974+E975)/3),IF(H965=\"Rectangular\",IF(OR(E965=\"Transfer Well\",E965=\"Clearwell\"),E983/7.4815,E972*E973*E974),E984/7.4815))))*7.4815","v":0},"  gal"]
[null,"Flow Rate (each)",null,null,null,"  gpm"]
[null,"Detention Time",null,null,{"$f":"IF(OR(E988=\"\",E988=0),0,E987/E988)","v":0},"  min"]
[]
[null,"Baffling Factor",null,null,{"$f":"IF(I992=\"Unbaffled\",0.1,IF(I992=\"Poor\",0.3,IF(I992=\"Average\",0.5,IF(I992=\"Superior\",0.7,IF(I992=\"Perfect\",1,IF(I992=\"\",\" \",I993))))))","v":0.1}]
[null,null,null,null,null,null,null,"Baffling Characteristics:  ","Unbaffled"]
[null,null,null,null,null,null,null,"Approved Baffling Factor:  "]
[null,"T10",null,null,{"$f":"E989*E991","v":0},"  min"]
[]
[null,"Unit - 2",null,"Type:",null,null,"Shape:"]
[]
[null,null,"Further Description:"]
[]
[null,"Characteristic",null,null,null,null,"Comments"]
[null,"Number of Units"]
[null,"Diameter",null,null,null,{"$f":"IF(H996=\"pipe\",\"  in\",\"  ft\")","v":"  ft"}]
[null,"Length",null,null,null,"  ft"]
[null,"Width",null,null,null,"  ft"]
[null,"Side Water Depth",null,null,null,"  ft"]
[null,"Center Water Depth",null,null,null,"  ft"]
[null,"Media Depth",null,null,null,"  ft"]
[null,"Underdrain Depth",null,null,null,"  ft"]
[null,"Minimum Water Depth Over Media",null,null,null,"  ft"]
[null,"Average Porosity",null,null,null,"  %"]
[null,"Maximum Volume (each)",null,null,{"$f":"IF(OR(E996=\"Clearwell\",E996=\"Transfer Well\"),IF(H996=\"Circular\",PI()*(E1002/2)^2*(2*E1005+E1006)/3*7.4815,IF(H996=\"Rectangular\",E1003*E1004*E1005*7.4815,\"\")),\"\")","v":""},"  gal"]
[null,"Maximum Volume (each)",null,null,null,"  gal"]
[null,"Minimum Operating Level",null,null,null,"  ft"]
[null,"Worst Case Volume (each)",null,null,{"$f":"IF(OR(E996=\"Transfer Well\",E996=\"Clearwell\"),IF(H996=\"Circular\",PI()*(E1002/2)^2*(2*E1013+E1006-(E1005-E1013))/3*7.4815,IF(H996=\"Rectangular\",E1003*E1004*E1013*7.4815,\"\")),\"\")","v":""},"  gal"]
[null,{"$f":"IF(OR(E996=\"Clearwell\",E996=\"Transfer Well\"),\"Worst Case Volume (each)\", \"Volume (each)\")","v":"Volume (each)"},null,null,null,"  gal"]
[null,"Percent of Maximum Volume",null,null,{"$f":"IF(H996=\"Other\",IF(E1012 = 0,\"\",E1015/E1012*100),IF(OR(E996=\"Clearwell\",E996=\"Transfer Well\"),IF(E1011 =0,\"\",E1014/E1011*100),\"\"))","v":""},"  %"]
[]
[null,{"$f":" IF(OR(E996=\"Clearwell\",E996=\"Transfer Well\"),\"Worst Case Volume (each)\",\"Volume (each)\")","v":"Volume (each)"},null,null,{"$f":"IF(E996=\"Filter\",IF(H996=\"Circular\",PI()*(E1002/2)^2*(E1007*E1010/100+E1009+E1008),IF(H996=\"Rectangular\",E1003*E1004*(E1007*E1010/100+E1009+E1008),\"error\")),IF(AND(E996=\"Piping\",H996=\"Pipe\"),PI()*(E1002/12/2)^2*E1003,IF(H996=\"Circular\",IF(OR(E996=\"Transfer Well\",E996=\"Clearwell\"),E1014/7.4815,PI()*(E1002/2)^2*(2*E1005+E1006)/3),IF(H996=\"Rectangular\",IF(OR(E996=\"Transfer Well\",E996=\"Clearwell\"),E1014/7.4815,E1003*E1004*E1005),E1015/7.4815))))*7.4815","v":0},"  gal"]
[null,"Flow Rate (each)",null,null,null,"  gpm"]
[null,"Detention Time",null,null,{"$f":"IF(OR(E1019=\"\",E1019=0),0,E1018/E1019)","v":0},"  min"]
[]
[null,"Baffling Factor",null,null,{"$f":"IF(I1023=\"Unbaffled\",0.1,IF(I1023=\"Poor\",0.3,IF(I1023=\"Average\",0.5,IF(I1023=\"Superior\",0.7,IF(I1023=\"Perfect\",1,IF(I1023=\"\",\" \",I1024))))))","v":0.1}]
[null,null,null,null,null,null,null,"Baffling Characteristics:  ","Unbaffled"]
[null,null,null,null,null,null,null,"Approved Baffling Factor:  "]
[null,"T10",null,null,{"$f":"E1020*E1022","v":0},"  min"]
[]
[null,"Unit - 3",null,"Type:",null,null,"Shape:"]
[]
[null,null,"Further Description:"]
[]
[null,"Characteristic",null,null,null,null,"Comments"]
[null,"Number of Units"]
[null,"Diameter",null,null,null,{"$f":"IF(H1027=\"pipe\",\"  in\",\"  ft\")","v":"  ft"}]
[null,"Length",null,null,null,"  ft"]
[null,"Width",null,null,null,"  ft"]
[null,"Side Water Depth",null,null,null,"  ft"]
[null,"Center Water Depth",null,null,null,"  ft"]
[null,"Media Depth",null,null,null,"  ft"]
[null,"Underdrain Depth",null,null,null,"  ft"]
[null,"Minimum Water Depth Over Media",null,null,null,"  ft"]
[null,"Average Porosity",null,null,null,"  %"]
[null,"Maximum Volume (each)",null,null,{"$f":"IF(OR(E1027=\"Clearwell\",E1027=\"Transfer Well\"),IF(H1027=\"Circular\",PI()*(E1033/2)^2*(2*E1036+E1037)/3*7.4815,IF(H1027=\"Rectangular\",E1034*E1035*E1036*7.4815,\"\")),\"\")","v":""},"  gal"]
[null,"Maximum Volume (each)",null,null,null,"  gal"]
[null,"Minimum Operating Level",null,null,null,"  ft"]
[null,"Worst Case Volume (each)",null,null,{"$f":"IF(OR(E1027=\"Transfer Well\",E1027=\"Clearwell\"),IF(H1027=\"Circular\",PI()*(E1033/2)^2*(2*E1044+E1037-(E1036-E1044))/3*7.4815,IF(H1027=\"Rectangular\",E1034*E1035*E1044*7.4815,\"\")),\"\")","v":""},"  gal"]
[null,{"$f":"IF(OR(E1027=\"Clearwell\",E1027=\"Transfer Well\"),\"Worst Case Volume (each)\", \"Volume (each)\")","v":"Volume (each)"},null,null,null,"  gal"]
[null,"Percent of Maximum Volume",null,null,{"$f":"IF(H1027=\"Other\",IF(E1043 = 0,\"\",E1046/E1043*100),IF(OR(E1027=\"Clearwell\",E1027=\"Transfer Well\"),IF(E1042 = 0,\"\",E1045/E1042*100),\"\"))","v":""},"  %"]
[]
[null,{"$f":" IF(OR(E1027=\"Clearwell\",E1027=\"Transfer Well\"),\"Worst Case Volume (each)\",\"Volume (each)\")","v":"Volume (each)"},null,null,{"$f":"IF(E1027=\"Filter\",IF(H1027=\"Circular\",PI()*(E1033/2)^2*(E1038*E1041/100+E1040+E1039),IF(H1027=\"Rectangular\",E1034*E1035*(E1038*E1041/100+E1040+E1039),\"error\")),IF(AND(E1027=\"Piping\",H1027=\"Pipe\"),PI()*(E1033/12/2)^2*E1034,IF(H1027=\"Circular\",IF(OR(E1027=\"Transfer Well\",E1027=\"Clearwell\"),E1045/7.4815,PI()*(E1033/2)^2*(2*E1036+E1037)/3),IF(H1027=\"Rectangular\",IF(OR(E1027=\"Transfer Well\",E1027=\"Clearwell\"),E1045/7.4815,E1034*E1035*E1036),E1046/7.4815))))*7.4815","v":0},"  gal"]
[null,"Flow Rate (each)",null,null,null,"  gpm"]
[null,"Detention Time",null,null,{"$f":"IF(OR(E1050=\"\",E1050=0),0,E1049/E1050)","v":0},"  min"]
[]
[null,"Baffling Factor",null,null,{"$f":"IF(I1054=\"Unbaffled\",0.1,IF(I1054=\"Poor\",0.3,IF(I1054=\"Average\",0.5,IF(I1054=\"Superior\",0.7,IF(I1054=\"Perfect\",1,IF(I1054=\"\",\" \",I1055))))))","v":0.1}]
[null,null,null,null,null,null,null,"Baffling Characteristics:  ","Unbaffled"]
[null,null,null,null,null,null,null,"Approved Baffling Factor:  "]
[null,"T10",null,null,{"$f":"E1051*E1053","v":0},"  min"]
[]
[null,"Unit - 4",null,"Type:",null,null,"Shape:"]
[]
[null,null,"Further Description:"]
[]
[null,"Characteristic",null,null,null,null,"Comments"]
[null,"Number of Units"]
[null,"Diameter",null,null,null,{"$f":"IF(H1058=\"pipe\",\"  in\",\"  ft\")","v":"  ft"}]
[null,"Length",null,null,null,"  ft"]
[null,"Width",null,null,null,"  ft"]
[null,"Side Water Depth",null,null,null,"  ft"]
[null,"Center Water Depth",null,null,null,"  ft"]
[null,"Media Depth",null,null,null,"  ft"]
[null,"Underdrain Depth",null,null,null,"  ft"]
[null,"Minimum Water Depth Over Media",null,null,null,"  ft"]
[null,"Average Porosity",null,null,null,"  %"]
[null,"Maximum Volume (each)",null,null,{"$f":"IF(OR(E1058=\"Clearwell\",E1058=\"Transfer Well\"),IF(H1058=\"Circular\",PI()*(E1064/2)^2*(2*E1067+E1068)/3*7.4815,IF(H1058=\"Rectangular\",E1065*E1066*E1067*7.4815,\"\")),\"\")","v":""},"  gal"]
[null,"Maximum Volume (each)",null,null,null,"  gal"]
[null,"Minimum Operating Level",null,null,null,"  ft"]
[null,"Worst Case Volume (each)",null,null,{"$f":"IF(OR(E1058=\"Transfer Well\",E1058=\"Clearwell\"),IF(H1058=\"Circular\",PI()*(E1064/2)^2*(2*E1075+E1068-(E1067-E1075))/3*7.4815,IF(H1058=\"Rectangular\",E1065*E1066*E1075*7.4815,\"\")),\"\")","v":""},"  gal"]
[null,{"$f":"IF(OR(E1058=\"Clearwell\",E1058=\"Transfer Well\"),\"Worst Case Volume (each)\", \"Volume (each)\")","v":"Volume (each)"},null,null,null,"  gal"]
[null,"Percent of Maximum Volume",null,null,{"$f":"IF(H1058=\"Other\",IF(E1074 = 0,\"\",E1077/E1074*100),IF(OR(E1058=\"Clearwell\",E1058=\"Transfer Well\"),IF(E1073 = 0,\"\",E1076/E1073*100),\"\"))","v":""},"  %"]
[]
[null,{"$f":" IF(OR(E1058=\"Clearwell\",E1058=\"Transfer Well\"),\"Worst Case Volume (each)\",\"Volume (each)\")","v":"Volume (each)"},null,null,{"$f":"IF(E1058=\"Filter\",IF(H1058=\"Circular\",PI()*(E1064/2)^2*(E1069*E1072/100+E1071+E1070),IF(H1058=\"Rectangular\",E1065*E1066*(E1069*E1072/100+E1071+E1070),\"error\")),IF(AND(E1058=\"Piping\",H1058=\"Pipe\"),PI()*(E1064/12/2)^2*E1065,IF(H1058=\"Circular\",IF(OR(E1058=\"Transfer Well\",E1058=\"Clearwell\"),E1076/7.4815,PI()*(E1064/2)^2*(2*E1067+E1068)/3),IF(H1058=\"Rectangular\",IF(OR(E1058=\"Transfer Well\",E1058=\"Clearwell\"),E1076/7.4815,E1065*E1066*E1067),E1077/7.4815))))*7.4815","v":0},"  gal"]
[null,"Flow Rate (each)",null,null,null,"  gpm"]
[null,"Detention Time",null,null,{"$f":"IF(OR(E1081=\"\",E1081=0),0,E1080/E1081)","v":0},"  min"]
[]
[null,"Baffling Factor",null,null,{"$f":"IF(I1085=\"Unbaffled\",0.1,IF(I1085=\"Poor\",0.3,IF(I1085=\"Average\",0.5,IF(I1085=\"Superior\",0.7,IF(I1085=\"Perfect\",1,IF(I1085=\"\",\" \",I1086))))))","v":0.1}]
[null,null,null,null,null,null,null,"Baffling Characteristics:  ","Unbaffled"]
[null,null,null,null,null,null,null,"Approved Baffling Factor:  "]
[null,"T10",null,null,{"$f":"E1082*E1084","v":0},"  min"]
[]
[null,"Unit - 5",null,"Type:",null,null,"Shape:"]
[]
[null,null,"Further Description:"]
[]
[null,"Characteristic",null,null,null,null,"Comments"]
[null,"Number of Units"]
[null,"Diameter",null,null,null,{"$f":"IF(H1089=\"pipe\",\"  in\",\"  ft\")","v":"  ft"}]
[null,"Length",null,null,null,"  ft"]
[null,"Width",null,null,null,"  ft"]
[null,"Side Water Depth",null,null,null,"  ft"]
[null,"Center Water Depth",null,null,null,"  ft"]
[null,"Media Depth",null,null,null,"  ft"]
[null,"Underdrain Depth",null,null,null,"  ft"]
[null,"Minimum Water Depth Over Media",null,null,null,"  ft"]
[null,"Average Porosity",null,null,null,"  %"]
[null,"Maximum Volume (each)",null,null,{"$f":"IF(OR(E1089=\"Clearwell\",E1089=\"Transfer Well\"),IF(H1089=\"Circular\",PI()*(E1095/2)^2*(2*E1098+E1099)/3*7.4815,IF(H1089=\"Rectangular\",E1096*E1097*E1098*7.4815,\"\")),\"\")","v":""},"  gal"]
[null,"Maximum Volume (each)",null,null,null,"  gal"]
[null,"Minimum Operating Level",null,null,null,"  ft"]
[null,"Worst Case Volume (each)",null,null,{"$f":"IF(OR(E1089=\"Transfer Well\",E1089=\"Clearwell\"),IF(H1089=\"Circular\",PI()*(E1095/2)^2*(2*E1106+E1099-(E1098-E1106))/3*7.4815,IF(H1089=\"Rectangular\",E1096*E1097*E1106*7.4815,\"\")),\"\")","v":""},"  gal"]
[null,{"$f":"IF(OR(E1089=\"Clearwell\",E1089=\"Transfer Well\"),\"Worst Case Volume (each)\", \"Volume (each)\")","v":"Volume (each)"},null,null,null,"  gal"]
[null,"Percent of Maximum Volume",null,null,{"$f":"IF(H1089=\"Other\",IF(E1105 = 0,\"\",E1108/E1105*100),IF(OR(E1089=\"Clearwell\",E1089=\"Transfer Well\"),IF(E1104 = 0,\"\",E1107/E1104*100),\"\"))","v":""},"  %"]
[]
[null,{"$f":" IF(OR(E1089=\"Clearwell\",E1089=\"Transfer Well\"),\"Worst Case Volume (each)\",\"Volume (each)\")","v":"Volume (each)"},null,null,{"$f":"IF(E1089=\"Filter\",IF(H1089=\"Circular\",PI()*(E1095/2)^2*(E1100*E1103/100+E1102+E1101),IF(H1089=\"Rectangular\",E1096*E1097*(E1100*E1103/100+E1102+E1101),\"error\")),IF(AND(E1089=\"Piping\",H1089=\"Pipe\"),PI()*(E1095/12/2)^2*E1096,IF(H1089=\"Circular\",IF(OR(E1089=\"Transfer Well\",E1089=\"Clearwell\"),E1107/7.4815,PI()*(E1095/2)^2*(2*E1098+E1099)/3),IF(H1089=\"Rectangular\",IF(OR(E1089=\"Transfer Well\",E1089=\"Clearwell\"),E1107/7.4815,E1096*E1097*E1098),E1108/7.4815))))*7.4815","v":0},"  gal"]
[null,"Flow Rate (each)",null,null,null,"  gpm"]
[null,"Detention Time",null,null,{"$f":"IF(OR(E1112=\"\",E1112=0),0,E1111/E1112)","v":0},"  min"]
[]
[null,"Baffling Factor",null,null,{"$f":"IF(I1116=\"Unbaffled\",0.1,IF(I1116=\"Poor\",0.3,IF(I1116=\"Average\",0.5,IF(I1116=\"Superior\",0.7,IF(I1116=\"Perfect\",1,IF(I1116=\"\",\" \",I1117))))))","v":0.1}]
[null,null,null,null,null,null,null,"Baffling Characteristics:  ","Unbaffled"]
[null,null,null,null,null,null,null,"Approved Baffling Factor:  "]
[null,"T10",null,null,{"$f":"E1113*E1115","v":0},"  min"]
[]
[null,"Unit - 6",null,"Type:",null,null,"Shape:"]
[]
[null,null,"Further Description:"]
[]
[null,"Characteristic",null,null,null,null,"Comments"]
[null,"Number of Units"]
[null,"Diameter",null,null,null,{"$f":"IF(H1120=\"pipe\",\"  in\",\"  ft\")","v":"  ft"}]
[null,"Length",null,null,null,"  ft"]
[null,"Width",null,null,null,"  ft"]
[null,"Side Water Depth",null,null,null,"  ft"]
[null,"Center Water Depth",null,null,null,"  ft"]
[null,"Media Depth",null,null,null,"  ft"]
[null,"Underdrain Depth",null,null,null,"  ft"]
[null,"Minimum Water Depth Over Media",null,null,null,"  ft"]
[null,"Average Porosity",null,null,null,"  %"]
[null,"Maximum Volume (each)",null,null,{"$f":"IF(OR(E1120=\"Clearwell\",E1120=\"Transfer Well\"),IF(H1120=\"Circular\",PI()*(E1126/2)^2*(2*E1129+E1130)/3*7.4815,IF(H1120=\"Rectangular\",E1127*E1128*E1129*7.4815,\"\")),\"\")","v":""},"  gal"]
[null,"Maximum Volume (each)",null,null,null,"  gal"]
[null,"Minimum Operating Level",null,null,null,"  ft"]
[null,"Worst Case Volume (each)",null,null,{"$f":"IF(OR(E1120=\"Transfer Well\",E1120=\"Clearwell\"),IF(H1120=\"Circular\",PI()*(E1126/2)^2*(2*E1137+E1130-(E1129-E1137))/3*7.4815,IF(H1120=\"Rectangular\",E1127*E1128*E1137*7.4815,\"\")),\"\")","v":""},"  gal"]
[null,{"$f":"IF(OR(E1120=\"Clearwell\",E1120=\"Transfer Well\"),\"Worst Case Volume (each)\", \"Volume (each)\")","v":"Volume (each)"},null,null,null,"  gal"]
[null,"Percent of Maximum Volume",null,null,{"$f":"IF(H1120=\"Other\",IF(E1136 = 0,\"\",E1139/E1136*100),IF(OR(E1120=\"Clearwell\",E1120=\"Transfer Well\"),IF(E1135 = 0,\"\",E1138/E1135*100),\"\"))","v":""},"  %"]
[]
[null,{"$f":" IF(OR(E1120=\"Clearwell\",E1120=\"Transfer Well\"),\"Worst Case Volume (each)\",\"Volume (each)\")","v":"Volume (each)"},null,null,{"$f":"IF(E1120=\"Filter\",IF(H1120=\"Circular\",PI()*(E1126/2)^2*(E1131*E1134/100+E1133+E1132),IF(H1120=\"Rectangular\",E1127*E1128*(E1131*E1134/100+E1133+E1132),\"error\")),IF(AND(E1120=\"Piping\",H1120=\"Pipe\"),PI()*(E1126/12/2)^2*E1127,IF(H1120=\"Circular\",IF(OR(E1120=\"Transfer Well\",E1120=\"Clearwell\"),E1138/7.4815,PI()*(E1126/2)^2*(2*E1129+E1130)/3),IF(H1120=\"Rectangular\",IF(OR(E1120=\"Transfer Well\",E1120=\"Clearwell\"),E1138/7.4815,E1127*E1128*E1129),E1139/7.4815))))*7.4815","v":0},"  gal"]
[null,"Flow Rate (each)",null,null,null,"  gpm"]
[null,"Detention Time",null,null,{"$f":"IF(OR(E1143=\"\",E1143=0),0,E1142/E1143)","v":0},"  min"]
[]
[null,"Baffling Factor",null,null,{"$f":"IF(I1147=\"Unbaffled\",0.1,IF(I1147=\"Poor\",0.3,IF(I1147=\"Average\",0.5,IF(I1147=\"Superior\",0.7,IF(I1147=\"Perfect\",1,IF(I1147=\"\",\" \",I1148))))))","v":0.1}]
[null,null,null,null,null,null,null,"Baffling Characteristics:  ","Unbaffled"]
[null,null,null,null,null,null,null,"Approved Baffling Factor:  "]
[null,"T10",null,null,{"$f":"E1144*E1146","v":0},"  min"]
[]
[null,"Unit - 7",null,"Type:",null,null,"Shape:"]
[]
[null,null,"Further Description:"]
[]
[null,"Characteristic",null,null,null,null,"Comments"]
[null,"Number of Units"]
[null,"Diameter",null,null,null,{"$f":"IF(H1151=\"pipe\",\"  in\",\"  ft\")","v":"  ft"}]
[null,"Length",null,null,null,"  ft"]
[null,"Width",null,null,null,"  ft"]
[null,"Side Water Depth",null,null,null,"  ft"]
[null,"Center Water Depth",null,null,null,"  ft"]
[null,"Media Depth",null,null,null,"  ft"]
[null,"Underdrain Depth",null,null,null,"  ft"]
[null,"Minimum Water Depth Over Media",null,null,null,"  ft"]
[null,"Average Porosity",null,null,null,"  %"]
[null,"Maximum Volume (each)",null,null,{"$f":"IF(OR(E1151=\"Clearwell\",E1151=\"Transfer Well\"),IF(H1151=\"Circular\",PI()*(E1157/2)^2*(2*E1160+E1161)/3*7.4815,IF(H1151=\"Rectangular\",E1158*E1159*E1160*7.4815,\"\")),\"\")","v":""},"  gal"]
[null,"Maximum Volume (each)",null,null,null,"  gal"]
[null,"Minimum Operating Level",null,null,null,"  ft"]
[null,"Worst Case Volume (each)",null,null,{"$f":"IF(OR(E1151=\"Transfer Well\",E1151=\"Clearwell\"),IF(H1151=\"Circular\",PI()*(E1157/2)^2*(2*E1168+E1161-(E1160-E1168))/3*7.4815,IF(H1151=\"Rectangular\",E1158*E1159*E1168*7.4815,\"\")),\"\")","v":""},"  gal"]
[null,{"$f":"IF(OR(E1151=\"Clearwell\",E1151=\"Transfer Well\"),\"Worst Case Volume (each)\", \"Volume (each)\")","v":"Volume (each)"},null,null,null,"  gal"]
[null,"Percent of Maximum Volume",null,null,{"$f":"IF(H1151=\"Other\",IF(E1167 = 0,\"\",E1170/E1167*100),IF(OR(E1151=\"Clearwell\",E1151=\"Transfer Well\"),IF(E1166 = 0,\"\",E1169/E1166*100),\"\"))","v":""},"  %"]
[]
[null,{"$f":" IF(OR(E1151=\"Clearwell\",E1151=\"Transfer Well\"),\"Worst Case Volume (each)\",\"Volume (each)\")","v":"Volume (each)"},null,null,{"$f":"IF(E1151=\"Filter\",IF(H1151=\"Circular\",PI()*(E1157/2)^2*(E1162*E1165/100+E1164+E1163),IF(H1151=\"Rectangular\",E1158*E1159*(E1162*E1165/100+E1164+E1163),\"error\")),IF(AND(E1151=\"Piping\",H1151=\"Pipe\"),PI()*(E1157/12/2)^2*E1158,IF(H1151=\"Circular\",IF(OR(E1151=\"Transfer Well\",E1151=\"Clearwell\"),E1169/7.4815,PI()*(E1157/2)^2*(2*E1160+E1161)/3),IF(H1151=\"Rectangular\",IF(OR(E1151=\"Transfer Well\",E1151=\"Clearwell\"),E1169/7.4815,E1158*E1159*E1160),E1170/7.4815))))*7.4815","v":0},"  gal"]
[null,"Flow Rate (each)",null,null,null,"  gpm"]
[null,"Detention Time",null,null,{"$f":"IF(OR(E1174=\"\",E1174=0),0,E1173/E1174)","v":0},"  min"]
[]
[null,"Baffling Factor",null,null,{"$f":"IF(I1178=\"Unbaffled\",0.1,IF(I1178=\"Poor\",0.3,IF(I1178=\"Average\",0.5,IF(I1178=\"Superior\",0.7,IF(I1178=\"Perfect\",1,IF(I1178=\"\",\" \",I1179))))))","v":0.1}]
[null,null,null,null,null,null,null,"Baffling Characteristics:  ","Unbaffled"]
[null,null,null,null,null,null,null,"Approved Baffling Factor:  "]
[null,"T10",null,null,{"$f":"E1175*E1177","v":0},"  min"]
[]
[null,"Unit - 8",null,"Type:",null,null,"Shape:"]
[]
[null,null,"Further Description:"]
[]
[null,"Characteristic",null,null,null,null,"Comments"]
[null,"Number of Units"]
[null,"Diameter",null,null,null,{"$f":"IF(H1182=\"pipe\",\"  in\",\"  ft\")","v":"  ft"}]
[null,"Length",null,null,null,"  ft"]
[null,"Width",null,null,null,"  ft"]
[null,"Side Water Depth",null,null,null,"  ft"]
[null,"Center Water Depth",null,null,null,"  ft"]
[null,"Media Depth",null,null,null,"  ft"]
[null,"Underdrain Depth",null,null,null,"  ft"]
[null,"Minimum Water Depth Over Media",null,null,null,"  ft"]
[null,"Average Porosity",null,null,null,"  %"]
[null,"Maximum Volume (each)",null,null,{"$f":"IF(OR(E1182=\"Clearwell\",E1182=\"Transfer Well\"),IF(H1182=\"Circular\",PI()*(E1188/2)^2*(2*E1191+E1192)/3*7.4815,IF(H1182=\"Rectangular\",E1189*E1190*E1191*7.4815,\"\")),\"\")","v":""},"  gal"]
[null,"Maximum Volume (each)",null,null,null,"  gal"]
[null,"Minimum Operating Level",null,null,null,"  ft"]
[null,"Worst Case Volume (each)",null,null,{"$f":"IF(OR(E1182=\"Transfer Well\",E1182=\"Clearwell\"),IF(H1182=\"Circular\",PI()*(E1188/2)^2*(2*E1199+E1192-(E1191-E1199))/3*7.4815,IF(H1182=\"Rectangular\",E1189*E1190*E1199*7.4815,\"\")),\"\")","v":""},"  gal"]
[null,{"$f":"IF(OR(E1182=\"Clearwell\",E1182=\"Transfer Well\"),\"Worst Case Volume (each)\", \"Volume (each)\")","v":"Volume (each)"},null,null,null,"  gal"]
[null,"Percent of Maximum Volume",null,null,{"$f":"IF(H1182=\"Other\",IF(E1198 = 0,\"\",E1201/E1198*100),IF(OR(E1182=\"Clearwell\",E1182=\"Transfer Well\"),IF(E1197 = 0,\"\",E1200/E1197*100),\"\"))","v":""},"  %"]
[]
[null,{"$f":" IF(OR(E1182=\"Clearwell\",E1182=\"Transfer Well\"),\"Worst Case Volume (each)\",\"Volume (each)\")","v":"Volume (each)"},null,null,{"$f":"IF(E1182=\"Filter\",IF(H1182=\"Circular\",PI()*(E1188/2)^2*(E1193*E1196/100+E1195+E1194),IF(H1182=\"Rectangular\",E1189*E1190*(E1193*E1196/100+E1195+E1194),\"error\")),IF(AND(E1182=\"Piping\",H1182=\"Pipe\"),PI()*(E1188/12/2)^2*E1189,IF(H1182=\"Circular\",IF(OR(E1182=\"Transfer Well\",E1182=\"Clearwell\"),E1200/7.4815,PI()*(E1188/2)^2*(2*E1191+E1192)/3),IF(H1182=\"Rectangular\",IF(OR(E1182=\"Transfer Well\",E1182=\"Clearwell\"),E1200/7.4815,E1189*E1190*E1191),E1201/7.4815))))*7.4815","v":0},"  gal"]
[null,"Flow Rate (each)",null,null,null,"  gpm"]
[null,"Detention Time",null,null,{"$f":"IF(OR(E1205=\"\",E1205=0),0,E1204/E1205)","v":0},"  min"]
[]
[null,"Baffling Factor",null,null,{"$f":"IF(I1209=\"Unbaffled\",0.1,IF(I1209=\"Poor\",0.3,IF(I1209=\"Average\",0.5,IF(I1209=\"Superior\",0.7,IF(I1209=\"Perfect\",1,IF(I1209=\"\",\" \",I1210))))))","v":0.1}]
[null,null,null,null,null,null,null,"Baffling Characteristics:  ","Unbaffled"]
[null,null,null,null,null,null,null,"Approved Baffling Factor:  "]
[null,"T10",null,null,{"$f":"E1206*E1208","v":0},"  min"]
[]
[null,"Unit - 9",null,"Type:",null,null,"Shape:"]
[]
[null,null,"Further Description:"]
[]
[null,"Characteristic",null,null,null,null,"Comments"]
[null,"Number of Units"]
[null,"Diameter",null,null,null,{"$f":"IF(H1213=\"pipe\",\"  in\",\"  ft\")","v":"  ft"}]
[null,"Length",null,null,null,"  ft"]
[null,"Width",null,null,null,"  ft"]
[null,"Side Water Depth",null,null,null,"  ft"]
[null,"Center Water Depth",null,null,null,"  ft"]
[null,"Media Depth",null,null,null,"  ft"]
[null,"Underdrain Depth",null,null,null,"  ft"]
[null,"Minimum Water Depth Over Media",null,null,null,"  ft"]
[null,"Average Porosity",null,null,null,"  %"]
[null,"Maximum Volume (each)",null,null,{"$f":"IF(OR(E1213=\"Clearwell\",E1213=\"Transfer Well\"),IF(H1213=\"Circular\",PI()*(E1219/2)^2*(2*E1222+E1223)/3*7.4815,IF(H1213=\"Rectangular\",E1220*E1221*E1222*7.4815,\"\")),\"\")","v":""},"  gal"]
[null,"Maximum Volume (each)",null,null,null,"  gal"]
[null,"Minimum Operating Level",null,null,null,"  ft"]
[null,"Worst Case Volume (each)",null,null,{"$f":"IF(OR(E1213=\"Transfer Well\",E1213=\"Clearwell\"),IF(H1213=\"Circular\",PI()*(E1219/2)^2*(2*E1230+E1223-(E1222-E1230))/3*7.4815,IF(H1213=\"Rectangular\",E1220*E1221*E1230*7.4815,\"\")),\"\")","v":""},"  gal"]
[null,{"$f":"IF(OR(E1213=\"Clearwell\",E1213=\"Transfer Well\"),\"Worst Case Volume (each)\", \"Volume (each)\")","v":"Volume (each)"},null,null,null,"  gal"]
[null,"Percent of Maximum Volume",null,null,{"$f":"IF(H1213=\"Other\",IF(E1229 = 0,\"\",E1232/E1229*100),IF(OR(E1213=\"Clearwell\",E1213=\"Transfer Well\"),IF(E1228 = 0,\"\",E1231/E1228*100),\"\"))","v":""},"  %"]
[]
[null,{"$f":" IF(OR(E1213=\"Clearwell\",E1213=\"Transfer Well\"),\"Worst Case Volume (each)\",\"Volume (each)\")","v":"Volume (each)"},null,null,{"$f":"IF(E1213=\"Filter\",IF(H1213=\"Circular\",PI()*(E1219/2)^2*(E1224*E1227/100+E1226+E1225),IF(H1213=\"Rectangular\",E1220*E1221*(E1224*E1227/100+E1226+E1225),\"error\")),IF(AND(E1213=\"Piping\",H1213=\"Pipe\"),PI()*(E1219/12/2)^2*E1220,IF(H1213=\"Circular\",IF(OR(E1213=\"Transfer Well\",E1213=\"Clearwell\"),E1231/7.4815,PI()*(E1219/2)^2*(2*E1222+E1223)/3),IF(H1213=\"Rectangular\",IF(OR(E1213=\"Transfer Well\",E1213=\"Clearwell\"),E1231/7.4815,E1220*E1221*E1222),E1232/7.4815))))*7.4815","v":0},"  gal"]
[null,"Flow Rate (each)",null,null,null,"  gpm"]
[null,"Detention Time",null,null,{"$f":"IF(OR(E1236=\"\",E1236=0),0,E1235/E1236)","v":0},"  min"]
[]
[null,"Baffling Factor",null,null,{"$f":"IF(I1240=\"Unbaffled\",0.1,IF(I1240=\"Poor\",0.3,IF(I1240=\"Average\",0.5,IF(I1240=\"Superior\",0.7,IF(I1240=\"Perfect\",1,IF(I1240=\"\",\" \",I1241))))))","v":0.1}]
[null,null,null,null,null,null,null,"Baffling Characteristics:  ","Unbaffled"]
[null,null,null,null,null,null,null,"Approved Baffling Factor:  "]
[null,"T10",null,null,{"$f":"E1237*E1239","v":0},"  min"]
[]
[null,"Unit - 10",null,"Type:",null,null,"Shape:"]
[]
[null,null,"Further Description:"]
[]
[null,"Characteristic",null,null,null,null,"Comments"]
[null,"Number of Units"]
[null,"Diameter",null,null,null,{"$f":"IF(H1244=\"pipe\",\"  in\",\"  ft\")","v":"  ft"}]
[null,"Length",null,null,null,"  ft"]
[null,"Width",null,null,null,"  ft"]
[null,"Side Water Depth",null,null,null,"  ft"]
[null,"Center Water Depth",null,null,null,"  ft"]
[null,"Media Depth",null,null,null,"  ft"]
[null,"Underdrain Depth",null,null,null,"  ft"]
[null,"Minimum Water Depth Over Media",null,null,null,"  ft"]
[null,"Average Porosity",null,null,null,"  %"]
[null,"Maximum Volume (each)",null,null,{"$f":"IF(OR(E1244=\"Clearwell\",E1244=\"Transfer Well\"),IF(H1244=\"Circular\",PI()*(E1250/2)^2*(2*E1253+E1254)/3*7.4815,IF(H1244=\"Rectangular\",E1251*E1252*E1253*7.4815,\"\")),\"\")","v":""},"  gal"]
[null,"Maximum Volume (each)",null,null,null,"  gal"]
[null,"Minimum Operating Level",null,null,null,"  ft"]
[null,"Worst Case Volume (each)",null,null,{"$f":"IF(OR(E1244=\"Transfer Well\",E1244=\"Clearwell\"),IF(H1244=\"Circular\",PI()*(E1250/2)^2*(2*E1261+E1254-(E1253-E1261))/3*7.4815,IF(H1244=\"Rectangular\",E1251*E1252*E1261*7.4815,\"\")),\"\")","v":""},"  gal"]
[null,{"$f":"IF(OR(E1244=\"Clearwell\",E1244=\"Transfer Well\"),\"Worst Case Volume (each)\", \"Volume (each)\")","v":"Volume (each)"},null,null,null,"  gal"]
[null,"Percent of Maximum Volume",null,null,{"$f":"IF(H1244=\"Other\",IF(E1260 = 0,\"\",E1263/E1260*100),IF(OR(E1244=\"Clearwell\",E1244=\"Transfer Well\"),IF(E1259 =0,\"\",E1262/E1259*100),\"\"))","v":""},"  %"]
[]
[null,{"$f":" IF(OR(E1244=\"Clearwell\",E1244=\"Transfer Well\"),\"Worst Case Volume (each)\",\"Volume (each)\")","v":"Volume (each)"},null,null,{"$f":"IF(E1244=\"Filter\",IF(H1244=\"Circular\",PI()*(E1250/2)^2*(E1255*E1258/100+E1257+E1256),IF(H1244=\"Rectangular\",E1251*E1252*(E1255*E1258/100+E1257+E1256),\"error\")),IF(AND(E1244=\"Piping\",H1244=\"Pipe\"),PI()*(E1250/12/2)^2*E1251,IF(H1244=\"Circular\",IF(OR(E1244=\"Transfer Well\",E1244=\"Clearwell\"),E1262/7.4815,PI()*(E1250/2)^2*(2*E1253+E1254)/3),IF(H1244=\"Rectangular\",IF(OR(E1244=\"Transfer Well\",E1244=\"Clearwell\"),E1262/7.4815,E1251*E1252*E1253),E1263/7.4815))))*7.4815","v":0},"  gal"]
[null,"Flow Rate (each)",null,null,null,"  gpm"]
[null,"Detention Time",null,null,{"$f":"IF(OR(E1267=\"\",E1267=0),0,E1266/E1267)","v":0},"  min"]
[]
[null,"Baffling Factor",null,null,{"$f":"IF(I1271=\"Unbaffled\",0.1,IF(I1271=\"Poor\",0.3,IF(I1271=\"Average\",0.5,IF(I1271=\"Superior\",0.7,IF(I1271=\"Perfect\",1,IF(I1271=\"\",\" \",I1272))))))","v":0.1}]
[null,null,null,null,null,null,null,"Baffling Characteristics:  ","Unbaffled"]
[null,null,null,null,null,null,null,"Approved Baffling Factor:  "]
[null,"T10",null,null,{"$f":"E1268*E1270","v":0},"  min"]
[]
[null,{"$f":"CONCATENATE(D963,\" FLOW RATE\")","v":"D4 FLOW RATE"},null,null,{"$f":"MaxUnitFlow(E994,E1025,E1056,E1087,E1118,E1149,E1180,E1211,E1242,E1273,E988,E1019,E1050,E1081,E1112,E1143,E1174,E1205,E1236,E1267)*60*24/10^6","v":0},"  mgd"]
[]
[null,{"$f":"CONCATENATE(\"T10 SUM FOR \",D963)","v":"T10 SUM FOR D4"},null,null,{"$f":"SUM(E994,E1025,E1056,E1087,E1118,E1149,E1180,E1211,E1242,E1273)","v":0},"  min"]
[]
["Disinfection Zone:",null,null,{"$f":"CONCATENATE(\"D\",Calculator!$BH$6)","v":"D5"},null,"Disinfectant:"]
[]
[null,"Unit - 1",null,"Type:",null,null,"Shape:"]
[]
[null,null,"Further Description:"]
[]
[null,"Characteristic",null,null,null,null,"Comments"]
[null,"Number of Units"]
[null,"Diameter",null,null,null,{"$f":"IF(H1281=\"pipe\",\"  in\",\"  ft\")","v":"  ft"}]
[null,"Length",null,null,null,"  ft"]
[null,"Width",null,null,null,"  ft"]
[null,"Side Water Depth",null,null,null,"  ft"]
[null,"Center Water Depth",null,null,null,"  ft"]
[null,"Media Depth",null,null,null,"  ft"]
[null,"Underdrain Depth",null,null,null,"  ft"]
[null,"Minimum Water Depth Over Media",null,null,null,"  ft"]
[null,"Average Porosity",null,null,null,"  %"]
[null,"Maximum Volume (each)",null,null,{"$f":"IF(OR(E1281=\"Clearwell\",E1281=\"Transfer Well\"),IF(H1281=\"Circular\",PI()*(E1287/2)^2*(2*E1290+E1291)/3*7.4815,IF(H1281=\"Rectangular\",E1288*E1289*E1290*7.4815,\"\")),\"\")","v":""},"  gal"]
[null,"Maximum Volume (each)",null,null,null,"  gal"]
[null,"Minimum Operating Level",null,null,null,"  ft"]
[null,"Worst Case Volume (each)",null,null,{"$f":"IF(OR(E1281=\"Transfer Well\",E1281=\"Clearwell\"),IF(H1281=\"Circular\",PI()*(E1287/2)^2*(2*E1298+E1291-(E1290-E1298))/3*7.4815,IF(H1281=\"Rectangular\",E1288*E1289*E1298*7.4815,\"\")),\"\")","v":""},"  gal"]
[null,{"$f":"IF(OR(E1281=\"Clearwell\",E1281=\"Transfer Well\"),\"Worst Case Volume (each)\", \"Volume (each)\")","v":"Volume (each)"},null,null,null,"  gal"]
[null,"Percent of Maximum Volume",null,null,{"$f":"IF(H1281=\"Other\",IF(E1297 = 0,\"\",E1300/E1297*100),IF(OR(E1281=\"Clearwell\",E1281=\"Transfer Well\"),IF(E1296 = 0,\"\",E1299/E1296*100),\"\"))","v":""},"  %"]
[]
[null,{"$f":" IF(OR(E1281=\"Clearwell\",E1281=\"Transfer Well\"),\"Worst Case Volume (each)\",\"Volume (each)\")","v":"Volume (each)"},null,null,{"$f":"IF(E1281=\"Filter\",IF(H1281=\"Circular\",PI()*(E1287/2)^2*(E1292*E1295/100+E1294+E1293),IF(H1281=\"Rectangular\",E1288*E1289*(E1292*E1295/100+E1294+E1293),\"error\")),IF(AND(E1281=\"Piping\",H1281=\"Pipe\"),PI()*(E1287/12/2)^2*E1288,IF(H1281=\"Circular\",IF(OR(E1281=\"Transfer Well\",E1281=\"Clearwell\"),E1299/7.4815,PI()*(E1287/2)^2*(2*E1290+E1291)/3),IF(H1281=\"Rectangular\",IF(OR(E1281=\"Transfer Well\",E1281=\"Clearwell\"),E1299/7.4815,E1288*E1289*E1290),E1300/7.4815))))*7.4815","v":0},"  gal"]
[null,"Flow Rate (each)",null,null,null,"  gpm"]
[null,"Detention Time",null,null,{"$f":"IF(OR(E1304=\"\",E1304=0),0,E1303/E1304)","v":0},"  min"]
[]
[null,"Baffling Factor",null,null,{"$f":"IF(I1308=\"Unbaffled\",0.1,IF(I1308=\"Poor\",0.3,IF(I1308=\"Average\",0.5,IF(I1308=\"Superior\",0.7,IF(I1308=\"Perfect\",1,IF(I1308=\"\",\" \",I1309))))))","v":0.1}]
[null,null,null,null,null,null,null,"Baffling Characteristics:  ","Unbaffled"]
[null,null,null,null,null,null,null,"Approved Baffling Factor:  "]
[null,"T10",null,null,{"$f":"E1305*E1307","v":0},"  min"]
[]
[null,"Unit - 2",null,"Type:",null,null,"Shape:"]
[]
[null,null,"Further Description:"]
[]
[null,"Characteristic",null,null,null,null,"Comments"]
[null,"Number of Units"]
[null,"Diameter",null,null,null,{"$f":"IF(H1312=\"pipe\",\"  in\",\"  ft\")","v":"  ft"}]
[null,"Length",null,null,null,"  ft"]
[null,"Width",null,null,null,"  ft"]
[null,"Side Water Depth",null,null,null,"  ft"]
[null,"Center Water Depth",null,null,null,"  ft"]
[null,"Media Depth",null,null,null,"  ft"]
[null,"Underdrain Depth",null,null,null,"  ft"]
[null,"Minimum Water Depth Over Media",null,null,null,"  ft"]
[null,"Average Porosity",null,null,null,"  %"]
[null,"Maximum Volume (each)",null,null,{"$f":"IF(OR(E1312=\"Clearwell\",E1312=\"Transfer Well\"),IF(H1312=\"Circular\",PI()*(E1318/2)^2*(2*E1321+E1322)/3*7.4815,IF(H1312=\"Rectangular\",E1319*E1320*E1321*7.4815,\"\")),\"\")","v":""},"  gal"]
[null,"Maximum Volume (each)",null,null,null,"  gal"]
[null,"Minimum Operating Level",null,null,null,"  ft"]
[null,"Worst Case Volume (each)",null,null,{"$f":"IF(OR(E1312=\"Transfer Well\",E1312=\"Clearwell\"),IF(H1312=\"Circular\",PI()*(E1318/2)^2*(2*E1329+E1322-(E1321-E1329))/3*7.4815,IF(H1312=\"Rectangular\",E1319*E1320*E1329*7.4815,\"\")),\"\")","v":""},"  gal"]
[null,{"$f":"IF(OR(E1312=\"Clearwell\",E1312=\"Transfer Well\"),\"Worst Case Volume (each)\", \"Volume (each)\")","v":"Volume (each)"},null,null,null,"  gal"]
[null,"Percent of Maximum Volume",null,null,{"$f":"IF(H1312=\"Other\",IF(E1328 = 0,\"\",E1331/E1328*100),IF(OR(E1312=\"Clearwell\",E1312=\"Transfer Well\"),IF(E1327 =0,\"\",E1330/E1327*100),\"\"))","v":""},"  %"]
[]
[null,{"$f":" IF(OR(E1312=\"Clearwell\",E1312=\"Transfer Well\"),\"Worst Case Volume (each)\",\"Volume (each)\")","v":"Volume (each)"},null,null,{"$f":"IF(E1312=\"Filter\",IF(H1312=\"Circular\",PI()*(E1318/2)^2*(E1323*E1326/100+E1325+E1324),IF(H1312=\"Rectangular\",E1319*E1320*(E1323*E1326/100+E1325+E1324),\"error\")),IF(AND(E1312=\"Piping\",H1312=\"Pipe\"),PI()*(E1318/12/2)^2*E1319,IF(H1312=\"Circular\",IF(OR(E1312=\"Transfer Well\",E1312=\"Clearwell\"),E1330/7.4815,PI()*(E1318/2)^2*(2*E1321+E1322)/3),IF(H1312=\"Rectangular\",IF(OR(E1312=\"Transfer Well\",E1312=\"Clearwell\"),E1330/7.4815,E1319*E1320*E1321),E1331/7.4815))))*7.4815","v":0},"  gal"]
[null,"Flow Rate (each)",null,null,null,"  gpm"]
[null,"Detention Time",null,null,{"$f":"IF(OR(E1335=\"\",E1335=0),0,E1334/E1335)","v":0},"  min"]
[]
[null,"Baffling Factor",null,null,{"$f":"IF(I1339=\"Unbaffled\",0.1,IF(I1339=\"Poor\",0.3,IF(I1339=\"Average\",0.5,IF(I1339=\"Superior\",0.7,IF(I1339=\"Perfect\",1,IF(I1339=\"\",\" \",I1340))))))","v":0.1}]
[null,null,null,null,null,null,null,"Baffling Characteristics:  ","Unbaffled"]
[null,null,null,null,null,null,null,"Approved Baffling Factor:  "]
[null,"T10",null,null,{"$f":"E1336*E1338","v":0},"  min"]
[]
[null,"Unit - 3",null,"Type:",null,null,"Shape:"]
[]
[null,null,"Further Description:"]
[]
[null,"Characteristic",null,null,null,null,"Comments"]
[null,"Number of Units"]
[null,"Diameter",null,null,null,{"$f":"IF(H1343=\"pipe\",\"  in\",\"  ft\")","v":"  ft"}]
[null,"Length",null,null,null,"  ft"]
[null,"Width",null,null,null,"  ft"]
[null,"Side Water Depth",null,null,null,"  ft"]
[null,"Center Water Depth",null,null,null,"  ft"]
[null,"Media Depth",null,null,null,"  ft"]
[null,"Underdrain Depth",null,null,null,"  ft"]
[null,"Minimum Water Depth Over Media",null,null,null,"  ft"]
[null,"Average Porosity",null,null,null,"  %"]
[null,"Maximum Volume (each)",null,null,{"$f":"IF(OR(E1343=\"Clearwell\",E1343=\"Transfer Well\"),IF(H1343=\"Circular\",PI()*(E1349/2)^2*(2*E1352+E1353)/3*7.4815,IF(H1343=\"Rectangular\",E1350*E1351*E1352*7.4815,\"\")),\"\")","v":""},"  gal"]
[null,"Maximum Volume (each)",null,null,null,"  gal"]
[null,"Minimum Operating Level",null,null,null,"  ft"]
[null,"Worst Case Volume (each)",null,null,{"$f":"IF(OR(E1343=\"Transfer Well\",E1343=\"Clearwell\"),IF(H1343=\"Circular\",PI()*(E1349/2)^2*(2*E1360+E1353-(E1352-E1360))/3*7.4815,IF(H1343=\"Rectangular\",E1350*E1351*E1360*7.4815,\"\")),\"\")","v":""},"  gal"]
[null,{"$f":"IF(OR(E1343=\"Clearwell\",E1343=\"Transfer Well\"),\"Worst Case Volume (each)\", \"Volume (each)\")","v":"Volume (each)"},null,null,null,"  gal"]
[null,"Percent of Maximum Volume",null,null,{"$f":"IF(H1343=\"Other\",IF(E1359 = 0,\"\",E1362/E1359*100),IF(OR(E1343=\"Clearwell\",E1343=\"Transfer Well\"),IF(E1358 = 0,\"\",E1361/E1358*100),\"\"))","v":""},"  %"]
[]
[null,{"$f":" IF(OR(E1343=\"Clearwell\",E1343=\"Transfer Well\"),\"Worst Case Volume (each)\",\"Volume (each)\")","v":"Volume (each)"},null,null,{"$f":"IF(E1343=\"Filter\",IF(H1343=\"Circular\",PI()*(E1349/2)^2*(E1354*E1357/100+E1356+E1355),IF(H1343=\"Rectangular\",E1350*E1351*(E1354*E1357/100+E1356+E1355),\"error\")),IF(AND(E1343=\"Piping\",H1343=\"Pipe\"),PI()*(E1349/12/2)^2*E1350,IF(H1343=\"Circular\",IF(OR(E1343=\"Transfer Well\",E1343=\"Clearwell\"),E1361/7.4815,PI()*(E1349/2)^2*(2*E1352+E1353)/3),IF(H1343=\"Rectangular\",IF(OR(E1343=\"Transfer Well\",E1343=\"Clearwell\"),E1361/7.4815,E1350*E1351*E1352),E1362/7.4815))))*7.4815","v":0},"  gal"]
[null,"Flow Rate (each)",null,null,null,"  gpm"]
[null,"Detention Time",null,null,{"$f":"IF(OR(E1366=\"\",E1366=0),0,E1365/E1366)","v":0},"  min"]
[]
[null,"Baffling Factor",null,null,{"$f":"IF(I1370=\"Unbaffled\",0.1,IF(I1370=\"Poor\",0.3,IF(I1370=\"Average\",0.5,IF(I1370=\"Superior\",0.7,IF(I1370=\"Perfect\",1,IF(I1370=\"\",\" \",I1371))))))","v":0.1}]
[null,null,null,null,null,null,null,"Baffling Characteristics:  ","Unbaffled"]
[null,null,null,null,null,null,null,"Approved Baffling Factor:  "]
[null,"T10",null,null,{"$f":"E1367*E1369","v":0},"  min"]
[]
[null,"Unit - 4",null,"Type:",null,null,"Shape:"]
[]
[null,null,"Further Description:"]
[]
[null,"Characteristic",null,null,null,null,"Comments"]
[null,"Number of Units"]
[null,"Diameter",null,null,null,{"$f":"IF(H1374=\"pipe\",\"  in\",\"  ft\")","v":"  ft"}]
[null,"Length",null,null,null,"  ft"]
[null,"Width",null,null,null,"  ft"]
[null,"Side Water Depth",null,null,null,"  ft"]
[null,"Center Water Depth",null,null,null,"  ft"]
[null,"Media Depth",null,null,null,"  ft"]
[null,"Underdrain Depth",null,null,null,"  ft"]
[null,"Minimum Water Depth Over Media",null,null,null,"  ft"]
[null,"Average Porosity",null,null,null,"  %"]
[null,"Maximum Volume (each)",null,null,{"$f":"IF(OR(E1374=\"Clearwell\",E1374=\"Transfer Well\"),IF(H1374=\"Circular\",PI()*(E1380/2)^2*(2*E1383+E1384)/3*7.4815,IF(H1374=\"Rectangular\",E1381*E1382*E1383*7.4815,\"\")),\"\")","v":""},"  gal"]
[null,"Maximum Volume (each)",null,null,null,"  gal"]
[null,"Minimum Operating Level",null,null,null,"  ft"]
[null,"Worst Case Volume (each)",null,null,{"$f":"IF(OR(E1374=\"Transfer Well\",E1374=\"Clearwell\"),IF(H1374=\"Circular\",PI()*(E1380/2)^2*(2*E1391+E1384-(E1383-E1391))/3*7.4815,IF(H1374=\"Rectangular\",E1381*E1382*E1391*7.4815,\"\")),\"\")","v":""},"  gal"]
[null,{"$f":"IF(OR(E1374=\"Clearwell\",E1374=\"Transfer Well\"),\"Worst Case Volume (each)\", \"Volume (each)\")","v":"Volume (each)"},null,null,null,"  gal"]
[null,"Percent of Maximum Volume",null,null,{"$f":"IF(H1374=\"Other\",IF(E1390 = 0,\"\",E1393/E1390*100),IF(OR(E1374=\"Clearwell\",E1374=\"Transfer Well\"),IF(E1389 = 0,\"\",E1392/E1389*100),\"\"))","v":""},"  %"]
[]
[null,{"$f":" IF(OR(E1374=\"Clearwell\",E1374=\"Transfer Well\"),\"Worst Case Volume (each)\",\"Volume (each)\")","v":"Volume (each)"},null,null,{"$f":"IF(E1374=\"Filter\",IF(H1374=\"Circular\",PI()*(E1380/2)^2*(E1385*E1388/100+E1387+E1386),IF(H1374=\"Rectangular\",E1381*E1382*(E1385*E1388/100+E1387+E1386),\"error\")),IF(AND(E1374=\"Piping\",H1374=\"Pipe\"),PI()*(E1380/12/2)^2*E1381,IF(H1374=\"Circular\",IF(OR(E1374=\"Transfer Well\",E1374=\"Clearwell\"),E1392/7.4815,PI()*(E1380/2)^2*(2*E1383+E1384)/3),IF(H1374=\"Rectangular\",IF(OR(E1374=\"Transfer Well\",E1374=\"Clearwell\"),E1392/7.4815,E1381*E1382*E1383),E1393/7.4815))))*7.4815","v":0},"  gal"]
[null,"Flow Rate (each)",null,null,null,"  gpm"]
[null,"Detention Time",null,null,{"$f":"IF(OR(E1397=\"\",E1397=0),0,E1396/E1397)","v":0},"  min"]
[]
[null,"Baffling Factor",null,null,{"$f":"IF(I1401=\"Unbaffled\",0.1,IF(I1401=\"Poor\",0.3,IF(I1401=\"Average\",0.5,IF(I1401=\"Superior\",0.7,IF(I1401=\"Perfect\",1,IF(I1401=\"\",\" \",I1402))))))","v":0.1}]
[null,null,null,null,null,null,null,"Baffling Characteristics:  ","Unbaffled"]
[null,null,null,null,null,null,null,"Approved Baffling Factor:  "]
[null,"T10",null,null,{"$f":"E1398*E1400","v":0},"  min"]
[]
[null,"Unit - 5",null,"Type:",null,null,"Shape:"]
[]
[null,null,"Further Description:"]
[]
[null,"Characteristic",null,null,null,null,"Comments"]
[null,"Number of Units"]
[null,"Diameter",null,null,null,{"$f":"IF(H1405=\"pipe\",\"  in\",\"  ft\")","v":"  ft"}]
[null,"Length",null,null,null,"  ft"]
[null,"Width",null,null,null,"  ft"]
[null,"Side Water Depth",null,null,null,"  ft"]
[null,"Center Water Depth",null,null,null,"  ft"]
[null,"Media Depth",null,null,null,"  ft"]
[null,"Underdrain Depth",null,null,null,"  ft"]
[null,"Minimum Water Depth Over Media",null,null,null,"  ft"]
[null,"Average Porosity",null,null,null,"  %"]
[null,"Maximum Volume (each)",null,null,{"$f":"IF(OR(E1405=\"Clearwell\",E1405=\"Transfer Well\"),IF(H1405=\"Circular\",PI()*(E1411/2)^2*(2*E1414+E1415)/3*7.4815,IF(H1405=\"Rectangular\",E1412*E1413*E1414*7.4815,\"\")),\"\")","v":""},"  gal"]
[null,"Maximum Volume (each)",null,null,null,"  gal"]
[null,"Minimum Operating Level",null,null,null,"  ft"]
[null,"Worst Case Volume (each)",null,null,{"$f":"IF(OR(E1405=\"Transfer Well\",E1405=\"Clearwell\"),IF(H1405=\"Circular\",PI()*(E1411/2)^2*(2*E1422+E1415-(E1414-E1422))/3*7.4815,IF(H1405=\"Rectangular\",E1412*E1413*E1422*7.4815,\"\")),\"\")","v":""},"  gal"]
[null,{"$f":"IF(OR(E1405=\"Clearwell\",E1405=\"Transfer Well\"),\"Worst Case Volume (each)\", \"Volume (each)\")","v":"Volume (each)"},null,null,null,"  gal"]
[null,"Percent of Maximum Volume",null,null,{"$f":"IF(H1405=\"Other\",IF(E1421 = 0,\"\",E1424/E1421*100),IF(OR(E1405=\"Clearwell\",E1405=\"Transfer Well\"),IF(E1420 = 0,\"\",E1423/E1420*100),\"\"))","v":""},"  %"]
[]
[null,{"$f":" IF(OR(E1405=\"Clearwell\",E1405=\"Transfer Well\"),\"Worst Case Volume (each)\",\"Volume (each)\")","v":"Volume (each)"},null,null,{"$f":"IF(E1405=\"Filter\",IF(H1405=\"Circular\",PI()*(E1411/2)^2*(E1416*E1419/100+E1418+E1417),IF(H1405=\"Rectangular\",E1412*E1413*(E1416*E1419/100+E1418+E1417),\"error\")),IF(AND(E1405=\"Piping\",H1405=\"Pipe\"),PI()*(E1411/12/2)^2*E1412,IF(H1405=\"Circular\",IF(OR(E1405=\"Transfer Well\",E1405=\"Clearwell\"),E1423/7.4815,PI()*(E1411/2)^2*(2*E1414+E1415)/3),IF(H1405=\"Rectangular\",IF(OR(E1405=\"Transfer Well\",E1405=\"Clearwell\"),E1423/7.4815,E1412*E1413*E1414),E1424/7.4815))))*7.4815","v":0},"  gal"]
[null,"Flow Rate (each)",null,null,null,"  gpm"]
[null,"Detention Time",null,null,{"$f":"IF(OR(E1428=\"\",E1428=0),0,E1427/E1428)","v":0},"  min"]
[]
[null,"Baffling Factor",null,null,{"$f":"IF(I1432=\"Unbaffled\",0.1,IF(I1432=\"Poor\",0.3,IF(I1432=\"Average\",0.5,IF(I1432=\"Superior\",0.7,IF(I1432=\"Perfect\",1,IF(I1432=\"\",\" \",I1433))))))","v":0.1}]
[null,null,null,null,null,null,null,"Baffling Characteristics:  ","Unbaffled"]
[null,null,null,null,null,null,null,"Approved Baffling Factor:  "]
[null,"T10",null,null,{"$f":"E1429*E1431","v":0},"  min"]
[]
[null,"Unit - 6",null,"Type:",null,null,"Shape:"]
[]
[null,null,"Further Description:"]
[]
[null,"Characteristic",null,null,null,null,"Comments"]
[null,"Number of Units"]
[null,"Diameter",null,null,null,{"$f":"IF(H1436=\"pipe\",\"  in\",\"  ft\")","v":"  ft"}]
[null,"Length",null,null,null,"  ft"]
[null,"Width",null,null,null,"  ft"]
[null,"Side Water Depth",null,null,null,"  ft"]
[null,"Center Water Depth",null,null,null,"  ft"]
[null,"Media Depth",null,null,null,"  ft"]
[null,"Underdrain Depth",null,null,null,"  ft"]
[null,"Minimum Water Depth Over Media",null,null,null,"  ft"]
[null,"Average Porosity",null,null,null,"  %"]
[null,"Maximum Volume (each)",null,null,{"$f":"IF(OR(E1436=\"Clearwell\",E1436=\"Transfer Well\"),IF(H1436=\"Circular\",PI()*(E1442/2)^2*(2*E1445+E1446)/3*7.4815,IF(H1436=\"Rectangular\",E1443*E1444*E1445*7.4815,\"\")),\"\")","v":""},"  gal"]
[null,"Maximum Volume (each)",null,null,null,"  gal"]
[null,"Minimum Operating Level",null,null,null,"  ft"]
[null,"Worst Case Volume (each)",null,null,{"$f":"IF(OR(E1436=\"Transfer Well\",E1436=\"Clearwell\"),IF(H1436=\"Circular\",PI()*(E1442/2)^2*(2*E1453+E1446-(E1445-E1453))/3*7.4815,IF(H1436=\"Rectangular\",E1443*E1444*E1453*7.4815,\"\")),\"\")","v":""},"  gal"]
[null,{"$f":"IF(OR(E1436=\"Clearwell\",E1436=\"Transfer Well\"),\"Worst Case Volume (each)\", \"Volume (each)\")","v":"Volume (each)"},null,null,null,"  gal"]
[null,"Percent of Maximum Volume",null,null,{"$f":"IF(H1436=\"Other\",IF(E1452 = 0,\"\",E1455/E1452*100),IF(OR(E1436=\"Clearwell\",E1436=\"Transfer Well\"),IF(E1451 = 0,\"\",E1454/E1451*100),\"\"))","v":""},"  %"]
[]
[null,{"$f":" IF(OR(E1436=\"Clearwell\",E1436=\"Transfer Well\"),\"Worst Case Volume (each)\",\"Volume (each)\")","v":"Volume (each)"},null,null,{"$f":"IF(E1436=\"Filter\",IF(H1436=\"Circular\",PI()*(E1442/2)^2*(E1447*E1450/100+E1449+E1448),IF(H1436=\"Rectangular\",E1443*E1444*(E1447*E1450/100+E1449+E1448),\"error\")),IF(AND(E1436=\"Piping\",H1436=\"Pipe\"),PI()*(E1442/12/2)^2*E1443,IF(H1436=\"Circular\",IF(OR(E1436=\"Transfer Well\",E1436=\"Clearwell\"),E1454/7.4815,PI()*(E1442/2)^2*(2*E1445+E1446)/3),IF(H1436=\"Rectangular\",IF(OR(E1436=\"Transfer Well\",E1436=\"Clearwell\"),E1454/7.4815,E1443*E1444*E1445),E1455/7.4815))))*7.4815","v":0},"  gal"]
[null,"Flow Rate (each)",null,null,null,"  gpm"]
[null,"Detention Time",null,null,{"$f":"IF(OR(E1459=\"\",E1459=0),0,E1458/E1459)","v":0},"  min"]
[]
[null,"Baffling Factor",null,null,{"$f":"IF(I1463=\"Unbaffled\",0.1,IF(I1463=\"Poor\",0.3,IF(I1463=\"Average\",0.5,IF(I1463=\"Superior\",0.7,IF(I1463=\"Perfect\",1,IF(I1463=\"\",\" \",I1464))))))","v":0.1}]
[null,null,null,null,null,null,null,"Baffling Characteristics:  ","Unbaffled"]
[null,null,null,null,null,null,null,"Approved Baffling Factor:  "]
[null,"T10",null,null,{"$f":"E1460*E1462","v":0},"  min"]
[]
[null,"Unit - 7",null,"Type:",null,null,"Shape:"]
[]
[null,null,"Further Description:"]
[]
[null,"Characteristic",null,null,null,null,"Comments"]
[null,"Number of Units"]
[null,"Diameter",null,null,null,{"$f":"IF(H1467=\"pipe\",\"  in\",\"  ft\")","v":"  ft"}]
[null,"Length",null,null,null,"  ft"]
[null,"Width",null,null,null,"  ft"]
[null,"Side Water Depth",null,null,null,"  ft"]
[null,"Center Water Depth",null,null,null,"  ft"]
[null,"Media Depth",null,null,null,"  ft"]
[null,"Underdrain Depth",null,null,null,"  ft"]
[null,"Minimum Water Depth Over Media",null,null,null,"  ft"]
[null,"Average Porosity",null,null,null,"  %"]
[null,"Maximum Volume (each)",null,null,{"$f":"IF(OR(E1467=\"Clearwell\",E1467=\"Transfer Well\"),IF(H1467=\"Circular\",PI()*(E1473/2)^2*(2*E1476+E1477)/3*7.4815,IF(H1467=\"Rectangular\",E1474*E1475*E1476*7.4815,\"\")),\"\")","v":""},"  gal"]
[null,"Maximum Volume (each)",null,null,null,"  gal"]
[null,"Minimum Operating Level",null,null,null,"  ft"]
[null,"Worst Case Volume (each)",null,null,{"$f":"IF(OR(E1467=\"Transfer Well\",E1467=\"Clearwell\"),IF(H1467=\"Circular\",PI()*(E1473/2)^2*(2*E1484+E1477-(E1476-E1484))/3*7.4815,IF(H1467=\"Rectangular\",E1474*E1475*E1484*7.4815,\"\")),\"\")","v":""},"  gal"]
[null,{"$f":"IF(OR(E1467=\"Clearwell\",E1467=\"Transfer Well\"),\"Worst Case Volume (each)\", \"Volume (each)\")","v":"Volume (each)"},null,null,null,"  gal"]
[null,"Percent of Maximum Volume",null,null,{"$f":"IF(H1467=\"Other\",IF(E1483 = 0,\"\",E1486/E1483*100),IF(OR(E1467=\"Clearwell\",E1467=\"Transfer Well\"),IF(E1482 = 0,\"\",E1485/E1482*100),\"\"))","v":""},"  %"]
[]
[null,{"$f":" IF(OR(E1467=\"Clearwell\",E1467=\"Transfer Well\"),\"Worst Case Volume (each)\",\"Volume (each)\")","v":"Volume (each)"},null,null,{"$f":"IF(E1467=\"Filter\",IF(H1467=\"Circular\",PI()*(E1473/2)^2*(E1478*E1481/100+E1480+E1479),IF(H1467=\"Rectangular\",E1474*E1475*(E1478*E1481/100+E1480+E1479),\"error\")),IF(AND(E1467=\"Piping\",H1467=\"Pipe\"),PI()*(E1473/12/2)^2*E1474,IF(H1467=\"Circular\",IF(OR(E1467=\"Transfer Well\",E1467=\"Clearwell\"),E1485/7.4815,PI()*(E1473/2)^2*(2*E1476+E1477)/3),IF(H1467=\"Rectangular\",IF(OR(E1467=\"Transfer Well\",E1467=\"Clearwell\"),E1485/7.4815,E1474*E1475*E1476),E1486/7.4815))))*7.4815","v":0},"  gal"]
[null,"Flow Rate (each)",null,null,null,"  gpm"]
[null,"Detention Time",null,null,{"$f":"IF(OR(E1490=\"\",E1490=0),0,E1489/E1490)","v":0},"  min"]
[]
[null,"Baffling Factor",null,null,{"$f":"IF(I1494=\"Unbaffled\",0.1,IF(I1494=\"Poor\",0.3,IF(I1494=\"Average\",0.5,IF(I1494=\"Superior\",0.7,IF(I1494=\"Perfect\",1,IF(I1494=\"\",\" \",I1495))))))","v":0.1}]
[null,null,null,null,null,null,null,"Baffling Characteristics:  ","Unbaffled"]
[null,null,null,null,null,null,null,"Approved Baffling Factor:  "]
[null,"T10",null,null,{"$f":"E1491*E1493","v":0},"  min"]
[]
[null,"Unit - 8",null,"Type:",null,null,"Shape:"]
[]
[null,null,"Further Description:"]
[]
[null,"Characteristic",null,null,null,null,"Comments"]
[null,"Number of Units"]
[null,"Diameter",null,null,null,{"$f":"IF(H1498=\"pipe\",\"  in\",\"  ft\")","v":"  ft"}]
[null,"Length",null,null,null,"  ft"]
[null,"Width",null,null,null,"  ft"]
[null,"Side Water Depth",null,null,null,"  ft"]
[null,"Center Water Depth",null,null,null,"  ft"]
[null,"Media Depth",null,null,null,"  ft"]
[null,"Underdrain Depth",null,null,null,"  ft"]
[null,"Minimum Water Depth Over Media",null,null,null,"  ft"]
[null,"Average Porosity",null,null,null,"  %"]
[null,"Maximum Volume (each)",null,null,{"$f":"IF(OR(E1498=\"Clearwell\",E1498=\"Transfer Well\"),IF(H1498=\"Circular\",PI()*(E1504/2)^2*(2*E1507+E1508)/3*7.4815,IF(H1498=\"Rectangular\",E1505*E1506*E1507*7.4815,\"\")),\"\")","v":""},"  gal"]
[null,"Maximum Volume (each)",null,null,null,"  gal"]
[null,"Minimum Operating Level",null,null,null,"  ft"]
[null,"Worst Case Volume (each)",null,null,{"$f":"IF(OR(E1498=\"Transfer Well\",E1498=\"Clearwell\"),IF(H1498=\"Circular\",PI()*(E1504/2)^2*(2*E1515+E1508-(E1507-E1515))/3*7.4815,IF(H1498=\"Rectangular\",E1505*E1506*E1515*7.4815,\"\")),\"\")","v":""},"  gal"]
[null,{"$f":"IF(OR(E1498=\"Clearwell\",E1498=\"Transfer Well\"),\"Worst Case Volume (each)\", \"Volume (each)\")","v":"Volume (each)"},null,null,null,"  gal"]
[null,"Percent of Maximum Volume",null,null,{"$f":"IF(H1498=\"Other\",IF(E1514 = 0,\"\",E1517/E1514*100),IF(OR(E1498=\"Clearwell\",E1498=\"Transfer Well\"),IF(E1513 = 0,\"\",E1516/E1513*100),\"\"))","v":""},"  %"]
[]
[null,{"$f":" IF(OR(E1498=\"Clearwell\",E1498=\"Transfer Well\"),\"Worst Case Volume (each)\",\"Volume (each)\")","v":"Volume (each)"},null,null,{"$f":"IF(E1498=\"Filter\",IF(H1498=\"Circular\",PI()*(E1504/2)^2*(E1509*E1512/100+E1511+E1510),IF(H1498=\"Rectangular\",E1505*E1506*(E1509*E1512/100+E1511+E1510),\"error\")),IF(AND(E1498=\"Piping\",H1498=\"Pipe\"),PI()*(E1504/12/2)^2*E1505,IF(H1498=\"Circular\",IF(OR(E1498=\"Transfer Well\",E1498=\"Clearwell\"),E1516/7.4815,PI()*(E1504/2)^2*(2*E1507+E1508)/3),IF(H1498=\"Rectangular\",IF(OR(E1498=\"Transfer Well\",E1498=\"Clearwell\"),E1516/7.4815,E1505*E1506*E1507),E1517/7.4815))))*7.4815","v":0},"  gal"]
[null,"Flow Rate (each)",null,null,null,"  gpm"]
[null,"Detention Time",null,null,{"$f":"IF(OR(E1521=\"\",E1521=0),0,E1520/E1521)","v":0},"  min"]
[]
[null,"Baffling Factor",null,null,{"$f":"IF(I1525=\"Unbaffled\",0.1,IF(I1525=\"Poor\",0.3,IF(I1525=\"Average\",0.5,IF(I1525=\"Superior\",0.7,IF(I1525=\"Perfect\",1,IF(I1525=\"\",\" \",I1526))))))","v":0.1}]
[null,null,null,null,null,null,null,"Baffling Characteristics:  ","Unbaffled"]
[null,null,null,null,null,null,null,"Approved Baffling Factor:  "]
[null,"T10",null,null,{"$f":"E1522*E1524","v":0},"  min"]
[]
[null,"Unit - 9",null,"Type:",null,null,"Shape:"]
[]
[null,null,"Further Description:"]
[]
[null,"Characteristic",null,null,null,null,"Comments"]
[null,"Number of Units"]
[null,"Diameter",null,null,null,{"$f":"IF(H1529=\"pipe\",\"  in\",\"  ft\")","v":"  ft"}]
[null,"Length",null,null,null,"  ft"]
[null,"Width",null,null,null,"  ft"]
[null,"Side Water Depth",null,null,null,"  ft"]
[null,"Center Water Depth",null,null,null,"  ft"]
[null,"Media Depth",null,null,null,"  ft"]
[null,"Underdrain Depth",null,null,null,"  ft"]
[null,"Minimum Water Depth Over Media",null,null,null,"  ft"]
[null,"Average Porosity",null,null,null,"  %"]
[null,"Maximum Volume (each)",null,null,{"$f":"IF(OR(E1529=\"Clearwell\",E1529=\"Transfer Well\"),IF(H1529=\"Circular\",PI()*(E1535/2)^2*(2*E1538+E1539)/3*7.4815,IF(H1529=\"Rectangular\",E1536*E1537*E1538*7.4815,\"\")),\"\")","v":""},"  gal"]
[null,"Maximum Volume (each)",null,null,null,"  gal"]
[null,"Minimum Operating Level",null,null,null,"  ft"]
[null,"Worst Case Volume (each)",null,null,{"$f":"IF(OR(E1529=\"Transfer Well\",E1529=\"Clearwell\"),IF(H1529=\"Circular\",PI()*(E1535/2)^2*(2*E1546+E1539-(E1538-E1546))/3*7.4815,IF(H1529=\"Rectangular\",E1536*E1537*E1546*7.4815,\"\")),\"\")","v":""},"  gal"]
[null,{"$f":"IF(OR(E1529=\"Clearwell\",E1529=\"Transfer Well\"),\"Worst Case Volume (each)\", \"Volume (each)\")","v":"Volume (each)"},null,null,null,"  gal"]
[null,"Percent of Maximum Volume",null,null,{"$f":"IF(H1529=\"Other\",IF(E1545 = 0,\"\",E1548/E1545*100),IF(OR(E1529=\"Clearwell\",E1529=\"Transfer Well\"),IF(E1544 = 0,\"\",E1547/E1544*100),\"\"))","v":""},"  %"]
[]
[null,{"$f":" IF(OR(E1529=\"Clearwell\",E1529=\"Transfer Well\"),\"Worst Case Volume (each)\",\"Volume (each)\")","v":"Volume (each)"},null,null,{"$f":"IF(E1529=\"Filter\",IF(H1529=\"Circular\",PI()*(E1535/2)^2*(E1540*E1543/100+E1542+E1541),IF(H1529=\"Rectangular\",E1536*E1537*(E1540*E1543/100+E1542+E1541),\"error\")),IF(AND(E1529=\"Piping\",H1529=\"Pipe\"),PI()*(E1535/12/2)^2*E1536,IF(H1529=\"Circular\",IF(OR(E1529=\"Transfer Well\",E1529=\"Clearwell\"),E1547/7.4815,PI()*(E1535/2)^2*(2*E1538+E1539)/3),IF(H1529=\"Rectangular\",IF(OR(E1529=\"Transfer Well\",E1529=\"Clearwell\"),E1547/7.4815,E1536*E1537*E1538),E1548/7.4815))))*7.4815","v":0},"  gal"]
[null,"Flow Rate (each)",null,null,null,"  gpm"]
[null,"Detention Time",null,null,{"$f":"IF(OR(E1552=\"\",E1552=0),0,E1551/E1552)","v":0},"  min"]
[]
[null,"Baffling Factor",null,null,{"$f":"IF(I1556=\"Unbaffled\",0.1,IF(I1556=\"Poor\",0.3,IF(I1556=\"Average\",0.5,IF(I1556=\"Superior\",0.7,IF(I1556=\"Perfect\",1,IF(I1556=\"\",\" \",I1557))))))","v":0.1}]
[null,null,null,null,null,null,null,"Baffling Characteristics:  ","Unbaffled"]
[null,null,null,null,null,null,null,"Approved Baffling Factor:  "]
[null,"T10",null,null,{"$f":"E1553*E1555","v":0},"  min"]
[]
[null,"Unit - 10",null,"Type:",null,null,"Shape:"]
[]
[null,null,"Further Description:"]
[]
[null,"Characteristic",null,null,null,null,"Comments"]
[null,"Number of Units"]
[null,"Diameter",null,null,null,{"$f":"IF(H1560=\"pipe\",\"  in\",\"  ft\")","v":"  ft"}]
[null,"Length",null,null,null,"  ft"]
[null,"Width",null,null,null,"  ft"]
[null,"Side Water Depth",null,null,null,"  ft"]
[null,"Center Water Depth",null,null,null,"  ft"]
[null,"Media Depth",null,null,null,"  ft"]
[null,"Underdrain Depth",null,null,null,"  ft"]
[null,"Minimum Water Depth Over Media",null,null,null,"  ft"]
[null,"Average Porosity",null,null,null,"  %"]
[null,"Maximum Volume (each)",null,null,{"$f":"IF(OR(E1560=\"Clearwell\",E1560=\"Transfer Well\"),IF(H1560=\"Circular\",PI()*(E1566/2)^2*(2*E1569+E1570)/3*7.4815,IF(H1560=\"Rectangular\",E1567*E1568*E1569*7.4815,\"\")),\"\")","v":""},"  gal"]
[null,"Maximum Volume (each)",null,null,null,"  gal"]
[null,"Minimum Operating Level",null,null,null,"  ft"]
[null,"Worst Case Volume (each)",null,null,{"$f":"IF(OR(E1560=\"Transfer Well\",E1560=\"Clearwell\"),IF(H1560=\"Circular\",PI()*(E1566/2)^2*(2*E1577+E1570-(E1569-E1577))/3*7.4815,IF(H1560=\"Rectangular\",E1567*E1568*E1577*7.4815,\"\")),\"\")","v":""},"  gal"]
[null,{"$f":"IF(OR(E1560=\"Clearwell\",E1560=\"Transfer Well\"),\"Worst Case Volume (each)\", \"Volume (each)\")","v":"Volume (each)"},null,null,null,"  gal"]
[null,"Percent of Maximum Volume",null,null,{"$f":"IF(H1560=\"Other\",IF(E1576 = 0,\"\",E1579/E1576*100),IF(OR(E1560=\"Clearwell\",E1560=\"Transfer Well\"),IF(E1575 =0,\"\",E1578/E1575*100),\"\"))","v":""},"  %"]
[]
[null,{"$f":" IF(OR(E1560=\"Clearwell\",E1560=\"Transfer Well\"),\"Worst Case Volume (each)\",\"Volume (each)\")","v":"Volume (each)"},null,null,{"$f":"IF(E1560=\"Filter\",IF(H1560=\"Circular\",PI()*(E1566/2)^2*(E1571*E1574/100+E1573+E1572),IF(H1560=\"Rectangular\",E1567*E1568*(E1571*E1574/100+E1573+E1572),\"error\")),IF(AND(E1560=\"Piping\",H1560=\"Pipe\"),PI()*(E1566/12/2)^2*E1567,IF(H1560=\"Circular\",IF(OR(E1560=\"Transfer Well\",E1560=\"Clearwell\"),E1578/7.4815,PI()*(E1566/2)^2*(2*E1569+E1570)/3),IF(H1560=\"Rectangular\",IF(OR(E1560=\"Transfer Well\",E1560=\"Clearwell\"),E1578/7.4815,E1567*E1568*E1569),E1579/7.4815))))*7.4815","v":0},"  gal"]
[null,"Flow Rate (each)",null,null,null,"  gpm"]
[null,"Detention Time",null,null,{"$f":"IF(OR(E1583=\"\",E1583=0),0,E1582/E1583)","v":0},"  min"]
[]
[null,"Baffling Factor",null,null,{"$f":"IF(I1587=\"Unbaffled\",0.1,IF(I1587=\"Poor\",0.3,IF(I1587=\"Average\",0.5,IF(I1587=\"Superior\",0.7,IF(I1587=\"Perfect\",1,IF(I1587=\"\",\" \",I1588))))))","v":0.1}]
[null,null,null,null,null,null,null,"Baffling Characteristics:  ","Unbaffled"]
[null,null,null,null,null,null,null,"Approved Baffling Factor:  "]
[null,"T10",null,null,{"$f":"E1584*E1586","v":0},"  min"]
[]
[null,{"$f":"CONCATENATE(D1279,\" FLOW RATE\")","v":"D5 FLOW RATE"},null,null,{"$f":"MaxUnitFlow(E1310,E1341,E1372,E1403,E1434,E1465,E1496,E1527,E1558,E1589,E1304,E1335,E1366,E1397,E1428,E1459,E1490,E1521,E1552,E1583)*60*24/10^6","v":0},"  mgd"]
[]
[null,{"$f":"CONCATENATE(\"T10 SUM FOR \",D1279)","v":"T10 SUM FOR D5"},null,null,{"$f":"SUM(E1310,E1341,E1372,E1403,E1434,E1465,E1496,E1527,E1558,E1589)","v":0},"  min"]
[]
["Disinfection Zone:",null,null,{"$f":"CONCATENATE(\"D\",Calculator!$BI$6)","v":"D6"},null,"Disinfectant:"]
[]
[null,"Unit - 1",null,"Type:",null,null,"Shape:"]
[]
[null,null,"Further Description:"]
[]
[null,"Characteristic",null,null,null,null,"Comments"]
[null,"Number of Units"]
[null,"Diameter",null,null,null,{"$f":"IF(H1597=\"pipe\",\"  in\",\"  ft\")","v":"  ft"}]
[null,"Length",null,null,null,"  ft"]
[null,"Width",null,null,null,"  ft"]
[null,"Side Water Depth",null,null,null,"  ft"]
[null,"Center Water Depth",null,null,null,"  ft"]
[null,"Media Depth",null,null,null,"  ft"]
[null,"Underdrain Depth",null,null,null,"  ft"]
[null,"Minimum Water Depth Over Media",null,null,null,"  ft"]
[null,"Average Porosity",null,null,null,"  %"]
[null,"Maximum Volume (each)",null,null,{"$f":"IF(OR(E1597=\"Clearwell\",E1597=\"Transfer Well\"),IF(H1597=\"Circular\",PI()*(E1603/2)^2*(2*E1606+E1607)/3*7.4815,IF(H1597=\"Rectangular\",E1604*E1605*E1606*7.4815,\"\")),\"\")","v":""},"  gal"]
[null,"Maximum Volume (each)",null,null,null,"  gal"]
[null,"Minimum Operating Level",null,null,null,"  ft"]
[null,"Worst Case Volume (each)",null,null,{"$f":"IF(OR(E1597=\"Transfer Well\",E1597=\"Clearwell\"),IF(H1597=\"Circular\",PI()*(E1603/2)^2*(2*E1614+E1607-(E1606-E1614))/3*7.4815,IF(H1597=\"Rectangular\",E1604*E1605*E1614*7.4815,\"\")),\"\")","v":""},"  gal"]
[null,{"$f":"IF(OR(E1597=\"Clearwell\",E1597=\"Transfer Well\"),\"Worst Case Volume (each)\", \"Volume (each)\")","v":"Volume (each)"},null,null,null,"  gal"]
[null,"Percent of Maximum Volume",null,null,{"$f":"IF(H1597=\"Other\",IF(E1613 = 0,\"\",E1616/E1613*100),IF(OR(E1597=\"Clearwell\",E1597=\"Transfer Well\"),IF(E1612 = 0,\"\",E1615/E1612*100),\"\"))","v":""},"  %"]
[]
[null,{"$f":" IF(OR(E1597=\"Clearwell\",E1597=\"Transfer Well\"),\"Worst Case Volume (each)\",\"Volume (each)\")","v":"Volume (each)"},null,null,{"$f":"IF(E1597=\"Filter\",IF(H1597=\"Circular\",PI()*(E1603/2)^2*(E1608*E1611/100+E1610+E1609),IF(H1597=\"Rectangular\",E1604*E1605*(E1608*E1611/100+E1610+E1609),\"error\")),IF(AND(E1597=\"Piping\",H1597=\"Pipe\"),PI()*(E1603/12/2)^2*E1604,IF(H1597=\"Circular\",IF(OR(E1597=\"Transfer Well\",E1597=\"Clearwell\"),E1615/7.4815,PI()*(E1603/2)^2*(2*E1606+E1607)/3),IF(H1597=\"Rectangular\",IF(OR(E1597=\"Transfer Well\",E1597=\"Clearwell\"),E1615/7.4815,E1604*E1605*E1606),E1616/7.4815))))*7.4815","v":0},"  gal"]
[null,"Flow Rate (each)",null,null,null,"  gpm"]
[null,"Detention Time",null,null,{"$f":"IF(OR(E1620=\"\",E1620=0),0,E1619/E1620)","v":0},"  min"]
[]
[null,"Baffling Factor",null,null,{"$f":"IF(I1624=\"Unbaffled\",0.1,IF(I1624=\"Poor\",0.3,IF(I1624=\"Average\",0.5,IF(I1624=\"Superior\",0.7,IF(I1624=\"Perfect\",1,IF(I1624=\"\",\" \",I1625))))))","v":0.1}]
[null,null,null,null,null,null,null,"Baffling Characteristics:  ","Unbaffled"]
[null,null,null,null,null,null,null,"Approved Baffling Factor:  "]
[null,"T10",null,null,{"$f":"E1621*E1623","v":0},"  min"]
[]
[null,"Unit - 2",null,"Type:",null,null,"Shape:"]
[]
[null,null,"Further Description:"]
[]
[null,"Characteristic",null,null,null,null,"Comments"]
[null,"Number of Units"]
[null,"Diameter",null,null,null,{"$f":"IF(H1628=\"pipe\",\"  in\",\"  ft\")","v":"  ft"}]
[null,"Length",null,null,null,"  ft"]
[null,"Width",null,null,null,"  ft"]
[null,"Side Water Depth",null,null,null,"  ft"]
[null,"Center Water Depth",null,null,null,"  ft"]
[null,"Media Depth",null,null,null,"  ft"]
[null,"Underdrain Depth",null,null,null,"  ft"]
[null,"Minimum Water Depth Over Media",null,null,null,"  ft"]
[null,"Average Porosity",null,null,null,"  %"]
[null,"Maximum Volume (each)",null,null,{"$f":"IF(OR(E1628=\"Clearwell\",E1628=\"Transfer Well\"),IF(H1628=\"Circular\",PI()*(E1634/2)^2*(2*E1637+E1638)/3*7.4815,IF(H1628=\"Rectangular\",E1635*E1636*E1637*7.4815,\"\")),\"\")","v":""},"  gal"]
[null,"Maximum Volume (each)",null,null,null,"  gal"]
[null,"Minimum Operating Level",null,null,null,"  ft"]
[null,"Worst Case Volume (each)",null,null,{"$f":"IF(OR(E1628=\"Transfer Well\",E1628=\"Clearwell\"),IF(H1628=\"Circular\",PI()*(E1634/2)^2*(2*E1645+E1638-(E1637-E1645))/3*7.4815,IF(H1628=\"Rectangular\",E1635*E1636*E1645*7.4815,\"\")),\"\")","v":""},"  gal"]
[null,{"$f":"IF(OR(E1628=\"Clearwell\",E1628=\"Transfer Well\"),\"Worst Case Volume (each)\", \"Volume (each)\")","v":"Volume (each)"},null,null,null,"  gal"]
[null,"Percent of Maximum Volume",null,null,{"$f":"IF(H1628=\"Other\",IF(E1644 = 0,\"\",E1647/E1644*100),IF(OR(E1628=\"Clearwell\",E1628=\"Transfer Well\"),IF(E1643 =0,\"\",E1646/E1643*100),\"\"))","v":""},"  %"]
[]
[null,{"$f":" IF(OR(E1628=\"Clearwell\",E1628=\"Transfer Well\"),\"Worst Case Volume (each)\",\"Volume (each)\")","v":"Volume (each)"},null,null,{"$f":"IF(E1628=\"Filter\",IF(H1628=\"Circular\",PI()*(E1634/2)^2*(E1639*E1642/100+E1641+E1640),IF(H1628=\"Rectangular\",E1635*E1636*(E1639*E1642/100+E1641+E1640),\"error\")),IF(AND(E1628=\"Piping\",H1628=\"Pipe\"),PI()*(E1634/12/2)^2*E1635,IF(H1628=\"Circular\",IF(OR(E1628=\"Transfer Well\",E1628=\"Clearwell\"),E1646/7.4815,PI()*(E1634/2)^2*(2*E1637+E1638)/3),IF(H1628=\"Rectangular\",IF(OR(E1628=\"Transfer Well\",E1628=\"Clearwell\"),E1646/7.4815,E1635*E1636*E1637),E1647/7.4815))))*7.4815","v":0},"  gal"]
[null,"Flow Rate (each)",null,null,null,"  gpm"]
[null,"Detention Time",null,null,{"$f":"IF(OR(E1651=\"\",E1651=0),0,E1650/E1651)","v":0},"  min"]
[]
[null,"Baffling Factor",null,null,{"$f":"IF(I1655=\"Unbaffled\",0.1,IF(I1655=\"Poor\",0.3,IF(I1655=\"Average\",0.5,IF(I1655=\"Superior\",0.7,IF(I1655=\"Perfect\",1,IF(I1655=\"\",\" \",I1656))))))","v":0.1}]
[null,null,null,null,null,null,null,"Baffling Characteristics:  ","Unbaffled"]
[null,null,null,null,null,null,null,"Approved Baffling Factor:  "]
[null,"T10",null,null,{"$f":"E1652*E1654","v":0},"  min"]
[]
[null,"Unit - 3",null,"Type:",null,null,"Shape:"]
[]
[null,null,"Further Description:"]
[]
[null,"Characteristic",null,null,null,null,"Comments"]
[null,"Number of Units"]
[null,"Diameter",null,null,null,{"$f":"IF(H1659=\"pipe\",\"  in\",\"  ft\")","v":"  ft"}]
[null,"Length",null,null,null,"  ft"]
[null,"Width",null,null,null,"  ft"]
[null,"Side Water Depth",null,null,null,"  ft"]
[null,"Center Water Depth",null,null,null,"  ft"]
[null,"Media Depth",null,null,null,"  ft"]
[null,"Underdrain Depth",null,null,null,"  ft"]
[null,"Minimum Water Depth Over Media",null,null,null,"  ft"]
[null,"Average Porosity",null,null,null,"  %"]
[null,"Maximum Volume (each)",null,null,{"$f":"IF(OR(E1659=\"Clearwell\",E1659=\"Transfer Well\"),IF(H1659=\"Circular\",PI()*(E1665/2)^2*(2*E1668+E1669)/3*7.4815,IF(H1659=\"Rectangular\",E1666*E1667*E1668*7.4815,\"\")),\"\")","v":""},"  gal"]
[null,"Maximum Volume (each)",null,null,null,"  gal"]
[null,"Minimum Operating Level",null,null,null,"  ft"]
[null,"Worst Case Volume (each)",null,null,{"$f":"IF(OR(E1659=\"Transfer Well\",E1659=\"Clearwell\"),IF(H1659=\"Circular\",PI()*(E1665/2)^2*(2*E1676+E1669-(E1668-E1676))/3*7.4815,IF(H1659=\"Rectangular\",E1666*E1667*E1676*7.4815,\"\")),\"\")","v":""},"  gal"]
[null,{"$f":"IF(OR(E1659=\"Clearwell\",E1659=\"Transfer Well\"),\"Worst Case Volume (each)\", \"Volume (each)\")","v":"Volume (each)"},null,null,null,"  gal"]
[null,"Percent of Maximum Volume",null,null,{"$f":"IF(H1659=\"Other\",IF(E1675 = 0,\"\",E1678/E1675*100),IF(OR(E1659=\"Clearwell\",E1659=\"Transfer Well\"),IF(E1674 = 0,\"\",E1677/E1674*100),\"\"))","v":""},"  %"]
[]
[null,{"$f":" IF(OR(E1659=\"Clearwell\",E1659=\"Transfer Well\"),\"Worst Case Volume (each)\",\"Volume (each)\")","v":"Volume (each)"},null,null,{"$f":"IF(E1659=\"Filter\",IF(H1659=\"Circular\",PI()*(E1665/2)^2*(E1670*E1673/100+E1672+E1671),IF(H1659=\"Rectangular\",E1666*E1667*(E1670*E1673/100+E1672+E1671),\"error\")),IF(AND(E1659=\"Piping\",H1659=\"Pipe\"),PI()*(E1665/12/2)^2*E1666,IF(H1659=\"Circular\",IF(OR(E1659=\"Transfer Well\",E1659=\"Clearwell\"),E1677/7.4815,PI()*(E1665/2)^2*(2*E1668+E1669)/3),IF(H1659=\"Rectangular\",IF(OR(E1659=\"Transfer Well\",E1659=\"Clearwell\"),E1677/7.4815,E1666*E1667*E1668),E1678/7.4815))))*7.4815","v":0},"  gal"]
[null,"Flow Rate (each)",null,null,null,"  gpm"]
[null,"Detention Time",null,null,{"$f":"IF(OR(E1682=\"\",E1682=0),0,E1681/E1682)","v":0},"  min"]
[]
[null,"Baffling Factor",null,null,{"$f":"IF(I1686=\"Unbaffled\",0.1,IF(I1686=\"Poor\",0.3,IF(I1686=\"Average\",0.5,IF(I1686=\"Superior\",0.7,IF(I1686=\"Perfect\",1,IF(I1686=\"\",\" \",I1687))))))","v":0.1}]
[null,null,null,null,null,null,null,"Baffling Characteristics:  ","Unbaffled"]
[null,null,null,null,null,null,null,"Approved Baffling Factor:  "]
[null,"T10",null,null,{"$f":"E1683*E1685","v":0},"  min"]
[]
[null,"Unit - 4",null,"Type:",null,null,"Shape:"]
[]
[null,null,"Further Description:"]
[]
[null,"Characteristic",null,null,null,null,"Comments"]
[null,"Number of Units"]
[null,"Diameter",null,null,null,{"$f":"IF(H1690=\"pipe\",\"  in\",\"  ft\")","v":"  ft"}]
[null,"Length",null,null,null,"  ft"]
[null,"Width",null,null,null,"  ft"]
[null,"Side Water Depth",null,null,null,"  ft"]
[null,"Center Water Depth",null,null,null,"  ft"]
[null,"Media Depth",null,null,null,"  ft"]
[null,"Underdrain Depth",null,null,null,"  ft"]
[null,"Minimum Water Depth Over Media",null,null,null,"  ft"]
[null,"Average Porosity",null,null,null,"  %"]
[null,"Maximum Volume (each)",null,null,{"$f":"IF(OR(E1690=\"Clearwell\",E1690=\"Transfer Well\"),IF(H1690=\"Circular\",PI()*(E1696/2)^2*(2*E1699+E1700)/3*7.4815,IF(H1690=\"Rectangular\",E1697*E1698*E1699*7.4815,\"\")),\"\")","v":""},"  gal"]
[null,"Maximum Volume (each)",null,null,null,"  gal"]
[null,"Minimum Operating Level",null,null,null,"  ft"]
[null,"Worst Case Volume (each)",null,null,{"$f":"IF(OR(E1690=\"Transfer Well\",E1690=\"Clearwell\"),IF(H1690=\"Circular\",PI()*(E1696/2)^2*(2*E1707+E1700-(E1699-E1707))/3*7.4815,IF(H1690=\"Rectangular\",E1697*E1698*E1707*7.4815,\"\")),\"\")","v":""},"  gal"]
[null,{"$f":"IF(OR(E1690=\"Clearwell\",E1690=\"Transfer Well\"),\"Worst Case Volume (each)\", \"Volume (each)\")","v":"Volume (each)"},null,null,null,"  gal"]
[null,"Percent of Maximum Volume",null,null,{"$f":"IF(H1690=\"Other\",IF(E1706 = 0,\"\",E1709/E1706*100),IF(OR(E1690=\"Clearwell\",E1690=\"Transfer Well\"),IF(E1705 = 0,\"\",E1708/E1705*100),\"\"))","v":""},"  %"]
[]
[null,{"$f":" IF(OR(E1690=\"Clearwell\",E1690=\"Transfer Well\"),\"Worst Case Volume (each)\",\"Volume (each)\")","v":"Volume (each)"},null,null,{"$f":"IF(E1690=\"Filter\",IF(H1690=\"Circular\",PI()*(E1696/2)^2*(E1701*E1704/100+E1703+E1702),IF(H1690=\"Rectangular\",E1697*E1698*(E1701*E1704/100+E1703+E1702),\"error\")),IF(AND(E1690=\"Piping\",H1690=\"Pipe\"),PI()*(E1696/12/2)^2*E1697,IF(H1690=\"Circular\",IF(OR(E1690=\"Transfer Well\",E1690=\"Clearwell\"),E1708/7.4815,PI()*(E1696/2)^2*(2*E1699+E1700)/3),IF(H1690=\"Rectangular\",IF(OR(E1690=\"Transfer Well\",E1690=\"Clearwell\"),E1708/7.4815,E1697*E1698*E1699),E1709/7.4815))))*7.4815","v":0},"  gal"]
[null,"Flow Rate (each)",null,null,null,"  gpm"]
[null,"Detention Time",null,null,{"$f":"IF(OR(E1713=\"\",E1713=0),0,E1712/E1713)","v":0},"  min"]
[]
[null,"Baffling Factor",null,null,{"$f":"IF(I1717=\"Unbaffled\",0.1,IF(I1717=\"Poor\",0.3,IF(I1717=\"Average\",0.5,IF(I1717=\"Superior\",0.7,IF(I1717=\"Perfect\",1,IF(I1717=\"\",\" \",I1718))))))","v":0.1}]
[null,null,null,null,null,null,null,"Baffling Characteristics:  ","Unbaffled"]
[null,null,null,null,null,null,null,"Approved Baffling Factor:  "]
[null,"T10",null,null,{"$f":"E1714*E1716","v":0},"  min"]
[]
[null,"Unit - 5",null,"Type:",null,null,"Shape:"]
[]
[null,null,"Further Description:"]
[]
[null,"Characteristic",null,null,null,null,"Comments"]
[null,"Number of Units"]
[null,"Diameter",null,null,null,{"$f":"IF(H1721=\"pipe\",\"  in\",\"  ft\")","v":"  ft"}]
[null,"Length",null,null,null,"  ft"]
[null,"Width",null,null,null,"  ft"]
[null,"Side Water Depth",null,null,null,"  ft"]
[null,"Center Water Depth",null,null,null,"  ft"]
[null,"Media Depth",null,null,null,"  ft"]
[null,"Underdrain Depth",null,null,null,"  ft"]
[null,"Minimum Water Depth Over Media",null,null,null,"  ft"]
[null,"Average Porosity",null,null,null,"  %"]
[null,"Maximum Volume (each)",null,null,{"$f":"IF(OR(E1721=\"Clearwell\",E1721=\"Transfer Well\"),IF(H1721=\"Circular\",PI()*(E1727/2)^2*(2*E1730+E1731)/3*7.4815,IF(H1721=\"Rectangular\",E1728*E1729*E1730*7.4815,\"\")),\"\")","v":""},"  gal"]
[null,"Maximum Volume (each)",null,null,null,"  gal"]
[null,"Minimum Operating Level",null,null,null,"  ft"]
[null,"Worst Case Volume (each)",null,null,{"$f":"IF(OR(E1721=\"Transfer Well\",E1721=\"Clearwell\"),IF(H1721=\"Circular\",PI()*(E1727/2)^2*(2*E1738+E1731-(E1730-E1738))/3*7.4815,IF(H1721=\"Rectangular\",E1728*E1729*E1738*7.4815,\"\")),\"\")","v":""},"  gal"]
[null,{"$f":"IF(OR(E1721=\"Clearwell\",E1721=\"Transfer Well\"),\"Worst Case Volume (each)\", \"Volume (each)\")","v":"Volume (each)"},null,null,null,"  gal"]
[null,"Percent of Maximum Volume",null,null,{"$f":"IF(H1721=\"Other\",IF(E1737 = 0,\"\",E1740/E1737*100),IF(OR(E1721=\"Clearwell\",E1721=\"Transfer Well\"),IF(E1736 = 0,\"\",E1739/E1736*100),\"\"))","v":""},"  %"]
[]
[null,{"$f":" IF(OR(E1721=\"Clearwell\",E1721=\"Transfer Well\"),\"Worst Case Volume (each)\",\"Volume (each)\")","v":"Volume (each)"},null,null,{"$f":"IF(E1721=\"Filter\",IF(H1721=\"Circular\",PI()*(E1727/2)^2*(E1732*E1735/100+E1734+E1733),IF(H1721=\"Rectangular\",E1728*E1729*(E1732*E1735/100+E1734+E1733),\"error\")),IF(AND(E1721=\"Piping\",H1721=\"Pipe\"),PI()*(E1727/12/2)^2*E1728,IF(H1721=\"Circular\",IF(OR(E1721=\"Transfer Well\",E1721=\"Clearwell\"),E1739/7.4815,PI()*(E1727/2)^2*(2*E1730+E1731)/3),IF(H1721=\"Rectangular\",IF(OR(E1721=\"Transfer Well\",E1721=\"Clearwell\"),E1739/7.4815,E1728*E1729*E1730),E1740/7.4815))))*7.4815","v":0},"  gal"]
[null,"Flow Rate (each)",null,null,null,"  gpm"]
[null,"Detention Time",null,null,{"$f":"IF(OR(E1744=\"\",E1744=0),0,E1743/E1744)","v":0},"  min"]
[]
[null,"Baffling Factor",null,null,{"$f":"IF(I1748=\"Unbaffled\",0.1,IF(I1748=\"Poor\",0.3,IF(I1748=\"Average\",0.5,IF(I1748=\"Superior\",0.7,IF(I1748=\"Perfect\",1,IF(I1748=\"\",\" \",I1749))))))","v":0.1}]
[null,null,null,null,null,null,null,"Baffling Characteristics:  ","Unbaffled"]
[null,null,null,null,null,null,null,"Approved Baffling Factor:  "]
[null,"T10",null,null,{"$f":"E1745*E1747","v":0},"  min"]
[]
[null,"Unit - 6",null,"Type:",null,null,"Shape:"]
[]
[null,null,"Further Description:"]
[]
[null,"Characteristic",null,null,null,null,"Comments"]
[null,"Number of Units"]
[null,"Diameter",null,null,null,{"$f":"IF(H1752=\"pipe\",\"  in\",\"  ft\")","v":"  ft"}]
[null,"Length",null,null,null,"  ft"]
[null,"Width",null,null,null,"  ft"]
[null,"Side Water Depth",null,null,null,"  ft"]
[null,"Center Water Depth",null,null,null,"  ft"]
[null,"Media Depth",null,null,null,"  ft"]
[null,"Underdrain Depth",null,null,null,"  ft"]
[null,"Minimum Water Depth Over Media",null,null,null,"  ft"]
[null,"Average Porosity",null,null,null,"  %"]
[null,"Maximum Volume (each)",null,null,{"$f":"IF(OR(E1752=\"Clearwell\",E1752=\"Transfer Well\"),IF(H1752=\"Circular\",PI()*(E1758/2)^2*(2*E1761+E1762)/3*7.4815,IF(H1752=\"Rectangular\",E1759*E1760*E1761*7.4815,\"\")),\"\")","v":""},"  gal"]
[null,"Maximum Volume (each)",null,null,null,"  gal"]
[null,"Minimum Operating Level",null,null,null,"  ft"]
[null,"Worst Case Volume (each)",null,null,{"$f":"IF(OR(E1752=\"Transfer Well\",E1752=\"Clearwell\"),IF(H1752=\"Circular\",PI()*(E1758/2)^2*(2*E1769+E1762-(E1761-E1769))/3*7.4815,IF(H1752=\"Rectangular\",E1759*E1760*E1769*7.4815,\"\")),\"\")","v":""},"  gal"]
[null,{"$f":"IF(OR(E1752=\"Clearwell\",E1752=\"Transfer Well\"),\"Worst Case Volume (each)\", \"Volume (each)\")","v":"Volume (each)"},null,null,null,"  gal"]
[null,"Percent of Maximum Volume",null,null,{"$f":"IF(H1752=\"Other\",IF(E1768 = 0,\"\",E1771/E1768*100),IF(OR(E1752=\"Clearwell\",E1752=\"Transfer Well\"),IF(E1767 = 0,\"\",E1770/E1767*100),\"\"))","v":""},"  %"]
[]
[null,{"$f":" IF(OR(E1752=\"Clearwell\",E1752=\"Transfer Well\"),\"Worst Case Volume (each)\",\"Volume (each)\")","v":"Volume (each)"},null,null,{"$f":"IF(E1752=\"Filter\",IF(H1752=\"Circular\",PI()*(E1758/2)^2*(E1763*E1766/100+E1765+E1764),IF(H1752=\"Rectangular\",E1759*E1760*(E1763*E1766/100+E1765+E1764),\"error\")),IF(AND(E1752=\"Piping\",H1752=\"Pipe\"),PI()*(E1758/12/2)^2*E1759,IF(H1752=\"Circular\",IF(OR(E1752=\"Transfer Well\",E1752=\"Clearwell\"),E1770/7.4815,PI()*(E1758/2)^2*(2*E1761+E1762)/3),IF(H1752=\"Rectangular\",IF(OR(E1752=\"Transfer Well\",E1752=\"Clearwell\"),E1770/7.4815,E1759*E1760*E1761),E1771/7.4815))))*7.4815","v":0},"  gal"]
[null,"Flow Rate (each)",null,null,null,"  gpm"]
[null,"Detention Time",null,null,{"$f":"IF(OR(E1775=\"\",E1775=0),0,E1774/E1775)","v":0},"  min"]
[]
[null,"Baffling Factor",null,null,{"$f":"IF(I1779=\"Unbaffled\",0.1,IF(I1779=\"Poor\",0.3,IF(I1779=\"Average\",0.5,IF(I1779=\"Superior\",0.7,IF(I1779=\"Perfect\",1,IF(I1779=\"\",\" \",I1780))))))","v":0.1}]
[null,null,null,null,null,null,null,"Baffling Characteristics:  ","Unbaffled"]
[null,null,null,null,null,null,null,"Approved Baffling Factor:  "]
[null,"T10",null,null,{"$f":"E1776*E1778","v":0},"  min"]
[]
[null,"Unit - 7",null,"Type:",null,null,"Shape:"]
[]
[null,null,"Further Description:"]
[]
[null,"Characteristic",null,null,null,null,"Comments"]
[null,"Number of Units"]
[null,"Diameter",null,null,null,{"$f":"IF(H1783=\"pipe\",\"  in\",\"  ft\")","v":"  ft"}]
[null,"Length",null,null,null,"  ft"]
[null,"Width",null,null,null,"  ft"]
[null,"Side Water Depth",null,null,null,"  ft"]
[null,"Center Water Depth",null,null,null,"  ft"]
[null,"Media Depth",null,null,null,"  ft"]
[null,"Underdrain Depth",null,null,null,"  ft"]
[null,"Minimum Water Depth Over Media",null,null,null,"  ft"]
[null,"Average Porosity",null,null,null,"  %"]
[null,"Maximum Volume (each)",null,null,{"$f":"IF(OR(E1783=\"Clearwell\",E1783=\"Transfer Well\"),IF(H1783=\"Circular\",PI()*(E1789/2)^2*(2*E1792+E1793)/3*7.4815,IF(H1783=\"Rectangular\",E1790*E1791*E1792*7.4815,\"\")),\"\")","v":""},"  gal"]
[null,"Maximum Volume (each)",null,null,null,"  gal"]
[null,"Minimum Operating Level",null,null,null,"  ft"]
[null,"Worst Case Volume (each)",null,null,{"$f":"IF(OR(E1783=\"Transfer Well\",E1783=\"Clearwell\"),IF(H1783=\"Circular\",PI()*(E1789/2)^2*(2*E1800+E1793-(E1792-E1800))/3*7.4815,IF(H1783=\"Rectangular\",E1790*E1791*E1800*7.4815,\"\")),\"\")","v":""},"  gal"]
[null,{"$f":"IF(OR(E1783=\"Clearwell\",E1783=\"Transfer Well\"),\"Worst Case Volume (each)\", \"Volume (each)\")","v":"Volume (each)"},null,null,null,"  gal"]
[null,"Percent of Maximum Volume",null,null,{"$f":"IF(H1783=\"Other\",IF(E1799 = 0,\"\",E1802/E1799*100),IF(OR(E1783=\"Clearwell\",E1783=\"Transfer Well\"),IF(E1798 = 0,\"\",E1801/E1798*100),\"\"))","v":""},"  %"]
[]
[null,{"$f":" IF(OR(E1783=\"Clearwell\",E1783=\"Transfer Well\"),\"Worst Case Volume (each)\",\"Volume (each)\")","v":"Volume (each)"},null,null,{"$f":"IF(E1783=\"Filter\",IF(H1783=\"Circular\",PI()*(E1789/2)^2*(E1794*E1797/100+E1796+E1795),IF(H1783=\"Rectangular\",E1790*E1791*(E1794*E1797/100+E1796+E1795),\"error\")),IF(AND(E1783=\"Piping\",H1783=\"Pipe\"),PI()*(E1789/12/2)^2*E1790,IF(H1783=\"Circular\",IF(OR(E1783=\"Transfer Well\",E1783=\"Clearwell\"),E1801/7.4815,PI()*(E1789/2)^2*(2*E1792+E1793)/3),IF(H1783=\"Rectangular\",IF(OR(E1783=\"Transfer Well\",E1783=\"Clearwell\"),E1801/7.4815,E1790*E1791*E1792),E1802/7.4815))))*7.4815","v":0},"  gal"]
[null,"Flow Rate (each)",null,null,null,"  gpm"]
[null,"Detention Time",null,null,{"$f":"IF(OR(E1806=\"\",E1806=0),0,E1805/E1806)","v":0},"  min"]
[]
[null,"Baffling Factor",null,null,{"$f":"IF(I1810=\"Unbaffled\",0.1,IF(I1810=\"Poor\",0.3,IF(I1810=\"Average\",0.5,IF(I1810=\"Superior\",0.7,IF(I1810=\"Perfect\",1,IF(I1810=\"\",\" \",I1811))))))","v":0.1}]
[null,null,null,null,null,null,null,"Baffling Characteristics:  ","Unbaffled"]
[null,null,null,null,null,null,null,"Approved Baffling Factor:  "]
[null,"T10",null,null,{"$f":"E1807*E1809","v":0},"  min"]
[]
[null,"Unit - 8",null,"Type:",null,null,"Shape:"]
[]
[null,null,"Further Description:"]
[]
[null,"Characteristic",null,null,null,null,"Comments"]
[null,"Number of Units"]
[null,"Diameter",null,null,null,{"$f":"IF(H1814=\"pipe\",\"  in\",\"  ft\")","v":"  ft"}]
[null,"Length",null,null,null,"  ft"]
[null,"Width",null,null,null,"  ft"]
[null,"Side Water Depth",null,null,null,"  ft"]
[null,"Center Water Depth",null,null,null,"  ft"]
[null,"Media Depth",null,null,null,"  ft"]
[null,"Underdrain Depth",null,null,null,"  ft"]
[null,"Minimum Water Depth Over Media",null,null,null,"  ft"]
[null,"Average Porosity",null,null,null,"  %"]
[null,"Maximum Volume (each)",null,null,{"$f":"IF(OR(E1814=\"Clearwell\",E1814=\"Transfer Well\"),IF(H1814=\"Circular\",PI()*(E1820/2)^2*(2*E1823+E1824)/3*7.4815,IF(H1814=\"Rectangular\",E1821*E1822*E1823*7.4815,\"\")),\"\")","v":""},"  gal"]
[null,"Maximum Volume (each)",null,null,null,"  gal"]
[null,"Minimum Operating Level",null,null,null,"  ft"]
[null,"Worst Case Volume (each)",null,null,{"$f":"IF(OR(E1814=\"Transfer Well\",E1814=\"Clearwell\"),IF(H1814=\"Circular\",PI()*(E1820/2)^2*(2*E1831+E1824-(E1823-E1831))/3*7.4815,IF(H1814=\"Rectangular\",E1821*E1822*E1831*7.4815,\"\")),\"\")","v":""},"  gal"]
[null,{"$f":"IF(OR(E1814=\"Clearwell\",E1814=\"Transfer Well\"),\"Worst Case Volume (each)\", \"Volume (each)\")","v":"Volume (each)"},null,null,null,"  gal"]
[null,"Percent of Maximum Volume",null,null,{"$f":"IF(H1814=\"Other\",IF(E1830 = 0,\"\",E1833/E1830*100),IF(OR(E1814=\"Clearwell\",E1814=\"Transfer Well\"),IF(E1829 = 0,\"\",E1832/E1829*100),\"\"))","v":""},"  %"]
[]
[null,{"$f":" IF(OR(E1814=\"Clearwell\",E1814=\"Transfer Well\"),\"Worst Case Volume (each)\",\"Volume (each)\")","v":"Volume (each)"},null,null,{"$f":"IF(E1814=\"Filter\",IF(H1814=\"Circular\",PI()*(E1820/2)^2*(E1825*E1828/100+E1827+E1826),IF(H1814=\"Rectangular\",E1821*E1822*(E1825*E1828/100+E1827+E1826),\"error\")),IF(AND(E1814=\"Piping\",H1814=\"Pipe\"),PI()*(E1820/12/2)^2*E1821,IF(H1814=\"Circular\",IF(OR(E1814=\"Transfer Well\",E1814=\"Clearwell\"),E1832/7.4815,PI()*(E1820/2)^2*(2*E1823+E1824)/3),IF(H1814=\"Rectangular\",IF(OR(E1814=\"Transfer Well\",E1814=\"Clearwell\"),E1832/7.4815,E1821*E1822*E1823),E1833/7.4815))))*7.4815","v":0},"  gal"]
[null,"Flow Rate (each)",null,null,null,"  gpm"]
[null,"Detention Time",null,null,{"$f":"IF(OR(E1837=\"\",E1837=0),0,E1836/E1837)","v":0},"  min"]
[]
[null,"Baffling Factor",null,null,{"$f":"IF(I1841=\"Unbaffled\",0.1,IF(I1841=\"Poor\",0.3,IF(I1841=\"Average\",0.5,IF(I1841=\"Superior\",0.7,IF(I1841=\"Perfect\",1,IF(I1841=\"\",\" \",I1842))))))","v":0.1}]
[null,null,null,null,null,null,null,"Baffling Characteristics:  ","Unbaffled"]
[null,null,null,null,null,null,null,"Approved Baffling Factor:  "]
[null,"T10",null,null,{"$f":"E1838*E1840","v":0},"  min"]
[]
[null,"Unit - 9",null,"Type:",null,null,"Shape:"]
[]
[null,null,"Further Description:"]
[]
[null,"Characteristic",null,null,null,null,"Comments"]
[null,"Number of Units"]
[null,"Diameter",null,null,null,{"$f":"IF(H1845=\"pipe\",\"  in\",\"  ft\")","v":"  ft"}]
[null,"Length",null,null,null,"  ft"]
[null,"Width",null,null,null,"  ft"]
[null,"Side Water Depth",null,null,null,"  ft"]
[null,"Center Water Depth",null,null,null,"  ft"]
[null,"Media Depth",null,null,null,"  ft"]
[null,"Underdrain Depth",null,null,null,"  ft"]
[null,"Minimum Water Depth Over Media",null,null,null,"  ft"]
[null,"Average Porosity",null,null,null,"  %"]
[null,"Maximum Volume (each)",null,null,{"$f":"IF(OR(E1845=\"Clearwell\",E1845=\"Transfer Well\"),IF(H1845=\"Circular\",PI()*(E1851/2)^2*(2*E1854+E1855)/3*7.4815,IF(H1845=\"Rectangular\",E1852*E1853*E1854*7.4815,\"\")),\"\")","v":""},"  gal"]
[null,"Maximum Volume (each)",null,null,null,"  gal"]
[null,"Minimum Operating Level",null,null,null,"  ft"]
[null,"Worst Case Volume (each)",null,null,{"$f":"IF(OR(E1845=\"Transfer Well\",E1845=\"Clearwell\"),IF(H1845=\"Circular\",PI()*(E1851/2)^2*(2*E1862+E1855-(E1854-E1862))/3*7.4815,IF(H1845=\"Rectangular\",E1852*E1853*E1862*7.4815,\"\")),\"\")","v":""},"  gal"]
[null,{"$f":"IF(OR(E1845=\"Clearwell\",E1845=\"Transfer Well\"),\"Worst Case Volume (each)\", \"Volume (each)\")","v":"Volume (each)"},null,null,null,"  gal"]
[null,"Percent of Maximum Volume",null,null,{"$f":"IF(H1845=\"Other\",IF(E1861 = 0,\"\",E1864/E1861*100),IF(OR(E1845=\"Clearwell\",E1845=\"Transfer Well\"),IF(E1860 = 0,\"\",E1863/E1860*100),\"\"))","v":""},"  %"]
[]
[null,{"$f":" IF(OR(E1845=\"Clearwell\",E1845=\"Transfer Well\"),\"Worst Case Volume (each)\",\"Volume (each)\")","v":"Volume (each)"},null,null,{"$f":"IF(E1845=\"Filter\",IF(H1845=\"Circular\",PI()*(E1851/2)^2*(E1856*E1859/100+E1858+E1857),IF(H1845=\"Rectangular\",E1852*E1853*(E1856*E1859/100+E1858+E1857),\"error\")),IF(AND(E1845=\"Piping\",H1845=\"Pipe\"),PI()*(E1851/12/2)^2*E1852,IF(H1845=\"Circular\",IF(OR(E1845=\"Transfer Well\",E1845=\"Clearwell\"),E1863/7.4815,PI()*(E1851/2)^2*(2*E1854+E1855)/3),IF(H1845=\"Rectangular\",IF(OR(E1845=\"Transfer Well\",E1845=\"Clearwell\"),E1863/7.4815,E1852*E1853*E1854),E1864/7.4815))))*7.4815","v":0},"  gal"]
[null,"Flow Rate (each)",null,null,null,"  gpm"]
[null,"Detention Time",null,null,{"$f":"IF(OR(E1868=\"\",E1868=0),0,E1867/E1868)","v":0},"  min"]
[]
[null,"Baffling Factor",null,null,{"$f":"IF(I1872=\"Unbaffled\",0.1,IF(I1872=\"Poor\",0.3,IF(I1872=\"Average\",0.5,IF(I1872=\"Superior\",0.7,IF(I1872=\"Perfect\",1,IF(I1872=\"\",\" \",I1873))))))","v":0.1}]
[null,null,null,null,null,null,null,"Baffling Characteristics:  ","Unbaffled"]
[null,null,null,null,null,null,null,"Approved Baffling Factor:  "]
[null,"T10",null,null,{"$f":"E1869*E1871","v":0},"  min"]
[]
[null,"Unit - 10",null,"Type:",null,null,"Shape:"]
[]
[null,null,"Further Description:"]
[]
[null,"Characteristic",null,null,null,null,"Comments"]
[null,"Number of Units"]
[null,"Diameter",null,null,null,{"$f":"IF(H1876=\"pipe\",\"  in\",\"  ft\")","v":"  ft"}]
[null,"Length",null,null,null,"  ft"]
[null,"Width",null,null,null,"  ft"]
[null,"Side Water Depth",null,null,null,"  ft"]
[null,"Center Water Depth",null,null,null,"  ft"]
[null,"Media Depth",null,null,null,"  ft"]
[null,"Underdrain Depth",null,null,null,"  ft"]
[null,"Minimum Water Depth Over Media",null,null,null,"  ft"]
[null,"Average Porosity",null,null,null,"  %"]
[null,"Maximum Volume (each)",null,null,{"$f":"IF(OR(E1876=\"Clearwell\",E1876=\"Transfer Well\"),IF(H1876=\"Circular\",PI()*(E1882/2)^2*(2*E1885+E1886)/3*7.4815,IF(H1876=\"Rectangular\",E1883*E1884*E1885*7.4815,\"\")),\"\")","v":""},"  gal"]
[null,"Maximum Volume (each)",null,null,null,"  gal"]
[null,"Minimum Operating Level",null,null,null,"  ft"]
[null,"Worst Case Volume (each)",null,null,{"$f":"IF(OR(E1876=\"Transfer Well\",E1876=\"Clearwell\"),IF(H1876=\"Circular\",PI()*(E1882/2)^2*(2*E1893+E1886-(E1885-E1893))/3*7.4815,IF(H1876=\"Rectangular\",E1883*E1884*E1893*7.4815,\"\")),\"\")","v":""},"  gal"]
[null,{"$f":"IF(OR(E1876=\"Clearwell\",E1876=\"Transfer Well\"),\"Worst Case Volume (each)\", \"Volume (each)\")","v":"Volume (each)"},null,null,null,"  gal"]
[null,"Percent of Maximum Volume",null,null,{"$f":"IF(H1876=\"Other\",IF(E1892 = 0,\"\",E1895/E1892*100),IF(OR(E1876=\"Clearwell\",E1876=\"Transfer Well\"),IF(E1891 =0,\"\",E1894/E1891*100),\"\"))","v":""},"  %"]
[]
[null,{"$f":" IF(OR(E1876=\"Clearwell\",E1876=\"Transfer Well\"),\"Worst Case Volume (each)\",\"Volume (each)\")","v":"Volume (each)"},null,null,{"$f":"IF(E1876=\"Filter\",IF(H1876=\"Circular\",PI()*(E1882/2)^2*(E1887*E1890/100+E1889+E1888),IF(H1876=\"Rectangular\",E1883*E1884*(E1887*E1890/100+E1889+E1888),\"error\")),IF(AND(E1876=\"Piping\",H1876=\"Pipe\"),PI()*(E1882/12/2)^2*E1883,IF(H1876=\"Circular\",IF(OR(E1876=\"Transfer Well\",E1876=\"Clearwell\"),E1894/7.4815,PI()*(E1882/2)^2*(2*E1885+E1886)/3),IF(H1876=\"Rectangular\",IF(OR(E1876=\"Transfer Well\",E1876=\"Clearwell\"),E1894/7.4815,E1883*E1884*E1885),E1895/7.4815))))*7.4815","v":0},"  gal"]
[null,"Flow Rate (each)",null,null,null,"  gpm"]
[null,"Detention Time",null,null,{"$f":"IF(OR(E1899=\"\",E1899=0),0,E1898/E1899)","v":0},"  min"]
[]
[null,"Baffling Factor",null,null,{"$f":"IF(I1903=\"Unbaffled\",0.1,IF(I1903=\"Poor\",0.3,IF(I1903=\"Average\",0.5,IF(I1903=\"Superior\",0.7,IF(I1903=\"Perfect\",1,IF(I1903=\"\",\" \",I1904))))))","v":0.1}]
[null,null,null,null,null,null,null,"Baffling Characteristics:  ","Unbaffled"]
[null,null,null,null,null,null,null,"Approved Baffling Factor:  "]
[null,"T10",null,null,{"$f":"E1900*E1902","v":0},"  min"]
[]
[null,{"$f":"CONCATENATE(D1595,\" FLOW RATE\")","v":"D6 FLOW RATE"},null,null,{"$f":"MaxUnitFlow(E1626,E1657,E1688,E1719,E1750,E1781,E1812,E1843,E1874,E1905,E1620,E1651,E1682,E1713,E1744,E1775,E1806,E1837,E1868,E1899)*60*24/10^6","v":0},"  mgd"]
[]
[null,{"$f":"CONCATENATE(\"T10 SUM FOR \",D1595)","v":"T10 SUM FOR D6"},null,null,{"$f":"SUM(E1626,E1657,E1688,E1719,E1750,E1781,E1812,E1843,E1874,E1905)","v":0},"  min"]
[]
["Disinfection Zone:",null,null,{"$f":"CONCATENATE(\"D\",Calculator!$BJ$6)","v":"D7"},null,"Disinfectant:"]
[]
[null,"Unit - 1",null,"Type:",null,null,"Shape:"]
[]
[null,null,"Further Description:"]
[]
[null,"Characteristic",null,null,null,null,"Comments"]
[null,"Number of Units"]
[null,"Diameter",null,null,null,{"$f":"IF(H1913=\"pipe\",\"  in\",\"  ft\")","v":"  ft"}]
[null,"Length",null,null,null,"  ft"]
[null,"Width",null,null,null,"  ft"]
[null,"Side Water Depth",null,null,null,"  ft"]
[null,"Center Water Depth",null,null,null,"  ft"]
[null,"Media Depth",null,null,null,"  ft"]
[null,"Underdrain Depth",null,null,null,"  ft"]
[null,"Minimum Water Depth Over Media",null,null,null,"  ft"]
[null,"Average Porosity",null,null,null,"  %"]
[null,"Maximum Volume (each)",null,null,{"$f":"IF(OR(E1913=\"Clearwell\",E1913=\"Transfer Well\"),IF(H1913=\"Circular\",PI()*(E1919/2)^2*(2*E1922+E1923)/3*7.4815,IF(H1913=\"Rectangular\",E1920*E1921*E1922*7.4815,\"\")),\"\")","v":""},"  gal"]
[null,"Maximum Volume (each)",null,null,null,"  gal"]
[null,"Minimum Operating Level",null,null,null,"  ft"]
[null,"Worst Case Volume (each)",null,null,{"$f":"IF(OR(E1913=\"Transfer Well\",E1913=\"Clearwell\"),IF(H1913=\"Circular\",PI()*(E1919/2)^2*(2*E1930+E1923-(E1922-E1930))/3*7.4815,IF(H1913=\"Rectangular\",E1920*E1921*E1930*7.4815,\"\")),\"\")","v":""},"  gal"]
[null,{"$f":"IF(OR(E1913=\"Clearwell\",E1913=\"Transfer Well\"),\"Worst Case Volume (each)\", \"Volume (each)\")","v":"Volume (each)"},null,null,null,"  gal"]
[null,"Percent of Maximum Volume",null,null,{"$f":"IF(H1913=\"Other\",IF(E1929 = 0,\"\",E1932/E1929*100),IF(OR(E1913=\"Clearwell\",E1913=\"Transfer Well\"),IF(E1928 = 0,\"\",E1931/E1928*100),\"\"))","v":""},"  %"]
[]
[null,{"$f":" IF(OR(E1913=\"Clearwell\",E1913=\"Transfer Well\"),\"Worst Case Volume (each)\",\"Volume (each)\")","v":"Volume (each)"},null,null,{"$f":"IF(E1913=\"Filter\",IF(H1913=\"Circular\",PI()*(E1919/2)^2*(E1924*E1927/100+E1926+E1925),IF(H1913=\"Rectangular\",E1920*E1921*(E1924*E1927/100+E1926+E1925),\"error\")),IF(AND(E1913=\"Piping\",H1913=\"Pipe\"),PI()*(E1919/12/2)^2*E1920,IF(H1913=\"Circular\",IF(OR(E1913=\"Transfer Well\",E1913=\"Clearwell\"),E1931/7.4815,PI()*(E1919/2)^2*(2*E1922+E1923)/3),IF(H1913=\"Rectangular\",IF(OR(E1913=\"Transfer Well\",E1913=\"Clearwell\"),E1931/7.4815,E1920*E1921*E1922),E1932/7.4815))))*7.4815","v":0},"  gal"]
[null,"Flow Rate (each)",null,null,null,"  gpm"]
[null,"Detention Time",null,null,{"$f":"IF(OR(E1936=\"\",E1936=0),0,E1935/E1936)","v":0},"  min"]
[]
[null,"Baffling Factor",null,null,{"$f":"IF(I1940=\"Unbaffled\",0.1,IF(I1940=\"Poor\",0.3,IF(I1940=\"Average\",0.5,IF(I1940=\"Superior\",0.7,IF(I1940=\"Perfect\",1,IF(I1940=\"\",\" \",I1941))))))","v":0.1}]
[null,null,null,null,null,null,null,"Baffling Characteristics:  ","Unbaffled"]
[null,null,null,null,null,null,null,"Approved Baffling Factor:  "]
[null,"T10",null,null,{"$f":"E1937*E1939","v":0},"  min"]
[]
[null,"Unit - 2",null,"Type:",null,null,"Shape:"]
[]
[null,null,"Further Description:"]
[]
[null,"Characteristic",null,null,null,null,"Comments"]
[null,"Number of Units"]
[null,"Diameter",null,null,null,{"$f":"IF(H1944=\"pipe\",\"  in\",\"  ft\")","v":"  ft"}]
[null,"Length",null,null,null,"  ft"]
[null,"Width",null,null,null,"  ft"]
[null,"Side Water Depth",null,null,null,"  ft"]
[null,"Center Water Depth",null,null,null,"  ft"]
[null,"Media Depth",null,null,null,"  ft"]
[null,"Underdrain Depth",null,null,null,"  ft"]
[null,"Minimum Water Depth Over Media",null,null,null,"  ft"]
[null,"Average Porosity",null,null,null,"  %"]
[null,"Maximum Volume (each)",null,null,{"$f":"IF(OR(E1944=\"Clearwell\",E1944=\"Transfer Well\"),IF(H1944=\"Circular\",PI()*(E1950/2)^2*(2*E1953+E1954)/3*7.4815,IF(H1944=\"Rectangular\",E1951*E1952*E1953*7.4815,\"\")),\"\")","v":""},"  gal"]
[null,"Maximum Volume (each)",null,null,null,"  gal"]
[null,"Minimum Operating Level",null,null,null,"  ft"]
[null,"Worst Case Volume (each)",null,null,{"$f":"IF(OR(E1944=\"Transfer Well\",E1944=\"Clearwell\"),IF(H1944=\"Circular\",PI()*(E1950/2)^2*(2*E1961+E1954-(E1953-E1961))/3*7.4815,IF(H1944=\"Rectangular\",E1951*E1952*E1961*7.4815,\"\")),\"\")","v":""},"  gal"]
[null,{"$f":"IF(OR(E1944=\"Clearwell\",E1944=\"Transfer Well\"),\"Worst Case Volume (each)\", \"Volume (each)\")","v":"Volume (each)"},null,null,null,"  gal"]
[null,"Percent of Maximum Volume",null,null,{"$f":"IF(H1944=\"Other\",IF(E1960 = 0,\"\",E1963/E1960*100),IF(OR(E1944=\"Clearwell\",E1944=\"Transfer Well\"),IF(E1959 =0,\"\",E1962/E1959*100),\"\"))","v":""},"  %"]
[]
[null,{"$f":" IF(OR(E1944=\"Clearwell\",E1944=\"Transfer Well\"),\"Worst Case Volume (each)\",\"Volume (each)\")","v":"Volume (each)"},null,null,{"$f":"IF(E1944=\"Filter\",IF(H1944=\"Circular\",PI()*(E1950/2)^2*(E1955*E1958/100+E1957+E1956),IF(H1944=\"Rectangular\",E1951*E1952*(E1955*E1958/100+E1957+E1956),\"error\")),IF(AND(E1944=\"Piping\",H1944=\"Pipe\"),PI()*(E1950/12/2)^2*E1951,IF(H1944=\"Circular\",IF(OR(E1944=\"Transfer Well\",E1944=\"Clearwell\"),E1962/7.4815,PI()*(E1950/2)^2*(2*E1953+E1954)/3),IF(H1944=\"Rectangular\",IF(OR(E1944=\"Transfer Well\",E1944=\"Clearwell\"),E1962/7.4815,E1951*E1952*E1953),E1963/7.4815))))*7.4815","v":0},"  gal"]
[null,"Flow Rate (each)",null,null,null,"  gpm"]
[null,"Detention Time",null,null,{"$f":"IF(OR(E1967=\"\",E1967=0),0,E1966/E1967)","v":0},"  min"]
[]
[null,"Baffling Factor",null,null,{"$f":"IF(I1971=\"Unbaffled\",0.1,IF(I1971=\"Poor\",0.3,IF(I1971=\"Average\",0.5,IF(I1971=\"Superior\",0.7,IF(I1971=\"Perfect\",1,IF(I1971=\"\",\" \",I1972))))))","v":0.1}]
[null,null,null,null,null,null,null,"Baffling Characteristics:  ","Unbaffled"]
[null,null,null,null,null,null,null,"Approved Baffling Factor:  "]
[null,"T10",null,null,{"$f":"E1968*E1970","v":0},"  min"]
[]
[null,"Unit - 3",null,"Type:",null,null,"Shape:"]
[]
[null,null,"Further Description:"]
[]
[null,"Characteristic",null,null,null,null,"Comments"]
[null,"Number of Units"]
[null,"Diameter",null,null,null,{"$f":"IF(H1975=\"pipe\",\"  in\",\"  ft\")","v":"  ft"}]
[null,"Length",null,null,null,"  ft"]
[null,"Width",null,null,null,"  ft"]
[null,"Side Water Depth",null,null,null,"  ft"]
[null,"Center Water Depth",null,null,null,"  ft"]
[null,"Media Depth",null,null,null,"  ft"]
[null,"Underdrain Depth",null,null,null,"  ft"]
[null,"Minimum Water Depth Over Media",null,null,null,"  ft"]
[null,"Average Porosity",null,null,null,"  %"]
[null,"Maximum Volume (each)",null,null,{"$f":"IF(OR(E1975=\"Clearwell\",E1975=\"Transfer Well\"),IF(H1975=\"Circular\",PI()*(E1981/2)^2*(2*E1984+E1985)/3*7.4815,IF(H1975=\"Rectangular\",E1982*E1983*E1984*7.4815,\"\")),\"\")","v":""},"  gal"]
[null,"Maximum Volume (each)",null,null,null,"  gal"]
[null,"Minimum Operating Level",null,null,null,"  ft"]
[null,"Worst Case Volume (each)",null,null,{"$f":"IF(OR(E1975=\"Transfer Well\",E1975=\"Clearwell\"),IF(H1975=\"Circular\",PI()*(E1981/2)^2*(2*E1992+E1985-(E1984-E1992))/3*7.4815,IF(H1975=\"Rectangular\",E1982*E1983*E1992*7.4815,\"\")),\"\")","v":""},"  gal"]
[null,{"$f":"IF(OR(E1975=\"Clearwell\",E1975=\"Transfer Well\"),\"Worst Case Volume (each)\", \"Volume (each)\")","v":"Volume (each)"},null,null,null,"  gal"]
[null,"Percent of Maximum Volume",null,null,{"$f":"IF(H1975=\"Other\",IF(E1991 = 0,\"\",E1994/E1991*100),IF(OR(E1975=\"Clearwell\",E1975=\"Transfer Well\"),IF(E1990 = 0,\"\",E1993/E1990*100),\"\"))","v":""},"  %"]
[]
[null,{"$f":" IF(OR(E1975=\"Clearwell\",E1975=\"Transfer Well\"),\"Worst Case Volume (each)\",\"Volume (each)\")","v":"Volume (each)"},null,null,{"$f":"IF(E1975=\"Filter\",IF(H1975=\"Circular\",PI()*(E1981/2)^2*(E1986*E1989/100+E1988+E1987),IF(H1975=\"Rectangular\",E1982*E1983*(E1986*E1989/100+E1988+E1987),\"error\")),IF(AND(E1975=\"Piping\",H1975=\"Pipe\"),PI()*(E1981/12/2)^2*E1982,IF(H1975=\"Circular\",IF(OR(E1975=\"Transfer Well\",E1975=\"Clearwell\"),E1993/7.4815,PI()*(E1981/2)^2*(2*E1984+E1985)/3),IF(H1975=\"Rectangular\",IF(OR(E1975=\"Transfer Well\",E1975=\"Clearwell\"),E1993/7.4815,E1982*E1983*E1984),E1994/7.4815))))*7.4815","v":0},"  gal"]
[null,"Flow Rate (each)",null,null,null,"  gpm"]
[null,"Detention Time",null,null,{"$f":"IF(OR(E1998=\"\",E1998=0),0,E1997/E1998)","v":0},"  min"]
[]
[null,"Baffling Factor",null,null,{"$f":"IF(I2002=\"Unbaffled\",0.1,IF(I2002=\"Poor\",0.3,IF(I2002=\"Average\",0.5,IF(I2002=\"Superior\",0.7,IF(I2002=\"Perfect\",1,IF(I2002=\"\",\" \",I2003))))))","v":0.1}]
[null,null,null,null,null,null,null,"Baffling Characteristics:  ","Unbaffled"]
[null,null,null,null,null,null,null,"Approved Baffling Factor:  "]
[null,"T10",null,null,{"$f":"E1999*E2001","v":0},"  min"]
[]
[null,"Unit - 4",null,"Type:",null,null,"Shape:"]
[]
[null,null,"Further Description:"]
[]
[null,"Characteristic",null,null,null,null,"Comments"]
[null,"Number of Units"]
[null,"Diameter",null,null,null,{"$f":"IF(H2006=\"pipe\",\"  in\",\"  ft\")","v":"  ft"}]
[null,"Length",null,null,null,"  ft"]
[null,"Width",null,null,null,"  ft"]
[null,"Side Water Depth",null,null,null,"  ft"]
[null,"Center Water Depth",null,null,null,"  ft"]
[null,"Media Depth",null,null,null,"  ft"]
[null,"Underdrain Depth",null,null,null,"  ft"]
[null,"Minimum Water Depth Over Media",null,null,null,"  ft"]
[null,"Average Porosity",null,null,null,"  %"]
[null,"Maximum Volume (each)",null,null,{"$f":"IF(OR(E2006=\"Clearwell\",E2006=\"Transfer Well\"),IF(H2006=\"Circular\",PI()*(E2012/2)^2*(2*E2015+E2016)/3*7.4815,IF(H2006=\"Rectangular\",E2013*E2014*E2015*7.4815,\"\")),\"\")","v":""},"  gal"]
[null,"Maximum Volume (each)",null,null,null,"  gal"]
[null,"Minimum Operating Level",null,null,null,"  ft"]
[null,"Worst Case Volume (each)",null,null,{"$f":"IF(OR(E2006=\"Transfer Well\",E2006=\"Clearwell\"),IF(H2006=\"Circular\",PI()*(E2012/2)^2*(2*E2023+E2016-(E2015-E2023))/3*7.4815,IF(H2006=\"Rectangular\",E2013*E2014*E2023*7.4815,\"\")),\"\")","v":""},"  gal"]
[null,{"$f":"IF(OR(E2006=\"Clearwell\",E2006=\"Transfer Well\"),\"Worst Case Volume (each)\", \"Volume (each)\")","v":"Volume (each)"},null,null,null,"  gal"]
[null,"Percent of Maximum Volume",null,null,{"$f":"IF(H2006=\"Other\",IF(E2022 = 0,\"\",E2025/E2022*100),IF(OR(E2006=\"Clearwell\",E2006=\"Transfer Well\"),IF(E2021 = 0,\"\",E2024/E2021*100),\"\"))","v":""},"  %"]
[]
[null,{"$f":" IF(OR(E2006=\"Clearwell\",E2006=\"Transfer Well\"),\"Worst Case Volume (each)\",\"Volume (each)\")","v":"Volume (each)"},null,null,{"$f":"IF(E2006=\"Filter\",IF(H2006=\"Circular\",PI()*(E2012/2)^2*(E2017*E2020/100+E2019+E2018),IF(H2006=\"Rectangular\",E2013*E2014*(E2017*E2020/100+E2019+E2018),\"error\")),IF(AND(E2006=\"Piping\",H2006=\"Pipe\"),PI()*(E2012/12/2)^2*E2013,IF(H2006=\"Circular\",IF(OR(E2006=\"Transfer Well\",E2006=\"Clearwell\"),E2024/7.4815,PI()*(E2012/2)^2*(2*E2015+E2016)/3),IF(H2006=\"Rectangular\",IF(OR(E2006=\"Transfer Well\",E2006=\"Clearwell\"),E2024/7.4815,E2013*E2014*E2015),E2025/7.4815))))*7.4815","v":0},"  gal"]
[null,"Flow Rate (each)",null,null,null,"  gpm"]
[null,"Detention Time",null,null,{"$f":"IF(OR(E2029=\"\",E2029=0),0,E2028/E2029)","v":0},"  min"]
[]
[null,"Baffling Factor",null,null,{"$f":"IF(I2033=\"Unbaffled\",0.1,IF(I2033=\"Poor\",0.3,IF(I2033=\"Average\",0.5,IF(I2033=\"Superior\",0.7,IF(I2033=\"Perfect\",1,IF(I2033=\"\",\" \",I2034))))))","v":0.1}]
[null,null,null,null,null,null,null,"Baffling Characteristics:  ","Unbaffled"]
[null,null,null,null,null,null,null,"Approved Baffling Factor:  "]
[null,"T10",null,null,{"$f":"E2030*E2032","v":0},"  min"]
[]
[null,"Unit - 5",null,"Type:",null,null,"Shape:"]
[]
[null,null,"Further Description:"]
[]
[null,"Characteristic",null,null,null,null,"Comments"]
[null,"Number of Units"]
[null,"Diameter",null,null,null,{"$f":"IF(H2037=\"pipe\",\"  in\",\"  ft\")","v":"  ft"}]
[null,"Length",null,null,null,"  ft"]
[null,"Width",null,null,null,"  ft"]
[null,"Side Water Depth",null,null,null,"  ft"]
[null,"Center Water Depth",null,null,null,"  ft"]
[null,"Media Depth",null,null,null,"  ft"]
[null,"Underdrain Depth",null,null,null,"  ft"]
[null,"Minimum Water Depth Over Media",null,null,null,"  ft"]
[null,"Average Porosity",null,null,null,"  %"]
[null,"Maximum Volume (each)",null,null,{"$f":"IF(OR(E2037=\"Clearwell\",E2037=\"Transfer Well\"),IF(H2037=\"Circular\",PI()*(E2043/2)^2*(2*E2046+E2047)/3*7.4815,IF(H2037=\"Rectangular\",E2044*E2045*E2046*7.4815,\"\")),\"\")","v":""},"  gal"]
[null,"Maximum Volume (each)",null,null,null,"  gal"]
[null,"Minimum Operating Level",null,null,null,"  ft"]
[null,"Worst Case Volume (each)",null,null,{"$f":"IF(OR(E2037=\"Transfer Well\",E2037=\"Clearwell\"),IF(H2037=\"Circular\",PI()*(E2043/2)^2*(2*E2054+E2047-(E2046-E2054))/3*7.4815,IF(H2037=\"Rectangular\",E2044*E2045*E2054*7.4815,\"\")),\"\")","v":""},"  gal"]
[null,{"$f":"IF(OR(E2037=\"Clearwell\",E2037=\"Transfer Well\"),\"Worst Case Volume (each)\", \"Volume (each)\")","v":"Volume (each)"},null,null,null,"  gal"]
[null,"Percent of Maximum Volume",null,null,{"$f":"IF(H2037=\"Other\",IF(E2053 = 0,\"\",E2056/E2053*100),IF(OR(E2037=\"Clearwell\",E2037=\"Transfer Well\"),IF(E2052 = 0,\"\",E2055/E2052*100),\"\"))","v":""},"  %"]
[]
[null,{"$f":" IF(OR(E2037=\"Clearwell\",E2037=\"Transfer Well\"),\"Worst Case Volume (each)\",\"Volume (each)\")","v":"Volume (each)"},null,null,{"$f":"IF(E2037=\"Filter\",IF(H2037=\"Circular\",PI()*(E2043/2)^2*(E2048*E2051/100+E2050+E2049),IF(H2037=\"Rectangular\",E2044*E2045*(E2048*E2051/100+E2050+E2049),\"error\")),IF(AND(E2037=\"Piping\",H2037=\"Pipe\"),PI()*(E2043/12/2)^2*E2044,IF(H2037=\"Circular\",IF(OR(E2037=\"Transfer Well\",E2037=\"Clearwell\"),E2055/7.4815,PI()*(E2043/2)^2*(2*E2046+E2047)/3),IF(H2037=\"Rectangular\",IF(OR(E2037=\"Transfer Well\",E2037=\"Clearwell\"),E2055/7.4815,E2044*E2045*E2046),E2056/7.4815))))*7.4815","v":0},"  gal"]
[null,"Flow Rate (each)",null,null,null,"  gpm"]
[null,"Detention Time",null,null,{"$f":"IF(OR(E2060=\"\",E2060=0),0,E2059/E2060)","v":0},"  min"]
[]
[null,"Baffling Factor",null,null,{"$f":"IF(I2064=\"Unbaffled\",0.1,IF(I2064=\"Poor\",0.3,IF(I2064=\"Average\",0.5,IF(I2064=\"Superior\",0.7,IF(I2064=\"Perfect\",1,IF(I2064=\"\",\" \",I2065))))))","v":0.1}]
[null,null,null,null,null,null,null,"Baffling Characteristics:  ","Unbaffled"]
[null,null,null,null,null,null,null,"Approved Baffling Factor:  "]
[null,"T10",null,null,{"$f":"E2061*E2063","v":0},"  min"]
[]
[null,"Unit - 6",null,"Type:",null,null,"Shape:"]
[]
[null,null,"Further Description:"]
[]
[null,"Characteristic",null,null,null,null,"Comments"]
[null,"Number of Units"]
[null,"Diameter",null,null,null,{"$f":"IF(H2068=\"pipe\",\"  in\",\"  ft\")","v":"  ft"}]
[null,"Length",null,null,null,"  ft"]
[null,"Width",null,null,null,"  ft"]
[null,"Side Water Depth",null,null,null,"  ft"]
[null,"Center Water Depth",null,null,null,"  ft"]
[null,"Media Depth",null,null,null,"  ft"]
[null,"Underdrain Depth",null,null,null,"  ft"]
[null,"Minimum Water Depth Over Media",null,null,null,"  ft"]
[null,"Average Porosity",null,null,null,"  %"]
[null,"Maximum Volume (each)",null,null,{"$f":"IF(OR(E2068=\"Clearwell\",E2068=\"Transfer Well\"),IF(H2068=\"Circular\",PI()*(E2074/2)^2*(2*E2077+E2078)/3*7.4815,IF(H2068=\"Rectangular\",E2075*E2076*E2077*7.4815,\"\")),\"\")","v":""},"  gal"]
[null,"Maximum Volume (each)",null,null,null,"  gal"]
[null,"Minimum Operating Level",null,null,null,"  ft"]
[null,"Worst Case Volume (each)",null,null,{"$f":"IF(OR(E2068=\"Transfer Well\",E2068=\"Clearwell\"),IF(H2068=\"Circular\",PI()*(E2074/2)^2*(2*E2085+E2078-(E2077-E2085))/3*7.4815,IF(H2068=\"Rectangular\",E2075*E2076*E2085*7.4815,\"\")),\"\")","v":""},"  gal"]
[null,{"$f":"IF(OR(E2068=\"Clearwell\",E2068=\"Transfer Well\"),\"Worst Case Volume (each)\", \"Volume (each)\")","v":"Volume (each)"},null,null,null,"  gal"]
[null,"Percent of Maximum Volume",null,null,{"$f":"IF(H2068=\"Other\",IF(E2084 = 0,\"\",E2087/E2084*100),IF(OR(E2068=\"Clearwell\",E2068=\"Transfer Well\"),IF(E2083 = 0,\"\",E2086/E2083*100),\"\"))","v":""},"  %"]
[]
[null,{"$f":" IF(OR(E2068=\"Clearwell\",E2068=\"Transfer Well\"),\"Worst Case Volume (each)\",\"Volume (each)\")","v":"Volume (each)"},null,null,{"$f":"IF(E2068=\"Filter\",IF(H2068=\"Circular\",PI()*(E2074/2)^2*(E2079*E2082/100+E2081+E2080),IF(H2068=\"Rectangular\",E2075*E2076*(E2079*E2082/100+E2081+E2080),\"error\")),IF(AND(E2068=\"Piping\",H2068=\"Pipe\"),PI()*(E2074/12/2)^2*E2075,IF(H2068=\"Circular\",IF(OR(E2068=\"Transfer Well\",E2068=\"Clearwell\"),E2086/7.4815,PI()*(E2074/2)^2*(2*E2077+E2078)/3),IF(H2068=\"Rectangular\",IF(OR(E2068=\"Transfer Well\",E2068=\"Clearwell\"),E2086/7.4815,E2075*E2076*E2077),E2087/7.4815))))*7.4815","v":0},"  gal"]
[null,"Flow Rate (each)",null,null,null,"  gpm"]
[null,"Detention Time",null,null,{"$f":"IF(OR(E2091=\"\",E2091=0),0,E2090/E2091)","v":0},"  min"]
[]
[null,"Baffling Factor",null,null,{"$f":"IF(I2095=\"Unbaffled\",0.1,IF(I2095=\"Poor\",0.3,IF(I2095=\"Average\",0.5,IF(I2095=\"Superior\",0.7,IF(I2095=\"Perfect\",1,IF(I2095=\"\",\" \",I2096))))))","v":0.1}]
[null,null,null,null,null,null,null,"Baffling Characteristics:  ","Unbaffled"]
[null,null,null,null,null,null,null,"Approved Baffling Factor:  "]
[null,"T10",null,null,{"$f":"E2092*E2094","v":0},"  min"]
[]
[null,"Unit - 7",null,"Type:",null,null,"Shape:"]
[]
[null,null,"Further Description:"]
[]
[null,"Characteristic",null,null,null,null,"Comments"]
[null,"Number of Units"]
[null,"Diameter",null,null,null,{"$f":"IF(H2099=\"pipe\",\"  in\",\"  ft\")","v":"  ft"}]
[null,"Length",null,null,null,"  ft"]
[null,"Width",null,null,null,"  ft"]
[null,"Side Water Depth",null,null,null,"  ft"]
[null,"Center Water Depth",null,null,null,"  ft"]
[null,"Media Depth",null,null,null,"  ft"]
[null,"Underdrain Depth",null,null,null,"  ft"]
[null,"Minimum Water Depth Over Media",null,null,null,"  ft"]
[null,"Average Porosity",null,null,null,"  %"]
[null,"Maximum Volume (each)",null,null,{"$f":"IF(OR(E2099=\"Clearwell\",E2099=\"Transfer Well\"),IF(H2099=\"Circular\",PI()*(E2105/2)^2*(2*E2108+E2109)/3*7.4815,IF(H2099=\"Rectangular\",E2106*E2107*E2108*7.4815,\"\")),\"\")","v":""},"  gal"]
[null,"Maximum Volume (each)",null,null,null,"  gal"]
[null,"Minimum Operating Level",null,null,null,"  ft"]
[null,"Worst Case Volume (each)",null,null,{"$f":"IF(OR(E2099=\"Transfer Well\",E2099=\"Clearwell\"),IF(H2099=\"Circular\",PI()*(E2105/2)^2*(2*E2116+E2109-(E2108-E2116))/3*7.4815,IF(H2099=\"Rectangular\",E2106*E2107*E2116*7.4815,\"\")),\"\")","v":""},"  gal"]
[null,{"$f":"IF(OR(E2099=\"Clearwell\",E2099=\"Transfer Well\"),\"Worst Case Volume (each)\", \"Volume (each)\")","v":"Volume (each)"},null,null,null,"  gal"]
[null,"Percent of Maximum Volume",null,null,{"$f":"IF(H2099=\"Other\",IF(E2115 = 0,\"\",E2118/E2115*100),IF(OR(E2099=\"Clearwell\",E2099=\"Transfer Well\"),IF(E2114 = 0,\"\",E2117/E2114*100),\"\"))","v":""},"  %"]
[]
[null,{"$f":" IF(OR(E2099=\"Clearwell\",E2099=\"Transfer Well\"),\"Worst Case Volume (each)\",\"Volume (each)\")","v":"Volume (each)"},null,null,{"$f":"IF(E2099=\"Filter\",IF(H2099=\"Circular\",PI()*(E2105/2)^2*(E2110*E2113/100+E2112+E2111),IF(H2099=\"Rectangular\",E2106*E2107*(E2110*E2113/100+E2112+E2111),\"error\")),IF(AND(E2099=\"Piping\",H2099=\"Pipe\"),PI()*(E2105/12/2)^2*E2106,IF(H2099=\"Circular\",IF(OR(E2099=\"Transfer Well\",E2099=\"Clearwell\"),E2117/7.4815,PI()*(E2105/2)^2*(2*E2108+E2109)/3),IF(H2099=\"Rectangular\",IF(OR(E2099=\"Transfer Well\",E2099=\"Clearwell\"),E2117/7.4815,E2106*E2107*E2108),E2118/7.4815))))*7.4815","v":0},"  gal"]
[null,"Flow Rate (each)",null,null,null,"  gpm"]
[null,"Detention Time",null,null,{"$f":"IF(OR(E2122=\"\",E2122=0),0,E2121/E2122)","v":0},"  min"]
[]
[null,"Baffling Factor",null,null,{"$f":"IF(I2126=\"Unbaffled\",0.1,IF(I2126=\"Poor\",0.3,IF(I2126=\"Average\",0.5,IF(I2126=\"Superior\",0.7,IF(I2126=\"Perfect\",1,IF(I2126=\"\",\" \",I2127))))))","v":0.1}]
[null,null,null,null,null,null,null,"Baffling Characteristics:  ","Unbaffled"]
[null,null,null,null,null,null,null,"Approved Baffling Factor:  "]
[null,"T10",null,null,{"$f":"E2123*E2125","v":0},"  min"]
[]
[null,"Unit - 8",null,"Type:",null,null,"Shape:"]
[]
[null,null,"Further Description:"]
[]
[null,"Characteristic",null,null,null,null,"Comments"]
[null,"Number of Units"]
[null,"Diameter",null,null,null,{"$f":"IF(H2130=\"pipe\",\"  in\",\"  ft\")","v":"  ft"}]
[null,"Length",null,null,null,"  ft"]
[null,"Width",null,null,null,"  ft"]
[null,"Side Water Depth",null,null,null,"  ft"]
[null,"Center Water Depth",null,null,null,"  ft"]
[null,"Media Depth",null,null,null,"  ft"]
[null,"Underdrain Depth",null,null,null,"  ft"]
[null,"Minimum Water Depth Over Media",null,null,null,"  ft"]
[null,"Average Porosity",null,null,null,"  %"]
[null,"Maximum Volume (each)",null,null,{"$f":"IF(OR(E2130=\"Clearwell\",E2130=\"Transfer Well\"),IF(H2130=\"Circular\",PI()*(E2136/2)^2*(2*E2139+E2140)/3*7.4815,IF(H2130=\"Rectangular\",E2137*E2138*E2139*7.4815,\"\")),\"\")","v":""},"  gal"]
[null,"Maximum Volume (each)",null,null,null,"  gal"]
[null,"Minimum Operating Level",null,null,null,"  ft"]
[null,"Worst Case Volume (each)",null,null,{"$f":"IF(OR(E2130=\"Transfer Well\",E2130=\"Clearwell\"),IF(H2130=\"Circular\",PI()*(E2136/2)^2*(2*E2147+E2140-(E2139-E2147))/3*7.4815,IF(H2130=\"Rectangular\",E2137*E2138*E2147*7.4815,\"\")),\"\")","v":""},"  gal"]
[null,{"$f":"IF(OR(E2130=\"Clearwell\",E2130=\"Transfer Well\"),\"Worst Case Volume (each)\", \"Volume (each)\")","v":"Volume (each)"},null,null,null,"  gal"]
[null,"Percent of Maximum Volume",null,null,{"$f":"IF(H2130=\"Other\",IF(E2146 = 0,\"\",E2149/E2146*100),IF(OR(E2130=\"Clearwell\",E2130=\"Transfer Well\"),IF(E2145 = 0,\"\",E2148/E2145*100),\"\"))","v":""},"  %"]
[]
[null,{"$f":" IF(OR(E2130=\"Clearwell\",E2130=\"Transfer Well\"),\"Worst Case Volume (each)\",\"Volume (each)\")","v":"Volume (each)"},null,null,{"$f":"IF(E2130=\"Filter\",IF(H2130=\"Circular\",PI()*(E2136/2)^2*(E2141*E2144/100+E2143+E2142),IF(H2130=\"Rectangular\",E2137*E2138*(E2141*E2144/100+E2143+E2142),\"error\")),IF(AND(E2130=\"Piping\",H2130=\"Pipe\"),PI()*(E2136/12/2)^2*E2137,IF(H2130=\"Circular\",IF(OR(E2130=\"Transfer Well\",E2130=\"Clearwell\"),E2148/7.4815,PI()*(E2136/2)^2*(2*E2139+E2140)/3),IF(H2130=\"Rectangular\",IF(OR(E2130=\"Transfer Well\",E2130=\"Clearwell\"),E2148/7.4815,E2137*E2138*E2139),E2149/7.4815))))*7.4815","v":0},"  gal"]
[null,"Flow Rate (each)",null,null,null,"  gpm"]
[null,"Detention Time",null,null,{"$f":"IF(OR(E2153=\"\",E2153=0),0,E2152/E2153)","v":0},"  min"]
[]
[null,"Baffling Factor",null,null,{"$f":"IF(I2157=\"Unbaffled\",0.1,IF(I2157=\"Poor\",0.3,IF(I2157=\"Average\",0.5,IF(I2157=\"Superior\",0.7,IF(I2157=\"Perfect\",1,IF(I2157=\"\",\" \",I2158))))))","v":0.1}]
[null,null,null,null,null,null,null,"Baffling Characteristics:  ","Unbaffled"]
[null,null,null,null,null,null,null,"Approved Baffling Factor:  "]
[null,"T10",null,null,{"$f":"E2154*E2156","v":0},"  min"]
[]
[null,"Unit - 9",null,"Type:",null,null,"Shape:"]
[]
[null,null,"Further Description:"]
[]
[null,"Characteristic",null,null,null,null,"Comments"]
[null,"Number of Units"]
[null,"Diameter",null,null,null,{"$f":"IF(H2161=\"pipe\",\"  in\",\"  ft\")","v":"  ft"}]
[null,"Length",null,null,null,"  ft"]
[null,"Width",null,null,null,"  ft"]
[null,"Side Water Depth",null,null,null,"  ft"]
[null,"Center Water Depth",null,null,null,"  ft"]
[null,"Media Depth",null,null,null,"  ft"]
[null,"Underdrain Depth",null,null,null,"  ft"]
[null,"Minimum Water Depth Over Media",null,null,null,"  ft"]
[null,"Average Porosity",null,null,null,"  %"]
[null,"Maximum Volume (each)",null,null,{"$f":"IF(OR(E2161=\"Clearwell\",E2161=\"Transfer Well\"),IF(H2161=\"Circular\",PI()*(E2167/2)^2*(2*E2170+E2171)/3*7.4815,IF(H2161=\"Rectangular\",E2168*E2169*E2170*7.4815,\"\")),\"\")","v":""},"  gal"]
[null,"Maximum Volume (each)",null,null,null,"  gal"]
[null,"Minimum Operating Level",null,null,null,"  ft"]
[null,"Worst Case Volume (each)",null,null,{"$f":"IF(OR(E2161=\"Transfer Well\",E2161=\"Clearwell\"),IF(H2161=\"Circular\",PI()*(E2167/2)^2*(2*E2178+E2171-(E2170-E2178))/3*7.4815,IF(H2161=\"Rectangular\",E2168*E2169*E2178*7.4815,\"\")),\"\")","v":""},"  gal"]
[null,{"$f":"IF(OR(E2161=\"Clearwell\",E2161=\"Transfer Well\"),\"Worst Case Volume (each)\", \"Volume (each)\")","v":"Volume (each)"},null,null,null,"  gal"]
[null,"Percent of Maximum Volume",null,null,{"$f":"IF(H2161=\"Other\",IF(E2177 = 0,\"\",E2180/E2177*100),IF(OR(E2161=\"Clearwell\",E2161=\"Transfer Well\"),IF(E2176 = 0,\"\",E2179/E2176*100),\"\"))","v":""},"  %"]
[]
[null,{"$f":" IF(OR(E2161=\"Clearwell\",E2161=\"Transfer Well\"),\"Worst Case Volume (each)\",\"Volume (each)\")","v":"Volume (each)"},null,null,{"$f":"IF(E2161=\"Filter\",IF(H2161=\"Circular\",PI()*(E2167/2)^2*(E2172*E2175/100+E2174+E2173),IF(H2161=\"Rectangular\",E2168*E2169*(E2172*E2175/100+E2174+E2173),\"error\")),IF(AND(E2161=\"Piping\",H2161=\"Pipe\"),PI()*(E2167/12/2)^2*E2168,IF(H2161=\"Circular\",IF(OR(E2161=\"Transfer Well\",E2161=\"Clearwell\"),E2179/7.4815,PI()*(E2167/2)^2*(2*E2170+E2171)/3),IF(H2161=\"Rectangular\",IF(OR(E2161=\"Transfer Well\",E2161=\"Clearwell\"),E2179/7.4815,E2168*E2169*E2170),E2180/7.4815))))*7.4815","v":0},"  gal"]
[null,"Flow Rate (each)",null,null,null,"  gpm"]
[null,"Detention Time",null,null,{"$f":"IF(OR(E2184=\"\",E2184=0),0,E2183/E2184)","v":0},"  min"]
[]
[null,"Baffling Factor",null,null,{"$f":"IF(I2188=\"Unbaffled\",0.1,IF(I2188=\"Poor\",0.3,IF(I2188=\"Average\",0.5,IF(I2188=\"Superior\",0.7,IF(I2188=\"Perfect\",1,IF(I2188=\"\",\" \",I2189))))))","v":0.1}]
[null,null,null,null,null,null,null,"Baffling Characteristics:  ","Unbaffled"]
[null,null,null,null,null,null,null,"Approved Baffling Factor:  "]
[null,"T10",null,null,{"$f":"E2185*E2187","v":0},"  min"]
[]
[null,"Unit - 10",null,"Type:",null,null,"Shape:"]
[]
[null,null,"Further Description:"]
[]
[null,"Characteristic",null,null,null,null,"Comments"]
[null,"Number of Units"]
[null,"Diameter",null,null,null,{"$f":"IF(H2192=\"pipe\",\"  in\",\"  ft\")","v":"  ft"}]
[null,"Length",null,null,null,"  ft"]
[null,"Width",null,null,null,"  ft"]
[null,"Side Water Depth",null,null,null,"  ft"]
[null,"Center Water Depth",null,null,null,"  ft"]
[null,"Media Depth",null,null,null,"  ft"]
[null,"Underdrain Depth",null,null,null,"  ft"]
[null,"Minimum Water Depth Over Media",null,null,null,"  ft"]
[null,"Average Porosity",null,null,null,"  %"]
[null,"Maximum Volume (each)",null,null,{"$f":"IF(OR(E2192=\"Clearwell\",E2192=\"Transfer Well\"),IF(H2192=\"Circular\",PI()*(E2198/2)^2*(2*E2201+E2202)/3*7.4815,IF(H2192=\"Rectangular\",E2199*E2200*E2201*7.4815,\"\")),\"\")","v":""},"  gal"]
[null,"Maximum Volume (each)",null,null,null,"  gal"]
[null,"Minimum Operating Level",null,null,null,"  ft"]
[null,"Worst Case Volume (each)",null,null,{"$f":"IF(OR(E2192=\"Transfer Well\",E2192=\"Clearwell\"),IF(H2192=\"Circular\",PI()*(E2198/2)^2*(2*E2209+E2202-(E2201-E2209))/3*7.4815,IF(H2192=\"Rectangular\",E2199*E2200*E2209*7.4815,\"\")),\"\")","v":""},"  gal"]
[null,{"$f":"IF(OR(E2192=\"Clearwell\",E2192=\"Transfer Well\"),\"Worst Case Volume (each)\", \"Volume (each)\")","v":"Volume (each)"},null,null,null,"  gal"]
[null,"Percent of Maximum Volume",null,null,{"$f":"IF(H2192=\"Other\",IF(E2208 = 0,\"\",E2211/E2208*100),IF(OR(E2192=\"Clearwell\",E2192=\"Transfer Well\"),IF(E2207 =0,\"\",E2210/E2207*100),\"\"))","v":""},"  %"]
[]
[null,{"$f":" IF(OR(E2192=\"Clearwell\",E2192=\"Transfer Well\"),\"Worst Case Volume (each)\",\"Volume (each)\")","v":"Volume (each)"},null,null,{"$f":"IF(E2192=\"Filter\",IF(H2192=\"Circular\",PI()*(E2198/2)^2*(E2203*E2206/100+E2205+E2204),IF(H2192=\"Rectangular\",E2199*E2200*(E2203*E2206/100+E2205+E2204),\"error\")),IF(AND(E2192=\"Piping\",H2192=\"Pipe\"),PI()*(E2198/12/2)^2*E2199,IF(H2192=\"Circular\",IF(OR(E2192=\"Transfer Well\",E2192=\"Clearwell\"),E2210/7.4815,PI()*(E2198/2)^2*(2*E2201+E2202)/3),IF(H2192=\"Rectangular\",IF(OR(E2192=\"Transfer Well\",E2192=\"Clearwell\"),E2210/7.4815,E2199*E2200*E2201),E2211/7.4815))))*7.4815","v":0},"  gal"]
[null,"Flow Rate (each)",null,null,null,"  gpm"]
[null,"Detention Time",null,null,{"$f":"IF(OR(E2215=\"\",E2215=0),0,E2214/E2215)","v":0},"  min"]
[]
[null,"Baffling Factor",null,null,{"$f":"IF(I2219=\"Unbaffled\",0.1,IF(I2219=\"Poor\",0.3,IF(I2219=\"Average\",0.5,IF(I2219=\"Superior\",0.7,IF(I2219=\"Perfect\",1,IF(I2219=\"\",\" \",I2220))))))","v":0.1}]
[null,null,null,null,null,null,null,"Baffling Characteristics:  ","Unbaffled"]
[null,null,null,null,null,null,null,"Approved Baffling Factor:  "]
[null,"T10",null,null,{"$f":"E2216*E2218","v":0},"  min"]
[]
[null,{"$f":"CONCATENATE(D1911,\" FLOW RATE\")","v":"D7 FLOW RATE"},null,null,{"$f":"MaxUnitFlow(E1942,E1973,E2004,E2035,E2066,E2097,E2128,E2159,E2190,E2221,E1936,E1967,E1998,E2029,E2060,E2091,E2122,E2153,E2184,E2215)*60*24/10^6","v":0},"  mgd"]
[]
[null,{"$f":"CONCATENATE(\"T10 SUM FOR \",D1911)","v":"T10 SUM FOR D7"},null,null,{"$f":"SUM(E1942,E1973,E2004,E2035,E2066,E2097,E2128,E2159,E2190,E2221)","v":0},"  min"]
[]
["Disinfection Zone:",null,null,{"$f":"CONCATENATE(\"D\",Calculator!$BK$6)","v":"D8"},null,"Disinfectant:"]
[]
[null,"Unit - 1",null,"Type:",null,null,"Shape:"]
[]
[null,null,"Further Description:"]
[]
[null,"Characteristic",null,null,null,null,"Comments"]
[null,"Number of Units"]
[null,"Diameter",null,null,null,{"$f":"IF(H2229=\"pipe\",\"  in\",\"  ft\")","v":"  ft"}]
[null,"Length",null,null,null,"  ft"]
[null,"Width",null,null,null,"  ft"]
[null,"Side Water Depth",null,null,null,"  ft"]
[null,"Center Water Depth",null,null,null,"  ft"]
[null,"Media Depth",null,null,null,"  ft"]
[null,"Underdrain Depth",null,null,null,"  ft"]
[null,"Minimum Water Depth Over Media",null,null,null,"  ft"]
[null,"Average Porosity",null,null,null,"  %"]
[null,"Maximum Volume (each)",null,null,{"$f":"IF(OR(E2229=\"Clearwell\",E2229=\"Transfer Well\"),IF(H2229=\"Circular\",PI()*(E2235/2)^2*(2*E2238+E2239)/3*7.4815,IF(H2229=\"Rectangular\",E2236*E2237*E2238*7.4815,\"\")),\"\")","v":""},"  gal"]
[null,"Maximum Volume (each)",null,null,null,"  gal"]
[null,"Minimum Operating Level",null,null,null,"  ft"]
[null,"Worst Case Volume (each)",null,null,{"$f":"IF(OR(E2229=\"Transfer Well\",E2229=\"Clearwell\"),IF(H2229=\"Circular\",PI()*(E2235/2)^2*(2*E2246+E2239-(E2238-E2246))/3*7.4815,IF(H2229=\"Rectangular\",E2236*E2237*E2246*7.4815,\"\")),\"\")","v":""},"  gal"]
[null,{"$f":"IF(OR(E2229=\"Clearwell\",E2229=\"Transfer Well\"),\"Worst Case Volume (each)\", \"Volume (each)\")","v":"Volume (each)"},null,null,null,"  gal"]
[null,"Percent of Maximum Volume",null,null,{"$f":"IF(H2229=\"Other\",IF(E2245 = 0,\"\",E2248/E2245*100),IF(OR(E2229=\"Clearwell\",E2229=\"Transfer Well\"),IF(E2244 = 0,\"\",E2247/E2244*100),\"\"))","v":""},"  %"]
[]
[null,{"$f":" IF(OR(E2229=\"Clearwell\",E2229=\"Transfer Well\"),\"Worst Case Volume (each)\",\"Volume (each)\")","v":"Volume (each)"},null,null,{"$f":"IF(E2229=\"Filter\",IF(H2229=\"Circular\",PI()*(E2235/2)^2*(E2240*E2243/100+E2242+E2241),IF(H2229=\"Rectangular\",E2236*E2237*(E2240*E2243/100+E2242+E2241),\"error\")),IF(AND(E2229=\"Piping\",H2229=\"Pipe\"),PI()*(E2235/12/2)^2*E2236,IF(H2229=\"Circular\",IF(OR(E2229=\"Transfer Well\",E2229=\"Clearwell\"),E2247/7.4815,PI()*(E2235/2)^2*(2*E2238+E2239)/3),IF(H2229=\"Rectangular\",IF(OR(E2229=\"Transfer Well\",E2229=\"Clearwell\"),E2247/7.4815,E2236*E2237*E2238),E2248/7.4815))))*7.4815","v":0},"  gal"]
[null,"Flow Rate (each)",null,null,null,"  gpm"]
[null,"Detention Time",null,null,{"$f":"IF(OR(E2252=\"\",E2252=0),0,E2251/E2252)","v":0},"  min"]
[]
[null,"Baffling Factor",null,null,{"$f":"IF(I2256=\"Unbaffled\",0.1,IF(I2256=\"Poor\",0.3,IF(I2256=\"Average\",0.5,IF(I2256=\"Superior\",0.7,IF(I2256=\"Perfect\",1,IF(I2256=\"\",\" \",I2257))))))","v":0.1}]
[null,null,null,null,null,null,null,"Baffling Characteristics:  ","Unbaffled"]
[null,null,null,null,null,null,null,"Approved Baffling Factor:  "]
[null,"T10",null,null,{"$f":"E2253*E2255","v":0},"  min"]
[]
[null,"Unit - 2",null,"Type:",null,null,"Shape:"]
[]
[null,null,"Further Description:"]
[]
[null,"Characteristic",null,null,null,null,"Comments"]
[null,"Number of Units"]
[null,"Diameter",null,null,null,{"$f":"IF(H2260=\"pipe\",\"  in\",\"  ft\")","v":"  ft"}]
[null,"Length",null,null,null,"  ft"]
[null,"Width",null,null,null,"  ft"]
[null,"Side Water Depth",null,null,null,"  ft"]
[null,"Center Water Depth",null,null,null,"  ft"]
[null,"Media Depth",null,null,null,"  ft"]
[null,"Underdrain Depth",null,null,null,"  ft"]
[null,"Minimum Water Depth Over Media",null,null,null,"  ft"]
[null,"Average Porosity",null,null,null,"  %"]
[null,"Maximum Volume (each)",null,null,{"$f":"IF(OR(E2260=\"Clearwell\",E2260=\"Transfer Well\"),IF(H2260=\"Circular\",PI()*(E2266/2)^2*(2*E2269+E2270)/3*7.4815,IF(H2260=\"Rectangular\",E2267*E2268*E2269*7.4815,\"\")),\"\")","v":""},"  gal"]
[null,"Maximum Volume (each)",null,null,null,"  gal"]
[null,"Minimum Operating Level",null,null,null,"  ft"]
[null,"Worst Case Volume (each)",null,null,{"$f":"IF(OR(E2260=\"Transfer Well\",E2260=\"Clearwell\"),IF(H2260=\"Circular\",PI()*(E2266/2)^2*(2*E2277+E2270-(E2269-E2277))/3*7.4815,IF(H2260=\"Rectangular\",E2267*E2268*E2277*7.4815,\"\")),\"\")","v":""},"  gal"]
[null,{"$f":"IF(OR(E2260=\"Clearwell\",E2260=\"Transfer Well\"),\"Worst Case Volume (each)\", \"Volume (each)\")","v":"Volume (each)"},null,null,null,"  gal"]
[null,"Percent of Maximum Volume",null,null,{"$f":"IF(H2260=\"Other\",IF(E2276 = 0,\"\",E2279/E2276*100),IF(OR(E2260=\"Clearwell\",E2260=\"Transfer Well\"),IF(E2275 =0,\"\",E2278/E2275*100),\"\"))","v":""},"  %"]
[]
[null,{"$f":" IF(OR(E2260=\"Clearwell\",E2260=\"Transfer Well\"),\"Worst Case Volume (each)\",\"Volume (each)\")","v":"Volume (each)"},null,null,{"$f":"IF(E2260=\"Filter\",IF(H2260=\"Circular\",PI()*(E2266/2)^2*(E2271*E2274/100+E2273+E2272),IF(H2260=\"Rectangular\",E2267*E2268*(E2271*E2274/100+E2273+E2272),\"error\")),IF(AND(E2260=\"Piping\",H2260=\"Pipe\"),PI()*(E2266/12/2)^2*E2267,IF(H2260=\"Circular\",IF(OR(E2260=\"Transfer Well\",E2260=\"Clearwell\"),E2278/7.4815,PI()*(E2266/2)^2*(2*E2269+E2270)/3),IF(H2260=\"Rectangular\",IF(OR(E2260=\"Transfer Well\",E2260=\"Clearwell\"),E2278/7.4815,E2267*E2268*E2269),E2279/7.4815))))*7.4815","v":0},"  gal"]
[null,"Flow Rate (each)",null,null,null,"  gpm"]
[null,"Detention Time",null,null,{"$f":"IF(OR(E2283=\"\",E2283=0),0,E2282/E2283)","v":0},"  min"]
[]
[null,"Baffling Factor",null,null,{"$f":"IF(I2287=\"Unbaffled\",0.1,IF(I2287=\"Poor\",0.3,IF(I2287=\"Average\",0.5,IF(I2287=\"Superior\",0.7,IF(I2287=\"Perfect\",1,IF(I2287=\"\",\" \",I2288))))))","v":0.1}]
[null,null,null,null,null,null,null,"Baffling Characteristics:  ","Unbaffled"]
[null,null,null,null,null,null,null,"Approved Baffling Factor:  "]
[null,"T10",null,null,{"$f":"E2284*E2286","v":0},"  min"]
[]
[null,"Unit - 3",null,"Type:",null,null,"Shape:"]
[]
[null,null,"Further Description:"]
[]
[null,"Characteristic",null,null,null,null,"Comments"]
[null,"Number of Units"]
[null,"Diameter",null,null,null,{"$f":"IF(H2291=\"pipe\",\"  in\",\"  ft\")","v":"  ft"}]
[null,"Length",null,null,null,"  ft"]
[null,"Width",null,null,null,"  ft"]
[null,"Side Water Depth",null,null,null,"  ft"]
[null,"Center Water Depth",null,null,null,"  ft"]
[null,"Media Depth",null,null,null,"  ft"]
[null,"Underdrain Depth",null,null,null,"  ft"]
[null,"Minimum Water Depth Over Media",null,null,null,"  ft"]
[null,"Average Porosity",null,null,null,"  %"]
[null,"Maximum Volume (each)",null,null,{"$f":"IF(OR(E2291=\"Clearwell\",E2291=\"Transfer Well\"),IF(H2291=\"Circular\",PI()*(E2297/2)^2*(2*E2300+E2301)/3*7.4815,IF(H2291=\"Rectangular\",E2298*E2299*E2300*7.4815,\"\")),\"\")","v":""},"  gal"]
[null,"Maximum Volume (each)",null,null,null,"  gal"]
[null,"Minimum Operating Level",null,null,null,"  ft"]
[null,"Worst Case Volume (each)",null,null,{"$f":"IF(OR(E2291=\"Transfer Well\",E2291=\"Clearwell\"),IF(H2291=\"Circular\",PI()*(E2297/2)^2*(2*E2308+E2301-(E2300-E2308))/3*7.4815,IF(H2291=\"Rectangular\",E2298*E2299*E2308*7.4815,\"\")),\"\")","v":""},"  gal"]
[null,{"$f":"IF(OR(E2291=\"Clearwell\",E2291=\"Transfer Well\"),\"Worst Case Volume (each)\", \"Volume (each)\")","v":"Volume (each)"},null,null,null,"  gal"]
[null,"Percent of Maximum Volume",null,null,{"$f":"IF(H2291=\"Other\",IF(E2307 = 0,\"\",E2310/E2307*100),IF(OR(E2291=\"Clearwell\",E2291=\"Transfer Well\"),IF(E2306 = 0,\"\",E2309/E2306*100),\"\"))","v":""},"  %"]
[]
[null,{"$f":" IF(OR(E2291=\"Clearwell\",E2291=\"Transfer Well\"),\"Worst Case Volume (each)\",\"Volume (each)\")","v":"Volume (each)"},null,null,{"$f":"IF(E2291=\"Filter\",IF(H2291=\"Circular\",PI()*(E2297/2)^2*(E2302*E2305/100+E2304+E2303),IF(H2291=\"Rectangular\",E2298*E2299*(E2302*E2305/100+E2304+E2303),\"error\")),IF(AND(E2291=\"Piping\",H2291=\"Pipe\"),PI()*(E2297/12/2)^2*E2298,IF(H2291=\"Circular\",IF(OR(E2291=\"Transfer Well\",E2291=\"Clearwell\"),E2309/7.4815,PI()*(E2297/2)^2*(2*E2300+E2301)/3),IF(H2291=\"Rectangular\",IF(OR(E2291=\"Transfer Well\",E2291=\"Clearwell\"),E2309/7.4815,E2298*E2299*E2300),E2310/7.4815))))*7.4815","v":0},"  gal"]
[null,"Flow Rate (each)",null,null,null,"  gpm"]
[null,"Detention Time",null,null,{"$f":"IF(OR(E2314=\"\",E2314=0),0,E2313/E2314)","v":0},"  min"]
[]
[null,"Baffling Factor",null,null,{"$f":"IF(I2318=\"Unbaffled\",0.1,IF(I2318=\"Poor\",0.3,IF(I2318=\"Average\",0.5,IF(I2318=\"Superior\",0.7,IF(I2318=\"Perfect\",1,IF(I2318=\"\",\" \",I2319))))))","v":0.1}]
[null,null,null,null,null,null,null,"Baffling Characteristics:  ","Unbaffled"]
[null,null,null,null,null,null,null,"Approved Baffling Factor:  "]
[null,"T10",null,null,{"$f":"E2315*E2317","v":0},"  min"]
[]
[null,"Unit - 4",null,"Type:",null,null,"Shape:"]
[]
[null,null,"Further Description:"]
[]
[null,"Characteristic",null,null,null,null,"Comments"]
[null,"Number of Units"]
[null,"Diameter",null,null,null,{"$f":"IF(H2322=\"pipe\",\"  in\",\"  ft\")","v":"  ft"}]
[null,"Length",null,null,null,"  ft"]
[null,"Width",null,null,null,"  ft"]
[null,"Side Water Depth",null,null,null,"  ft"]
[null,"Center Water Depth",null,null,null,"  ft"]
[null,"Media Depth",null,null,null,"  ft"]
[null,"Underdrain Depth",null,null,null,"  ft"]
[null,"Minimum Water Depth Over Media",null,null,null,"  ft"]
[null,"Average Porosity",null,null,null,"  %"]
[null,"Maximum Volume (each)",null,null,{"$f":"IF(OR(E2322=\"Clearwell\",E2322=\"Transfer Well\"),IF(H2322=\"Circular\",PI()*(E2328/2)^2*(2*E2331+E2332)/3*7.4815,IF(H2322=\"Rectangular\",E2329*E2330*E2331*7.4815,\"\")),\"\")","v":""},"  gal"]
[null,"Maximum Volume (each)",null,null,null,"  gal"]
[null,"Minimum Operating Level",null,null,null,"  ft"]
[null,"Worst Case Volume (each)",null,null,{"$f":"IF(OR(E2322=\"Transfer Well\",E2322=\"Clearwell\"),IF(H2322=\"Circular\",PI()*(E2328/2)^2*(2*E2339+E2332-(E2331-E2339))/3*7.4815,IF(H2322=\"Rectangular\",E2329*E2330*E2339*7.4815,\"\")),\"\")","v":""},"  gal"]
[null,{"$f":"IF(OR(E2322=\"Clearwell\",E2322=\"Transfer Well\"),\"Worst Case Volume (each)\", \"Volume (each)\")","v":"Volume (each)"},null,null,null,"  gal"]
[null,"Percent of Maximum Volume",null,null,{"$f":"IF(H2322=\"Other\",IF(E2338 = 0,\"\",E2341/E2338*100),IF(OR(E2322=\"Clearwell\",E2322=\"Transfer Well\"),IF(E2337 = 0,\"\",E2340/E2337*100),\"\"))","v":""},"  %"]
[]
[null,{"$f":" IF(OR(E2322=\"Clearwell\",E2322=\"Transfer Well\"),\"Worst Case Volume (each)\",\"Volume (each)\")","v":"Volume (each)"},null,null,{"$f":"IF(E2322=\"Filter\",IF(H2322=\"Circular\",PI()*(E2328/2)^2*(E2333*E2336/100+E2335+E2334),IF(H2322=\"Rectangular\",E2329*E2330*(E2333*E2336/100+E2335+E2334),\"error\")),IF(AND(E2322=\"Piping\",H2322=\"Pipe\"),PI()*(E2328/12/2)^2*E2329,IF(H2322=\"Circular\",IF(OR(E2322=\"Transfer Well\",E2322=\"Clearwell\"),E2340/7.4815,PI()*(E2328/2)^2*(2*E2331+E2332)/3),IF(H2322=\"Rectangular\",IF(OR(E2322=\"Transfer Well\",E2322=\"Clearwell\"),E2340/7.4815,E2329*E2330*E2331),E2341/7.4815))))*7.4815","v":0},"  gal"]
[null,"Flow Rate (each)",null,null,null,"  gpm"]
[null,"Detention Time",null,null,{"$f":"IF(OR(E2345=\"\",E2345=0),0,E2344/E2345)","v":0},"  min"]
[]
[null,"Baffling Factor",null,null,{"$f":"IF(I2349=\"Unbaffled\",0.1,IF(I2349=\"Poor\",0.3,IF(I2349=\"Average\",0.5,IF(I2349=\"Superior\",0.7,IF(I2349=\"Perfect\",1,IF(I2349=\"\",\" \",I2350))))))","v":0.1}]
[null,null,null,null,null,null,null,"Baffling Characteristics:  ","Unbaffled"]
[null,null,null,null,null,null,null,"Approved Baffling Factor:  "]
[null,"T10",null,null,{"$f":"E2346*E2348","v":0},"  min"]
[]
[null,"Unit - 5",null,"Type:",null,null,"Shape:"]
[]
[null,null,"Further Description:"]
[]
[null,"Characteristic",null,null,null,null,"Comments"]
[null,"Number of Units"]
[null,"Diameter",null,null,null,{"$f":"IF(H2353=\"pipe\",\"  in\",\"  ft\")","v":"  ft"}]
[null,"Length",null,null,null,"  ft"]
[null,"Width",null,null,null,"  ft"]
[null,"Side Water Depth",null,null,null,"  ft"]
[null,"Center Water Depth",null,null,null,"  ft"]
[null,"Media Depth",null,null,null,"  ft"]
[null,"Underdrain Depth",null,null,null,"  ft"]
[null,"Minimum Water Depth Over Media",null,null,null,"  ft"]
[null,"Average Porosity",null,null,null,"  %"]
[null,"Maximum Volume (each)",null,null,{"$f":"IF(OR(E2353=\"Clearwell\",E2353=\"Transfer Well\"),IF(H2353=\"Circular\",PI()*(E2359/2)^2*(2*E2362+E2363)/3*7.4815,IF(H2353=\"Rectangular\",E2360*E2361*E2362*7.4815,\"\")),\"\")","v":""},"  gal"]
[null,"Maximum Volume (each)",null,null,null,"  gal"]
[null,"Minimum Operating Level",null,null,null,"  ft"]
[null,"Worst Case Volume (each)",null,null,{"$f":"IF(OR(E2353=\"Transfer Well\",E2353=\"Clearwell\"),IF(H2353=\"Circular\",PI()*(E2359/2)^2*(2*E2370+E2363-(E2362-E2370))/3*7.4815,IF(H2353=\"Rectangular\",E2360*E2361*E2370*7.4815,\"\")),\"\")","v":""},"  gal"]
[null,{"$f":"IF(OR(E2353=\"Clearwell\",E2353=\"Transfer Well\"),\"Worst Case Volume (each)\", \"Volume (each)\")","v":"Volume (each)"},null,null,null,"  gal"]
[null,"Percent of Maximum Volume",null,null,{"$f":"IF(H2353=\"Other\",IF(E2369 = 0,\"\",E2372/E2369*100),IF(OR(E2353=\"Clearwell\",E2353=\"Transfer Well\"),IF(E2368 = 0,\"\",E2371/E2368*100),\"\"))","v":""},"  %"]
[]
[null,{"$f":" IF(OR(E2353=\"Clearwell\",E2353=\"Transfer Well\"),\"Worst Case Volume (each)\",\"Volume (each)\")","v":"Volume (each)"},null,null,{"$f":"IF(E2353=\"Filter\",IF(H2353=\"Circular\",PI()*(E2359/2)^2*(E2364*E2367/100+E2366+E2365),IF(H2353=\"Rectangular\",E2360*E2361*(E2364*E2367/100+E2366+E2365),\"error\")),IF(AND(E2353=\"Piping\",H2353=\"Pipe\"),PI()*(E2359/12/2)^2*E2360,IF(H2353=\"Circular\",IF(OR(E2353=\"Transfer Well\",E2353=\"Clearwell\"),E2371/7.4815,PI()*(E2359/2)^2*(2*E2362+E2363)/3),IF(H2353=\"Rectangular\",IF(OR(E2353=\"Transfer Well\",E2353=\"Clearwell\"),E2371/7.4815,E2360*E2361*E2362),E2372/7.4815))))*7.4815","v":0},"  gal"]
[null,"Flow Rate (each)",null,null,null,"  gpm"]
[null,"Detention Time",null,null,{"$f":"IF(OR(E2376=\"\",E2376=0),0,E2375/E2376)","v":0},"  min"]
[]
[null,"Baffling Factor",null,null,{"$f":"IF(I2380=\"Unbaffled\",0.1,IF(I2380=\"Poor\",0.3,IF(I2380=\"Average\",0.5,IF(I2380=\"Superior\",0.7,IF(I2380=\"Perfect\",1,IF(I2380=\"\",\" \",I2381))))))","v":0.1}]
[null,null,null,null,null,null,null,"Baffling Characteristics:  ","Unbaffled"]
[null,null,null,null,null,null,null,"Approved Baffling Factor:  "]
[null,"T10",null,null,{"$f":"E2377*E2379","v":0},"  min"]
[]
[null,"Unit - 6",null,"Type:",null,null,"Shape:"]
[]
[null,null,"Further Description:"]
[]
[null,"Characteristic",null,null,null,null,"Comments"]
[null,"Number of Units"]
[null,"Diameter",null,null,null,{"$f":"IF(H2384=\"pipe\",\"  in\",\"  ft\")","v":"  ft"}]
[null,"Length",null,null,null,"  ft"]
[null,"Width",null,null,null,"  ft"]
[null,"Side Water Depth",null,null,null,"  ft"]
[null,"Center Water Depth",null,null,null,"  ft"]
[null,"Media Depth",null,null,null,"  ft"]
[null,"Underdrain Depth",null,null,null,"  ft"]
[null,"Minimum Water Depth Over Media",null,null,null,"  ft"]
[null,"Average Porosity",null,null,null,"  %"]
[null,"Maximum Volume (each)",null,null,{"$f":"IF(OR(E2384=\"Clearwell\",E2384=\"Transfer Well\"),IF(H2384=\"Circular\",PI()*(E2390/2)^2*(2*E2393+E2394)/3*7.4815,IF(H2384=\"Rectangular\",E2391*E2392*E2393*7.4815,\"\")),\"\")","v":""},"  gal"]
[null,"Maximum Volume (each)",null,null,null,"  gal"]
[null,"Minimum Operating Level",null,null,null,"  ft"]
[null,"Worst Case Volume (each)",null,null,{"$f":"IF(OR(E2384=\"Transfer Well\",E2384=\"Clearwell\"),IF(H2384=\"Circular\",PI()*(E2390/2)^2*(2*E2401+E2394-(E2393-E2401))/3*7.4815,IF(H2384=\"Rectangular\",E2391*E2392*E2401*7.4815,\"\")),\"\")","v":""},"  gal"]
[null,{"$f":"IF(OR(E2384=\"Clearwell\",E2384=\"Transfer Well\"),\"Worst Case Volume (each)\", \"Volume (each)\")","v":"Volume (each)"},null,null,null,"  gal"]
[null,"Percent of Maximum Volume",null,null,{"$f":"IF(H2384=\"Other\",IF(E2400 = 0,\"\",E2403/E2400*100),IF(OR(E2384=\"Clearwell\",E2384=\"Transfer Well\"),IF(E2399 = 0,\"\",E2402/E2399*100),\"\"))","v":""},"  %"]
[]
[null,{"$f":" IF(OR(E2384=\"Clearwell\",E2384=\"Transfer Well\"),\"Worst Case Volume (each)\",\"Volume (each)\")","v":"Volume (each)"},null,null,{"$f":"IF(E2384=\"Filter\",IF(H2384=\"Circular\",PI()*(E2390/2)^2*(E2395*E2398/100+E2397+E2396),IF(H2384=\"Rectangular\",E2391*E2392*(E2395*E2398/100+E2397+E2396),\"error\")),IF(AND(E2384=\"Piping\",H2384=\"Pipe\"),PI()*(E2390/12/2)^2*E2391,IF(H2384=\"Circular\",IF(OR(E2384=\"Transfer Well\",E2384=\"Clearwell\"),E2402/7.4815,PI()*(E2390/2)^2*(2*E2393+E2394)/3),IF(H2384=\"Rectangular\",IF(OR(E2384=\"Transfer Well\",E2384=\"Clearwell\"),E2402/7.4815,E2391*E2392*E2393),E2403/7.4815))))*7.4815","v":0},"  gal"]
[null,"Flow Rate (each)",null,null,null,"  gpm"]
[null,"Detention Time",null,null,{"$f":"IF(OR(E2407=\"\",E2407=0),0,E2406/E2407)","v":0},"  min"]
[]
[null,"Baffling Factor",null,null,{"$f":"IF(I2411=\"Unbaffled\",0.1,IF(I2411=\"Poor\",0.3,IF(I2411=\"Average\",0.5,IF(I2411=\"Superior\",0.7,IF(I2411=\"Perfect\",1,IF(I2411=\"\",\" \",I2412))))))","v":0.1}]
[null,null,null,null,null,null,null,"Baffling Characteristics:  ","Unbaffled"]
[null,null,null,null,null,null,null,"Approved Baffling Factor:  "]
[null,"T10",null,null,{"$f":"E2408*E2410","v":0},"  min"]
[]
[null,"Unit - 7",null,"Type:",null,null,"Shape:"]
[]
[null,null,"Further Description:"]
[]
[null,"Characteristic",null,null,null,null,"Comments"]
[null,"Number of Units"]
[null,"Diameter",null,null,null,{"$f":"IF(H2415=\"pipe\",\"  in\",\"  ft\")","v":"  ft"}]
[null,"Length",null,null,null,"  ft"]
[null,"Width",null,null,null,"  ft"]
[null,"Side Water Depth",null,null,null,"  ft"]
[null,"Center Water Depth",null,null,null,"  ft"]
[null,"Media Depth",null,null,null,"  ft"]
[null,"Underdrain Depth",null,null,null,"  ft"]
[null,"Minimum Water Depth Over Media",null,null,null,"  ft"]
[null,"Average Porosity",null,null,null,"  %"]
[null,"Maximum Volume (each)",null,null,{"$f":"IF(OR(E2415=\"Clearwell\",E2415=\"Transfer Well\"),IF(H2415=\"Circular\",PI()*(E2421/2)^2*(2*E2424+E2425)/3*7.4815,IF(H2415=\"Rectangular\",E2422*E2423*E2424*7.4815,\"\")),\"\")","v":""},"  gal"]
[null,"Maximum Volume (each)",null,null,null,"  gal"]
[null,"Minimum Operating Level",null,null,null,"  ft"]
[null,"Worst Case Volume (each)",null,null,{"$f":"IF(OR(E2415=\"Transfer Well\",E2415=\"Clearwell\"),IF(H2415=\"Circular\",PI()*(E2421/2)^2*(2*E2432+E2425-(E2424-E2432))/3*7.4815,IF(H2415=\"Rectangular\",E2422*E2423*E2432*7.4815,\"\")),\"\")","v":""},"  gal"]
[null,{"$f":"IF(OR(E2415=\"Clearwell\",E2415=\"Transfer Well\"),\"Worst Case Volume (each)\", \"Volume (each)\")","v":"Volume (each)"},null,null,null,"  gal"]
[null,"Percent of Maximum Volume",null,null,{"$f":"IF(H2415=\"Other\",IF(E2431 = 0,\"\",E2434/E2431*100),IF(OR(E2415=\"Clearwell\",E2415=\"Transfer Well\"),IF(E2430 = 0,\"\",E2433/E2430*100),\"\"))","v":""},"  %"]
[]
[null,{"$f":" IF(OR(E2415=\"Clearwell\",E2415=\"Transfer Well\"),\"Worst Case Volume (each)\",\"Volume (each)\")","v":"Volume (each)"},null,null,{"$f":"IF(E2415=\"Filter\",IF(H2415=\"Circular\",PI()*(E2421/2)^2*(E2426*E2429/100+E2428+E2427),IF(H2415=\"Rectangular\",E2422*E2423*(E2426*E2429/100+E2428+E2427),\"error\")),IF(AND(E2415=\"Piping\",H2415=\"Pipe\"),PI()*(E2421/12/2)^2*E2422,IF(H2415=\"Circular\",IF(OR(E2415=\"Transfer Well\",E2415=\"Clearwell\"),E2433/7.4815,PI()*(E2421/2)^2*(2*E2424+E2425)/3),IF(H2415=\"Rectangular\",IF(OR(E2415=\"Transfer Well\",E2415=\"Clearwell\"),E2433/7.4815,E2422*E2423*E2424),E2434/7.4815))))*7.4815","v":0},"  gal"]
[null,"Flow Rate (each)",null,null,null,"  gpm"]
[null,"Detention Time",null,null,{"$f":"IF(OR(E2438=\"\",E2438=0),0,E2437/E2438)","v":0},"  min"]
[]
[null,"Baffling Factor",null,null,{"$f":"IF(I2442=\"Unbaffled\",0.1,IF(I2442=\"Poor\",0.3,IF(I2442=\"Average\",0.5,IF(I2442=\"Superior\",0.7,IF(I2442=\"Perfect\",1,IF(I2442=\"\",\" \",I2443))))))","v":0.1}]
[null,null,null,null,null,null,null,"Baffling Characteristics:  ","Unbaffled"]
[null,null,null,null,null,null,null,"Approved Baffling Factor:  "]
[null,"T10",null,null,{"$f":"E2439*E2441","v":0},"  min"]
[]
[null,"Unit - 8",null,"Type:",null,null,"Shape:"]
[]
[null,null,"Further Description:"]
[]
[null,"Characteristic",null,null,null,null,"Comments"]
[null,"Number of Units"]
[null,"Diameter",null,null,null,{"$f":"IF(H2446=\"pipe\",\"  in\",\"  ft\")","v":"  ft"}]
[null,"Length",null,null,null,"  ft"]
[null,"Width",null,null,null,"  ft"]
[null,"Side Water Depth",null,null,null,"  ft"]
[null,"Center Water Depth",null,null,null,"  ft"]
[null,"Media Depth",null,null,null,"  ft"]
[null,"Underdrain Depth",null,null,null,"  ft"]
[null,"Minimum Water Depth Over Media",null,null,null,"  ft"]
[null,"Average Porosity",null,null,null,"  %"]
[null,"Maximum Volume (each)",null,null,{"$f":"IF(OR(E2446=\"Clearwell\",E2446=\"Transfer Well\"),IF(H2446=\"Circular\",PI()*(E2452/2)^2*(2*E2455+E2456)/3*7.4815,IF(H2446=\"Rectangular\",E2453*E2454*E2455*7.4815,\"\")),\"\")","v":""},"  gal"]
[null,"Maximum Volume (each)",null,null,null,"  gal"]
[null,"Minimum Operating Level",null,null,null,"  ft"]
[null,"Worst Case Volume (each)",null,null,{"$f":"IF(OR(E2446=\"Transfer Well\",E2446=\"Clearwell\"),IF(H2446=\"Circular\",PI()*(E2452/2)^2*(2*E2463+E2456-(E2455-E2463))/3*7.4815,IF(H2446=\"Rectangular\",E2453*E2454*E2463*7.4815,\"\")),\"\")","v":""},"  gal"]
[null,{"$f":"IF(OR(E2446=\"Clearwell\",E2446=\"Transfer Well\"),\"Worst Case Volume (each)\", \"Volume (each)\")","v":"Volume (each)"},null,null,null,"  gal"]
[null,"Percent of Maximum Volume",null,null,{"$f":"IF(H2446=\"Other\",IF(E2462 = 0,\"\",E2465/E2462*100),IF(OR(E2446=\"Clearwell\",E2446=\"Transfer Well\"),IF(E2461 = 0,\"\",E2464/E2461*100),\"\"))","v":""},"  %"]
[]
[null,{"$f":" IF(OR(E2446=\"Clearwell\",E2446=\"Transfer Well\"),\"Worst Case Volume (each)\",\"Volume (each)\")","v":"Volume (each)"},null,null,{"$f":"IF(E2446=\"Filter\",IF(H2446=\"Circular\",PI()*(E2452/2)^2*(E2457*E2460/100+E2459+E2458),IF(H2446=\"Rectangular\",E2453*E2454*(E2457*E2460/100+E2459+E2458),\"error\")),IF(AND(E2446=\"Piping\",H2446=\"Pipe\"),PI()*(E2452/12/2)^2*E2453,IF(H2446=\"Circular\",IF(OR(E2446=\"Transfer Well\",E2446=\"Clearwell\"),E2464/7.4815,PI()*(E2452/2)^2*(2*E2455+E2456)/3),IF(H2446=\"Rectangular\",IF(OR(E2446=\"Transfer Well\",E2446=\"Clearwell\"),E2464/7.4815,E2453*E2454*E2455),E2465/7.4815))))*7.4815","v":0},"  gal"]
[null,"Flow Rate (each)",null,null,null,"  gpm"]
[null,"Detention Time",null,null,{"$f":"IF(OR(E2469=\"\",E2469=0),0,E2468/E2469)","v":0},"  min"]
[]
[null,"Baffling Factor",null,null,{"$f":"IF(I2473=\"Unbaffled\",0.1,IF(I2473=\"Poor\",0.3,IF(I2473=\"Average\",0.5,IF(I2473=\"Superior\",0.7,IF(I2473=\"Perfect\",1,IF(I2473=\"\",\" \",I2474))))))","v":0.1}]
[null,null,null,null,null,null,null,"Baffling Characteristics:  ","Unbaffled"]
[null,null,null,null,null,null,null,"Approved Baffling Factor:  "]
[null,"T10",null,null,{"$f":"E2470*E2472","v":0},"  min"]
[]
[null,"Unit - 9",null,"Type:",null,null,"Shape:"]
[]
[null,null,"Further Description:"]
[]
[null,"Characteristic",null,null,null,null,"Comments"]
[null,"Number of Units"]
[null,"Diameter",null,null,null,{"$f":"IF(H2477=\"pipe\",\"  in\",\"  ft\")","v":"  ft"}]
[null,"Length",null,null,null,"  ft"]
[null,"Width",null,null,null,"  ft"]
[null,"Side Water Depth",null,null,null,"  ft"]
[null,"Center Water Depth",null,null,null,"  ft"]
[null,"Media Depth",null,null,null,"  ft"]
[null,"Underdrain Depth",null,null,null,"  ft"]
[null,"Minimum Water Depth Over Media",null,null,null,"  ft"]
[null,"Average Porosity",null,null,null,"  %"]
[null,"Maximum Volume (each)",null,null,{"$f":"IF(OR(E2477=\"Clearwell\",E2477=\"Transfer Well\"),IF(H2477=\"Circular\",PI()*(E2483/2)^2*(2*E2486+E2487)/3*7.4815,IF(H2477=\"Rectangular\",E2484*E2485*E2486*7.4815,\"\")),\"\")","v":""},"  gal"]
[null,"Maximum Volume (each)",null,null,null,"  gal"]
[null,"Minimum Operating Level",null,null,null,"  ft"]
[null,"Worst Case Volume (each)",null,null,{"$f":"IF(OR(E2477=\"Transfer Well\",E2477=\"Clearwell\"),IF(H2477=\"Circular\",PI()*(E2483/2)^2*(2*E2494+E2487-(E2486-E2494))/3*7.4815,IF(H2477=\"Rectangular\",E2484*E2485*E2494*7.4815,\"\")),\"\")","v":""},"  gal"]
[null,{"$f":"IF(OR(E2477=\"Clearwell\",E2477=\"Transfer Well\"),\"Worst Case Volume (each)\", \"Volume (each)\")","v":"Volume (each)"},null,null,null,"  gal"]
[null,"Percent of Maximum Volume",null,null,{"$f":"IF(H2477=\"Other\",IF(E2493 = 0,\"\",E2496/E2493*100),IF(OR(E2477=\"Clearwell\",E2477=\"Transfer Well\"),IF(E2492 = 0,\"\",E2495/E2492*100),\"\"))","v":""},"  %"]
[]
[null,{"$f":" IF(OR(E2477=\"Clearwell\",E2477=\"Transfer Well\"),\"Worst Case Volume (each)\",\"Volume (each)\")","v":"Volume (each)"},null,null,{"$f":"IF(E2477=\"Filter\",IF(H2477=\"Circular\",PI()*(E2483/2)^2*(E2488*E2491/100+E2490+E2489),IF(H2477=\"Rectangular\",E2484*E2485*(E2488*E2491/100+E2490+E2489),\"error\")),IF(AND(E2477=\"Piping\",H2477=\"Pipe\"),PI()*(E2483/12/2)^2*E2484,IF(H2477=\"Circular\",IF(OR(E2477=\"Transfer Well\",E2477=\"Clearwell\"),E2495/7.4815,PI()*(E2483/2)^2*(2*E2486+E2487)/3),IF(H2477=\"Rectangular\",IF(OR(E2477=\"Transfer Well\",E2477=\"Clearwell\"),E2495/7.4815,E2484*E2485*E2486),E2496/7.4815))))*7.4815","v":0},"  gal"]
[null,"Flow Rate (each)",null,null,null,"  gpm"]
[null,"Detention Time",null,null,{"$f":"IF(OR(E2500=\"\",E2500=0),0,E2499/E2500)","v":0},"  min"]
[]
[null,"Baffling Factor",null,null,{"$f":"IF(I2504=\"Unbaffled\",0.1,IF(I2504=\"Poor\",0.3,IF(I2504=\"Average\",0.5,IF(I2504=\"Superior\",0.7,IF(I2504=\"Perfect\",1,IF(I2504=\"\",\" \",I2505))))))","v":0.1}]
[null,null,null,null,null,null,null,"Baffling Characteristics:  ","Unbaffled"]
[null,null,null,null,null,null,null,"Approved Baffling Factor:  "]
[null,"T10",null,null,{"$f":"E2501*E2503","v":0},"  min"]
[]
[null,"Unit - 10",null,"Type:",null,null,"Shape:"]
[]
[null,null,"Further Description:"]
[]
[null,"Characteristic",null,null,null,null,"Comments"]
[null,"Number of Units"]
[null,"Diameter",null,null,null,{"$f":"IF(H2508=\"pipe\",\"  in\",\"  ft\")","v":"  ft"}]
[null,"Length",null,null,null,"  ft"]
[null,"Width",null,null,null,"  ft"]
[null,"Side Water Depth",null,null,null,"  ft"]
[null,"Center Water Depth",null,null,null,"  ft"]
[null,"Media Depth",null,null,null,"  ft"]
[null,"Underdrain Depth",null,null,null,"  ft"]
[null,"Minimum Water Depth Over Media",null,null,null,"  ft"]
[null,"Average Porosity",null,null,null,"  %"]
[null,"Maximum Volume (each)",null,null,{"$f":"IF(OR(E2508=\"Clearwell\",E2508=\"Transfer Well\"),IF(H2508=\"Circular\",PI()*(E2514/2)^2*(2*E2517+E2518)/3*7.4815,IF(H2508=\"Rectangular\",E2515*E2516*E2517*7.4815,\"\")),\"\")","v":""},"  gal"]
[null,"Maximum Volume (each)",null,null,null,"  gal"]
[null,"Minimum Operating Level",null,null,null,"  ft"]
[null,"Worst Case Volume (each)",null,null,{"$f":"IF(OR(E2508=\"Transfer Well\",E2508=\"Clearwell\"),IF(H2508=\"Circular\",PI()*(E2514/2)^2*(2*E2525+E2518-(E2517-E2525))/3*7.4815,IF(H2508=\"Rectangular\",E2515*E2516*E2525*7.4815,\"\")),\"\")","v":""},"  gal"]
[null,{"$f":"IF(OR(E2508=\"Clearwell\",E2508=\"Transfer Well\"),\"Worst Case Volume (each)\", \"Volume (each)\")","v":"Volume (each)"},null,null,null,"  gal"]
[null,"Percent of Maximum Volume",null,null,{"$f":"IF(H2508=\"Other\",IF(E2524 = 0,\"\",E2527/E2524*100),IF(OR(E2508=\"Clearwell\",E2508=\"Transfer Well\"),IF(E2523 =0,\"\",E2526/E2523*100),\"\"))","v":""},"  %"]
[]
[null,{"$f":" IF(OR(E2508=\"Clearwell\",E2508=\"Transfer Well\"),\"Worst Case Volume (each)\",\"Volume (each)\")","v":"Volume (each)"},null,null,{"$f":"IF(E2508=\"Filter\",IF(H2508=\"Circular\",PI()*(E2514/2)^2*(E2519*E2522/100+E2521+E2520),IF(H2508=\"Rectangular\",E2515*E2516*(E2519*E2522/100+E2521+E2520),\"error\")),IF(AND(E2508=\"Piping\",H2508=\"Pipe\"),PI()*(E2514/12/2)^2*E2515,IF(H2508=\"Circular\",IF(OR(E2508=\"Transfer Well\",E2508=\"Clearwell\"),E2526/7.4815,PI()*(E2514/2)^2*(2*E2517+E2518)/3),IF(H2508=\"Rectangular\",IF(OR(E2508=\"Transfer Well\",E2508=\"Clearwell\"),E2526/7.4815,E2515*E2516*E2517),E2527/7.4815))))*7.4815","v":0},"  gal"]
[null,"Flow Rate (each)",null,null,null,"  gpm"]
[null,"Detention Time",null,null,{"$f":"IF(OR(E2531=\"\",E2531=0),0,E2530/E2531)","v":0},"  min"]
[]
[null,"Baffling Factor",null,null,{"$f":"IF(I2535=\"Unbaffled\",0.1,IF(I2535=\"Poor\",0.3,IF(I2535=\"Average\",0.5,IF(I2535=\"Superior\",0.7,IF(I2535=\"Perfect\",1,IF(I2535=\"\",\" \",I2536))))))","v":0.1}]
[null,null,null,null,null,null,null,"Baffling Characteristics:  ","Unbaffled"]
[null,null,null,null,null,null,null,"Approved Baffling Factor:  "]
[null,"T10",null,null,{"$f":"E2532*E2534","v":0},"  min"]
[]
[null,{"$f":"CONCATENATE(D2227,\" FLOW RATE\")","v":"D8 FLOW RATE"},null,null,{"$f":"MaxUnitFlow(E2258,E2289,E2320,E2351,E2382,E2413,E2444,E2475,E2506,E2537,E2252,E2283,E2314,E2345,E2376,E2407,E2438,E2469,E2500,E2531)*60*24/10^6","v":0},"  mgd"]
[]
[null,{"$f":"CONCATENATE(\"T10 SUM FOR \",D2227)","v":"T10 SUM FOR D8"},null,null,{"$f":"SUM(E2258,E2289,E2320,E2351,E2382,E2413,E2444,E2475,E2506,E2537)","v":0},"  min"]
[]
["Disinfection Zone:",null,null,{"$f":"CONCATENATE(\"D\",Calculator!$BL$6)","v":"D9"},null,"Disinfectant:"]
[]
[null,"Unit - 1",null,"Type:",null,null,"Shape:"]
[]
[null,null,"Further Description:"]
[]
[null,"Characteristic",null,null,null,null,"Comments"]
[null,"Number of Units"]
[null,"Diameter",null,null,null,{"$f":"IF(H2545=\"pipe\",\"  in\",\"  ft\")","v":"  ft"}]
[null,"Length",null,null,null,"  ft"]
[null,"Width",null,null,null,"  ft"]
[null,"Side Water Depth",null,null,null,"  ft"]
[null,"Center Water Depth",null,null,null,"  ft"]
[null,"Media Depth",null,null,null,"  ft"]
[null,"Underdrain Depth",null,null,null,"  ft"]
[null,"Minimum Water Depth Over Media",null,null,null,"  ft"]
[null,"Average Porosity",null,null,null,"  %"]
[null,"Maximum Volume (each)",null,null,{"$f":"IF(OR(E2545=\"Clearwell\",E2545=\"Transfer Well\"),IF(H2545=\"Circular\",PI()*(E2551/2)^2*(2*E2554+E2555)/3*7.4815,IF(H2545=\"Rectangular\",E2552*E2553*E2554*7.4815,\"\")),\"\")","v":""},"  gal"]
[null,"Maximum Volume (each)",null,null,null,"  gal"]
[null,"Minimum Operating Level",null,null,null,"  ft"]
[null,"Worst Case Volume (each)",null,null,{"$f":"IF(OR(E2545=\"Transfer Well\",E2545=\"Clearwell\"),IF(H2545=\"Circular\",PI()*(E2551/2)^2*(2*E2562+E2555-(E2554-E2562))/3*7.4815,IF(H2545=\"Rectangular\",E2552*E2553*E2562*7.4815,\"\")),\"\")","v":""},"  gal"]
[null,{"$f":"IF(OR(E2545=\"Clearwell\",E2545=\"Transfer Well\"),\"Worst Case Volume (each)\", \"Volume (each)\")","v":"Volume (each)"},null,null,null,"  gal"]
[null,"Percent of Maximum Volume",null,null,{"$f":"IF(H2545=\"Other\",IF(E2561 = 0,\"\",E2564/E2561*100),IF(OR(E2545=\"Clearwell\",E2545=\"Transfer Well\"),IF(E2560 = 0,\"\",E2563/E2560*100),\"\"))","v":""},"  %"]
[]
[null,{"$f":" IF(OR(E2545=\"Clearwell\",E2545=\"Transfer Well\"),\"Worst Case Volume (each)\",\"Volume (each)\")","v":"Volume (each)"},null,null,{"$f":"IF(E2545=\"Filter\",IF(H2545=\"Circular\",PI()*(E2551/2)^2*(E2556*E2559/100+E2558+E2557),IF(H2545=\"Rectangular\",E2552*E2553*(E2556*E2559/100+E2558+E2557),\"error\")),IF(AND(E2545=\"Piping\",H2545=\"Pipe\"),PI()*(E2551/12/2)^2*E2552,IF(H2545=\"Circular\",IF(OR(E2545=\"Transfer Well\",E2545=\"Clearwell\"),E2563/7.4815,PI()*(E2551/2)^2*(2*E2554+E2555)/3),IF(H2545=\"Rectangular\",IF(OR(E2545=\"Transfer Well\",E2545=\"Clearwell\"),E2563/7.4815,E2552*E2553*E2554),E2564/7.4815))))*7.4815","v":0},"  gal"]
[null,"Flow Rate (each)",null,null,null,"  gpm"]
[null,"Detention Time",null,null,{"$f":"IF(OR(E2568=\"\",E2568=0),0,E2567/E2568)","v":0},"  min"]
[]
[null,"Baffling Factor",null,null,{"$f":"IF(I2572=\"Unbaffled\",0.1,IF(I2572=\"Poor\",0.3,IF(I2572=\"Average\",0.5,IF(I2572=\"Superior\",0.7,IF(I2572=\"Perfect\",1,IF(I2572=\"\",\" \",I2573))))))","v":0.1}]
[null,null,null,null,null,null,null,"Baffling Characteristics:  ","Unbaffled"]
[null,null,null,null,null,null,null,"Approved Baffling Factor:  "]
[null,"T10",null,null,{"$f":"E2569*E2571","v":0},"  min"]
[]
[null,"Unit - 2",null,"Type:",null,null,"Shape:"]
[]
[null,null,"Further Description:"]
[]
[null,"Characteristic",null,null,null,null,"Comments"]
[null,"Number of Units"]
[null,"Diameter",null,null,null,{"$f":"IF(H2576=\"pipe\",\"  in\",\"  ft\")","v":"  ft"}]
[null,"Length",null,null,null,"  ft"]
[null,"Width",null,null,null,"  ft"]
[null,"Side Water Depth",null,null,null,"  ft"]
[null,"Center Water Depth",null,null,null,"  ft"]
[null,"Media Depth",null,null,null,"  ft"]
[null,"Underdrain Depth",null,null,null,"  ft"]
[null,"Minimum Water Depth Over Media",null,null,null,"  ft"]
[null,"Average Porosity",null,null,null,"  %"]
[null,"Maximum Volume (each)",null,null,{"$f":"IF(OR(E2576=\"Clearwell\",E2576=\"Transfer Well\"),IF(H2576=\"Circular\",PI()*(E2582/2)^2*(2*E2585+E2586)/3*7.4815,IF(H2576=\"Rectangular\",E2583*E2584*E2585*7.4815,\"\")),\"\")","v":""},"  gal"]
[null,"Maximum Volume (each)",null,null,null,"  gal"]
[null,"Minimum Operating Level",null,null,null,"  ft"]
[null,"Worst Case Volume (each)",null,null,{"$f":"IF(OR(E2576=\"Transfer Well\",E2576=\"Clearwell\"),IF(H2576=\"Circular\",PI()*(E2582/2)^2*(2*E2593+E2586-(E2585-E2593))/3*7.4815,IF(H2576=\"Rectangular\",E2583*E2584*E2593*7.4815,\"\")),\"\")","v":""},"  gal"]
[null,{"$f":"IF(OR(E2576=\"Clearwell\",E2576=\"Transfer Well\"),\"Worst Case Volume (each)\", \"Volume (each)\")","v":"Volume (each)"},null,null,null,"  gal"]
[null,"Percent of Maximum Volume",null,null,{"$f":"IF(H2576=\"Other\",IF(E2592 = 0,\"\",E2595/E2592*100),IF(OR(E2576=\"Clearwell\",E2576=\"Transfer Well\"),IF(E2591 =0,\"\",E2594/E2591*100),\"\"))","v":""},"  %"]
[]
[null,{"$f":" IF(OR(E2576=\"Clearwell\",E2576=\"Transfer Well\"),\"Worst Case Volume (each)\",\"Volume (each)\")","v":"Volume (each)"},null,null,{"$f":"IF(E2576=\"Filter\",IF(H2576=\"Circular\",PI()*(E2582/2)^2*(E2587*E2590/100+E2589+E2588),IF(H2576=\"Rectangular\",E2583*E2584*(E2587*E2590/100+E2589+E2588),\"error\")),IF(AND(E2576=\"Piping\",H2576=\"Pipe\"),PI()*(E2582/12/2)^2*E2583,IF(H2576=\"Circular\",IF(OR(E2576=\"Transfer Well\",E2576=\"Clearwell\"),E2594/7.4815,PI()*(E2582/2)^2*(2*E2585+E2586)/3),IF(H2576=\"Rectangular\",IF(OR(E2576=\"Transfer Well\",E2576=\"Clearwell\"),E2594/7.4815,E2583*E2584*E2585),E2595/7.4815))))*7.4815","v":0},"  gal"]
[null,"Flow Rate (each)",null,null,null,"  gpm"]
[null,"Detention Time",null,null,{"$f":"IF(OR(E2599=\"\",E2599=0),0,E2598/E2599)","v":0},"  min"]
[]
[null,"Baffling Factor",null,null,{"$f":"IF(I2603=\"Unbaffled\",0.1,IF(I2603=\"Poor\",0.3,IF(I2603=\"Average\",0.5,IF(I2603=\"Superior\",0.7,IF(I2603=\"Perfect\",1,IF(I2603=\"\",\" \",I2604))))))","v":0.1}]
[null,null,null,null,null,null,null,"Baffling Characteristics:  ","Unbaffled"]
[null,null,null,null,null,null,null,"Approved Baffling Factor:  "]
[null,"T10",null,null,{"$f":"E2600*E2602","v":0},"  min"]
[]
[null,"Unit - 3",null,"Type:",null,null,"Shape:"]
[]
[null,null,"Further Description:"]
[]
[null,"Characteristic",null,null,null,null,"Comments"]
[null,"Number of Units"]
[null,"Diameter",null,null,null,{"$f":"IF(H2607=\"pipe\",\"  in\",\"  ft\")","v":"  ft"}]
[null,"Length",null,null,null,"  ft"]
[null,"Width",null,null,null,"  ft"]
[null,"Side Water Depth",null,null,null,"  ft"]
[null,"Center Water Depth",null,null,null,"  ft"]
[null,"Media Depth",null,null,null,"  ft"]
[null,"Underdrain Depth",null,null,null,"  ft"]
[null,"Minimum Water Depth Over Media",null,null,null,"  ft"]
[null,"Average Porosity",null,null,null,"  %"]
[null,"Maximum Volume (each)",null,null,{"$f":"IF(OR(E2607=\"Clearwell\",E2607=\"Transfer Well\"),IF(H2607=\"Circular\",PI()*(E2613/2)^2*(2*E2616+E2617)/3*7.4815,IF(H2607=\"Rectangular\",E2614*E2615*E2616*7.4815,\"\")),\"\")","v":""},"  gal"]
[null,"Maximum Volume (each)",null,null,null,"  gal"]
[null,"Minimum Operating Level",null,null,null,"  ft"]
[null,"Worst Case Volume (each)",null,null,{"$f":"IF(OR(E2607=\"Transfer Well\",E2607=\"Clearwell\"),IF(H2607=\"Circular\",PI()*(E2613/2)^2*(2*E2624+E2617-(E2616-E2624))/3*7.4815,IF(H2607=\"Rectangular\",E2614*E2615*E2624*7.4815,\"\")),\"\")","v":""},"  gal"]
[null,{"$f":"IF(OR(E2607=\"Clearwell\",E2607=\"Transfer Well\"),\"Worst Case Volume (each)\", \"Volume (each)\")","v":"Volume (each)"},null,null,null,"  gal"]
[null,"Percent of Maximum Volume",null,null,{"$f":"IF(H2607=\"Other\",IF(E2623 = 0,\"\",E2626/E2623*100),IF(OR(E2607=\"Clearwell\",E2607=\"Transfer Well\"),IF(E2622 = 0,\"\",E2625/E2622*100),\"\"))","v":""},"  %"]
[]
[null,{"$f":" IF(OR(E2607=\"Clearwell\",E2607=\"Transfer Well\"),\"Worst Case Volume (each)\",\"Volume (each)\")","v":"Volume (each)"},null,null,{"$f":"IF(E2607=\"Filter\",IF(H2607=\"Circular\",PI()*(E2613/2)^2*(E2618*E2621/100+E2620+E2619),IF(H2607=\"Rectangular\",E2614*E2615*(E2618*E2621/100+E2620+E2619),\"error\")),IF(AND(E2607=\"Piping\",H2607=\"Pipe\"),PI()*(E2613/12/2)^2*E2614,IF(H2607=\"Circular\",IF(OR(E2607=\"Transfer Well\",E2607=\"Clearwell\"),E2625/7.4815,PI()*(E2613/2)^2*(2*E2616+E2617)/3),IF(H2607=\"Rectangular\",IF(OR(E2607=\"Transfer Well\",E2607=\"Clearwell\"),E2625/7.4815,E2614*E2615*E2616),E2626/7.4815))))*7.4815","v":0},"  gal"]
[null,"Flow Rate (each)",null,null,null,"  gpm"]
[null,"Detention Time",null,null,{"$f":"IF(OR(E2630=\"\",E2630=0),0,E2629/E2630)","v":0},"  min"]
[]
[null,"Baffling Factor",null,null,{"$f":"IF(I2634=\"Unbaffled\",0.1,IF(I2634=\"Poor\",0.3,IF(I2634=\"Average\",0.5,IF(I2634=\"Superior\",0.7,IF(I2634=\"Perfect\",1,IF(I2634=\"\",\" \",I2635))))))","v":0.1}]
[null,null,null,null,null,null,null,"Baffling Characteristics:  ","Unbaffled"]
[null,null,null,null,null,null,null,"Approved Baffling Factor:  "]
[null,"T10",null,null,{"$f":"E2631*E2633","v":0},"  min"]
[]
[null,"Unit - 4",null,"Type:",null,null,"Shape:"]
[]
[null,null,"Further Description:"]
[]
[null,"Characteristic",null,null,null,null,"Comments"]
[null,"Number of Units"]
[null,"Diameter",null,null,null,{"$f":"IF(H2638=\"pipe\",\"  in\",\"  ft\")","v":"  ft"}]
[null,"Length",null,null,null,"  ft"]
[null,"Width",null,null,null,"  ft"]
[null,"Side Water Depth",null,null,null,"  ft"]
[null,"Center Water Depth",null,null,null,"  ft"]
[null,"Media Depth",null,null,null,"  ft"]
[null,"Underdrain Depth",null,null,null,"  ft"]
[null,"Minimum Water Depth Over Media",null,null,null,"  ft"]
[null,"Average Porosity",null,null,null,"  %"]
[null,"Maximum Volume (each)",null,null,{"$f":"IF(OR(E2638=\"Clearwell\",E2638=\"Transfer Well\"),IF(H2638=\"Circular\",PI()*(E2644/2)^2*(2*E2647+E2648)/3*7.4815,IF(H2638=\"Rectangular\",E2645*E2646*E2647*7.4815,\"\")),\"\")","v":""},"  gal"]
[null,"Maximum Volume (each)",null,null,null,"  gal"]
[null,"Minimum Operating Level",null,null,null,"  ft"]
[null,"Worst Case Volume (each)",null,null,{"$f":"IF(OR(E2638=\"Transfer Well\",E2638=\"Clearwell\"),IF(H2638=\"Circular\",PI()*(E2644/2)^2*(2*E2655+E2648-(E2647-E2655))/3*7.4815,IF(H2638=\"Rectangular\",E2645*E2646*E2655*7.4815,\"\")),\"\")","v":""},"  gal"]
[null,{"$f":"IF(OR(E2638=\"Clearwell\",E2638=\"Transfer Well\"),\"Worst Case Volume (each)\", \"Volume (each)\")","v":"Volume (each)"},null,null,null,"  gal"]
[null,"Percent of Maximum Volume",null,null,{"$f":"IF(H2638=\"Other\",IF(E2654 = 0,\"\",E2657/E2654*100),IF(OR(E2638=\"Clearwell\",E2638=\"Transfer Well\"),IF(E2653 = 0,\"\",E2656/E2653*100),\"\"))","v":""},"  %"]
[]
[null,{"$f":" IF(OR(E2638=\"Clearwell\",E2638=\"Transfer Well\"),\"Worst Case Volume (each)\",\"Volume (each)\")","v":"Volume (each)"},null,null,{"$f":"IF(E2638=\"Filter\",IF(H2638=\"Circular\",PI()*(E2644/2)^2*(E2649*E2652/100+E2651+E2650),IF(H2638=\"Rectangular\",E2645*E2646*(E2649*E2652/100+E2651+E2650),\"error\")),IF(AND(E2638=\"Piping\",H2638=\"Pipe\"),PI()*(E2644/12/2)^2*E2645,IF(H2638=\"Circular\",IF(OR(E2638=\"Transfer Well\",E2638=\"Clearwell\"),E2656/7.4815,PI()*(E2644/2)^2*(2*E2647+E2648)/3),IF(H2638=\"Rectangular\",IF(OR(E2638=\"Transfer Well\",E2638=\"Clearwell\"),E2656/7.4815,E2645*E2646*E2647),E2657/7.4815))))*7.4815","v":0},"  gal"]
[null,"Flow Rate (each)",null,null,null,"  gpm"]
[null,"Detention Time",null,null,{"$f":"IF(OR(E2661=\"\",E2661=0),0,E2660/E2661)","v":0},"  min"]
[]
[null,"Baffling Factor",null,null,{"$f":"IF(I2665=\"Unbaffled\",0.1,IF(I2665=\"Poor\",0.3,IF(I2665=\"Average\",0.5,IF(I2665=\"Superior\",0.7,IF(I2665=\"Perfect\",1,IF(I2665=\"\",\" \",I2666))))))","v":0.1}]
[null,null,null,null,null,null,null,"Baffling Characteristics:  ","Unbaffled"]
[null,null,null,null,null,null,null,"Approved Baffling Factor:  "]
[null,"T10",null,null,{"$f":"E2662*E2664","v":0},"  min"]
[]
[null,"Unit - 5",null,"Type:",null,null,"Shape:"]
[]
[null,null,"Further Description:"]
[]
[null,"Characteristic",null,null,null,null,"Comments"]
[null,"Number of Units"]
[null,"Diameter",null,null,null,{"$f":"IF(H2669=\"pipe\",\"  in\",\"  ft\")","v":"  ft"}]
[null,"Length",null,null,null,"  ft"]
[null,"Width",null,null,null,"  ft"]
[null,"Side Water Depth",null,null,null,"  ft"]
[null,"Center Water Depth",null,null,null,"  ft"]
[null,"Media Depth",null,null,null,"  ft"]
[null,"Underdrain Depth",null,null,null,"  ft"]
[null,"Minimum Water Depth Over Media",null,null,null,"  ft"]
[null,"Average Porosity",null,null,null,"  %"]
[null,"Maximum Volume (each)",null,null,{"$f":"IF(OR(E2669=\"Clearwell\",E2669=\"Transfer Well\"),IF(H2669=\"Circular\",PI()*(E2675/2)^2*(2*E2678+E2679)/3*7.4815,IF(H2669=\"Rectangular\",E2676*E2677*E2678*7.4815,\"\")),\"\")","v":""},"  gal"]
[null,"Maximum Volume (each)",null,null,null,"  gal"]
[null,"Minimum Operating Level",null,null,null,"  ft"]
[null,"Worst Case Volume (each)",null,null,{"$f":"IF(OR(E2669=\"Transfer Well\",E2669=\"Clearwell\"),IF(H2669=\"Circular\",PI()*(E2675/2)^2*(2*E2686+E2679-(E2678-E2686))/3*7.4815,IF(H2669=\"Rectangular\",E2676*E2677*E2686*7.4815,\"\")),\"\")","v":""},"  gal"]
[null,{"$f":"IF(OR(E2669=\"Clearwell\",E2669=\"Transfer Well\"),\"Worst Case Volume (each)\", \"Volume (each)\")","v":"Volume (each)"},null,null,null,"  gal"]
[null,"Percent of Maximum Volume",null,null,{"$f":"IF(H2669=\"Other\",IF(E2685 = 0,\"\",E2688/E2685*100),IF(OR(E2669=\"Clearwell\",E2669=\"Transfer Well\"),IF(E2684 = 0,\"\",E2687/E2684*100),\"\"))","v":""},"  %"]
[]
[null,{"$f":" IF(OR(E2669=\"Clearwell\",E2669=\"Transfer Well\"),\"Worst Case Volume (each)\",\"Volume (each)\")","v":"Volume (each)"},null,null,{"$f":"IF(E2669=\"Filter\",IF(H2669=\"Circular\",PI()*(E2675/2)^2*(E2680*E2683/100+E2682+E2681),IF(H2669=\"Rectangular\",E2676*E2677*(E2680*E2683/100+E2682+E2681),\"error\")),IF(AND(E2669=\"Piping\",H2669=\"Pipe\"),PI()*(E2675/12/2)^2*E2676,IF(H2669=\"Circular\",IF(OR(E2669=\"Transfer Well\",E2669=\"Clearwell\"),E2687/7.4815,PI()*(E2675/2)^2*(2*E2678+E2679)/3),IF(H2669=\"Rectangular\",IF(OR(E2669=\"Transfer Well\",E2669=\"Clearwell\"),E2687/7.4815,E2676*E2677*E2678),E2688/7.4815))))*7.4815","v":0},"  gal"]
[null,"Flow Rate (each)",null,null,null,"  gpm"]
[null,"Detention Time",null,null,{"$f":"IF(OR(E2692=\"\",E2692=0),0,E2691/E2692)","v":0},"  min"]
[]
[null,"Baffling Factor",null,null,{"$f":"IF(I2696=\"Unbaffled\",0.1,IF(I2696=\"Poor\",0.3,IF(I2696=\"Average\",0.5,IF(I2696=\"Superior\",0.7,IF(I2696=\"Perfect\",1,IF(I2696=\"\",\" \",I2697))))))","v":0.1}]
[null,null,null,null,null,null,null,"Baffling Characteristics:  ","Unbaffled"]
[null,null,null,null,null,null,null,"Approved Baffling Factor:  "]
[null,"T10",null,null,{"$f":"E2693*E2695","v":0},"  min"]
[]
[null,"Unit - 6",null,"Type:",null,null,"Shape:"]
[]
[null,null,"Further Description:"]
[]
[null,"Characteristic",null,null,null,null,"Comments"]
[null,"Number of Units"]
[null,"Diameter",null,null,null,{"$f":"IF(H2700=\"pipe\",\"  in\",\"  ft\")","v":"  ft"}]
[null,"Length",null,null,null,"  ft"]
[null,"Width",null,null,null,"  ft"]
[null,"Side Water Depth",null,null,null,"  ft"]
[null,"Center Water Depth",null,null,null,"  ft"]
[null,"Media Depth",null,null,null,"  ft"]
[null,"Underdrain Depth",null,null,null,"  ft"]
[null,"Minimum Water Depth Over Media",null,null,null,"  ft"]
[null,"Average Porosity",null,null,null,"  %"]
[null,"Maximum Volume (each)",null,null,{"$f":"IF(OR(E2700=\"Clearwell\",E2700=\"Transfer Well\"),IF(H2700=\"Circular\",PI()*(E2706/2)^2*(2*E2709+E2710)/3*7.4815,IF(H2700=\"Rectangular\",E2707*E2708*E2709*7.4815,\"\")),\"\")","v":""},"  gal"]
[null,"Maximum Volume (each)",null,null,null,"  gal"]
[null,"Minimum Operating Level",null,null,null,"  ft"]
[null,"Worst Case Volume (each)",null,null,{"$f":"IF(OR(E2700=\"Transfer Well\",E2700=\"Clearwell\"),IF(H2700=\"Circular\",PI()*(E2706/2)^2*(2*E2717+E2710-(E2709-E2717))/3*7.4815,IF(H2700=\"Rectangular\",E2707*E2708*E2717*7.4815,\"\")),\"\")","v":""},"  gal"]
[null,{"$f":"IF(OR(E2700=\"Clearwell\",E2700=\"Transfer Well\"),\"Worst Case Volume (each)\", \"Volume (each)\")","v":"Volume (each)"},null,null,null,"  gal"]
[null,"Percent of Maximum Volume",null,null,{"$f":"IF(H2700=\"Other\",IF(E2716 = 0,\"\",E2719/E2716*100),IF(OR(E2700=\"Clearwell\",E2700=\"Transfer Well\"),IF(E2715 = 0,\"\",E2718/E2715*100),\"\"))","v":""},"  %"]
[]
[null,{"$f":" IF(OR(E2700=\"Clearwell\",E2700=\"Transfer Well\"),\"Worst Case Volume (each)\",\"Volume (each)\")","v":"Volume (each)"},null,null,{"$f":"IF(E2700=\"Filter\",IF(H2700=\"Circular\",PI()*(E2706/2)^2*(E2711*E2714/100+E2713+E2712),IF(H2700=\"Rectangular\",E2707*E2708*(E2711*E2714/100+E2713+E2712),\"error\")),IF(AND(E2700=\"Piping\",H2700=\"Pipe\"),PI()*(E2706/12/2)^2*E2707,IF(H2700=\"Circular\",IF(OR(E2700=\"Transfer Well\",E2700=\"Clearwell\"),E2718/7.4815,PI()*(E2706/2)^2*(2*E2709+E2710)/3),IF(H2700=\"Rectangular\",IF(OR(E2700=\"Transfer Well\",E2700=\"Clearwell\"),E2718/7.4815,E2707*E2708*E2709),E2719/7.4815))))*7.4815","v":0},"  gal"]
[null,"Flow Rate (each)",null,null,null,"  gpm"]
[null,"Detention Time",null,null,{"$f":"IF(OR(E2723=\"\",E2723=0),0,E2722/E2723)","v":0},"  min"]
[]
[null,"Baffling Factor",null,null,{"$f":"IF(I2727=\"Unbaffled\",0.1,IF(I2727=\"Poor\",0.3,IF(I2727=\"Average\",0.5,IF(I2727=\"Superior\",0.7,IF(I2727=\"Perfect\",1,IF(I2727=\"\",\" \",I2728))))))","v":0.1}]
[null,null,null,null,null,null,null,"Baffling Characteristics:  ","Unbaffled"]
[null,null,null,null,null,null,null,"Approved Baffling Factor:  "]
[null,"T10",null,null,{"$f":"E2724*E2726","v":0},"  min"]
[]
[null,"Unit - 7",null,"Type:",null,null,"Shape:"]
[]
[null,null,"Further Description:"]
[]
[null,"Characteristic",null,null,null,null,"Comments"]
[null,"Number of Units"]
[null,"Diameter",null,null,null,{"$f":"IF(H2731=\"pipe\",\"  in\",\"  ft\")","v":"  ft"}]
[null,"Length",null,null,null,"  ft"]
[null,"Width",null,null,null,"  ft"]
[null,"Side Water Depth",null,null,null,"  ft"]
[null,"Center Water Depth",null,null,null,"  ft"]
[null,"Media Depth",null,null,null,"  ft"]
[null,"Underdrain Depth",null,null,null,"  ft"]
[null,"Minimum Water Depth Over Media",null,null,null,"  ft"]
[null,"Average Porosity",null,null,null,"  %"]
[null,"Maximum Volume (each)",null,null,{"$f":"IF(OR(E2731=\"Clearwell\",E2731=\"Transfer Well\"),IF(H2731=\"Circular\",PI()*(E2737/2)^2*(2*E2740+E2741)/3*7.4815,IF(H2731=\"Rectangular\",E2738*E2739*E2740*7.4815,\"\")),\"\")","v":""},"  gal"]
[null,"Maximum Volume (each)",null,null,null,"  gal"]
[null,"Minimum Operating Level",null,null,null,"  ft"]
[null,"Worst Case Volume (each)",null,null,{"$f":"IF(OR(E2731=\"Transfer Well\",E2731=\"Clearwell\"),IF(H2731=\"Circular\",PI()*(E2737/2)^2*(2*E2748+E2741-(E2740-E2748))/3*7.4815,IF(H2731=\"Rectangular\",E2738*E2739*E2748*7.4815,\"\")),\"\")","v":""},"  gal"]
[null,{"$f":"IF(OR(E2731=\"Clearwell\",E2731=\"Transfer Well\"),\"Worst Case Volume (each)\", \"Volume (each)\")","v":"Volume (each)"},null,null,null,"  gal"]
[null,"Percent of Maximum Volume",null,null,{"$f":"IF(H2731=\"Other\",IF(E2747 = 0,\"\",E2750/E2747*100),IF(OR(E2731=\"Clearwell\",E2731=\"Transfer Well\"),IF(E2746 = 0,\"\",E2749/E2746*100),\"\"))","v":""},"  %"]
[]
[null,{"$f":" IF(OR(E2731=\"Clearwell\",E2731=\"Transfer Well\"),\"Worst Case Volume (each)\",\"Volume (each)\")","v":"Volume (each)"},null,null,{"$f":"IF(E2731=\"Filter\",IF(H2731=\"Circular\",PI()*(E2737/2)^2*(E2742*E2745/100+E2744+E2743),IF(H2731=\"Rectangular\",E2738*E2739*(E2742*E2745/100+E2744+E2743),\"error\")),IF(AND(E2731=\"Piping\",H2731=\"Pipe\"),PI()*(E2737/12/2)^2*E2738,IF(H2731=\"Circular\",IF(OR(E2731=\"Transfer Well\",E2731=\"Clearwell\"),E2749/7.4815,PI()*(E2737/2)^2*(2*E2740+E2741)/3),IF(H2731=\"Rectangular\",IF(OR(E2731=\"Transfer Well\",E2731=\"Clearwell\"),E2749/7.4815,E2738*E2739*E2740),E2750/7.4815))))*7.4815","v":0},"  gal"]
[null,"Flow Rate (each)",null,null,null,"  gpm"]
[null,"Detention Time",null,null,{"$f":"IF(OR(E2754=\"\",E2754=0),0,E2753/E2754)","v":0},"  min"]
[]
[null,"Baffling Factor",null,null,{"$f":"IF(I2758=\"Unbaffled\",0.1,IF(I2758=\"Poor\",0.3,IF(I2758=\"Average\",0.5,IF(I2758=\"Superior\",0.7,IF(I2758=\"Perfect\",1,IF(I2758=\"\",\" \",I2759))))))","v":0.1}]
[null,null,null,null,null,null,null,"Baffling Characteristics:  ","Unbaffled"]
[null,null,null,null,null,null,null,"Approved Baffling Factor:  "]
[null,"T10",null,null,{"$f":"E2755*E2757","v":0},"  min"]
[]
[null,"Unit - 8",null,"Type:",null,null,"Shape:"]
[]
[null,null,"Further Description:"]
[]
[null,"Characteristic",null,null,null,null,"Comments"]
[null,"Number of Units"]
[null,"Diameter",null,null,null,{"$f":"IF(H2762=\"pipe\",\"  in\",\"  ft\")","v":"  ft"}]
[null,"Length",null,null,null,"  ft"]
[null,"Width",null,null,null,"  ft"]
[null,"Side Water Depth",null,null,null,"  ft"]
[null,"Center Water Depth",null,null,null,"  ft"]
[null,"Media Depth",null,null,null,"  ft"]
[null,"Underdrain Depth",null,null,null,"  ft"]
[null,"Minimum Water Depth Over Media",null,null,null,"  ft"]
[null,"Average Porosity",null,null,null,"  %"]
[null,"Maximum Volume (each)",null,null,{"$f":"IF(OR(E2762=\"Clearwell\",E2762=\"Transfer Well\"),IF(H2762=\"Circular\",PI()*(E2768/2)^2*(2*E2771+E2772)/3*7.4815,IF(H2762=\"Rectangular\",E2769*E2770*E2771*7.4815,\"\")),\"\")","v":""},"  gal"]
[null,"Maximum Volume (each)",null,null,null,"  gal"]
[null,"Minimum Operating Level",null,null,null,"  ft"]
[null,"Worst Case Volume (each)",null,null,{"$f":"IF(OR(E2762=\"Transfer Well\",E2762=\"Clearwell\"),IF(H2762=\"Circular\",PI()*(E2768/2)^2*(2*E2779+E2772-(E2771-E2779))/3*7.4815,IF(H2762=\"Rectangular\",E2769*E2770*E2779*7.4815,\"\")),\"\")","v":""},"  gal"]
[null,{"$f":"IF(OR(E2762=\"Clearwell\",E2762=\"Transfer Well\"),\"Worst Case Volume (each)\", \"Volume (each)\")","v":"Volume (each)"},null,null,null,"  gal"]
[null,"Percent of Maximum Volume",null,null,{"$f":"IF(H2762=\"Other\",IF(E2778 = 0,\"\",E2781/E2778*100),IF(OR(E2762=\"Clearwell\",E2762=\"Transfer Well\"),IF(E2777 = 0,\"\",E2780/E2777*100),\"\"))","v":""},"  %"]
[]
[null,{"$f":" IF(OR(E2762=\"Clearwell\",E2762=\"Transfer Well\"),\"Worst Case Volume (each)\",\"Volume (each)\")","v":"Volume (each)"},null,null,{"$f":"IF(E2762=\"Filter\",IF(H2762=\"Circular\",PI()*(E2768/2)^2*(E2773*E2776/100+E2775+E2774),IF(H2762=\"Rectangular\",E2769*E2770*(E2773*E2776/100+E2775+E2774),\"error\")),IF(AND(E2762=\"Piping\",H2762=\"Pipe\"),PI()*(E2768/12/2)^2*E2769,IF(H2762=\"Circular\",IF(OR(E2762=\"Transfer Well\",E2762=\"Clearwell\"),E2780/7.4815,PI()*(E2768/2)^2*(2*E2771+E2772)/3),IF(H2762=\"Rectangular\",IF(OR(E2762=\"Transfer Well\",E2762=\"Clearwell\"),E2780/7.4815,E2769*E2770*E2771),E2781/7.4815))))*7.4815","v":0},"  gal"]
[null,"Flow Rate (each)",null,null,null,"  gpm"]
[null,"Detention Time",null,null,{"$f":"IF(OR(E2785=\"\",E2785=0),0,E2784/E2785)","v":0},"  min"]
[]
[null,"Baffling Factor",null,null,{"$f":"IF(I2789=\"Unbaffled\",0.1,IF(I2789=\"Poor\",0.3,IF(I2789=\"Average\",0.5,IF(I2789=\"Superior\",0.7,IF(I2789=\"Perfect\",1,IF(I2789=\"\",\" \",I2790))))))","v":0.1}]
[null,null,null,null,null,null,null,"Baffling Characteristics:  ","Unbaffled"]
[null,null,null,null,null,null,null,"Approved Baffling Factor:  "]
[null,"T10",null,null,{"$f":"E2786*E2788","v":0},"  min"]
[]
[null,"Unit - 9",null,"Type:",null,null,"Shape:"]
[]
[null,null,"Further Description:"]
[]
[null,"Characteristic",null,null,null,null,"Comments"]
[null,"Number of Units"]
[null,"Diameter",null,null,null,{"$f":"IF(H2793=\"pipe\",\"  in\",\"  ft\")","v":"  ft"}]
[null,"Length",null,null,null,"  ft"]
[null,"Width",null,null,null,"  ft"]
[null,"Side Water Depth",null,null,null,"  ft"]
[null,"Center Water Depth",null,null,null,"  ft"]
[null,"Media Depth",null,null,null,"  ft"]
[null,"Underdrain Depth",null,null,null,"  ft"]
[null,"Minimum Water Depth Over Media",null,null,null,"  ft"]
[null,"Average Porosity",null,null,null,"  %"]
[null,"Maximum Volume (each)",null,null,{"$f":"IF(OR(E2793=\"Clearwell\",E2793=\"Transfer Well\"),IF(H2793=\"Circular\",PI()*(E2799/2)^2*(2*E2802+E2803)/3*7.4815,IF(H2793=\"Rectangular\",E2800*E2801*E2802*7.4815,\"\")),\"\")","v":""},"  gal"]
[null,"Maximum Volume (each)",null,null,null,"  gal"]
[null,"Minimum Operating Level",null,null,null,"  ft"]
[null,"Worst Case Volume (each)",null,null,{"$f":"IF(OR(E2793=\"Transfer Well\",E2793=\"Clearwell\"),IF(H2793=\"Circular\",PI()*(E2799/2)^2*(2*E2810+E2803-(E2802-E2810))/3*7.4815,IF(H2793=\"Rectangular\",E2800*E2801*E2810*7.4815,\"\")),\"\")","v":""},"  gal"]
[null,{"$f":"IF(OR(E2793=\"Clearwell\",E2793=\"Transfer Well\"),\"Worst Case Volume (each)\", \"Volume (each)\")","v":"Volume (each)"},null,null,null,"  gal"]
[null,"Percent of Maximum Volume",null,null,{"$f":"IF(H2793=\"Other\",IF(E2809 = 0,\"\",E2812/E2809*100),IF(OR(E2793=\"Clearwell\",E2793=\"Transfer Well\"),IF(E2808 = 0,\"\",E2811/E2808*100),\"\"))","v":""},"  %"]
[]
[null,{"$f":" IF(OR(E2793=\"Clearwell\",E2793=\"Transfer Well\"),\"Worst Case Volume (each)\",\"Volume (each)\")","v":"Volume (each)"},null,null,{"$f":"IF(E2793=\"Filter\",IF(H2793=\"Circular\",PI()*(E2799/2)^2*(E2804*E2807/100+E2806+E2805),IF(H2793=\"Rectangular\",E2800*E2801*(E2804*E2807/100+E2806+E2805),\"error\")),IF(AND(E2793=\"Piping\",H2793=\"Pipe\"),PI()*(E2799/12/2)^2*E2800,IF(H2793=\"Circular\",IF(OR(E2793=\"Transfer Well\",E2793=\"Clearwell\"),E2811/7.4815,PI()*(E2799/2)^2*(2*E2802+E2803)/3),IF(H2793=\"Rectangular\",IF(OR(E2793=\"Transfer Well\",E2793=\"Clearwell\"),E2811/7.4815,E2800*E2801*E2802),E2812/7.4815))))*7.4815","v":0},"  gal"]
[null,"Flow Rate (each)",null,null,null,"  gpm"]
[null,"Detention Time",null,null,{"$f":"IF(OR(E2816=\"\",E2816=0),0,E2815/E2816)","v":0},"  min"]
[]
[null,"Baffling Factor",null,null,{"$f":"IF(I2820=\"Unbaffled\",0.1,IF(I2820=\"Poor\",0.3,IF(I2820=\"Average\",0.5,IF(I2820=\"Superior\",0.7,IF(I2820=\"Perfect\",1,IF(I2820=\"\",\" \",I2821))))))","v":0.1}]
[null,null,null,null,null,null,null,"Baffling Characteristics:  ","Unbaffled"]
[null,null,null,null,null,null,null,"Approved Baffling Factor:  "]
[null,"T10",null,null,{"$f":"E2817*E2819","v":0},"  min"]
[]
[null,"Unit - 10",null,"Type:",null,null,"Shape:"]
[]
[null,null,"Further Description:"]
[]
[null,"Characteristic",null,null,null,null,"Comments"]
[null,"Number of Units"]
[null,"Diameter",null,null,null,{"$f":"IF(H2824=\"pipe\",\"  in\",\"  ft\")","v":"  ft"}]
[null,"Length",null,null,null,"  ft"]
[null,"Width",null,null,null,"  ft"]
[null,"Side Water Depth",null,null,null,"  ft"]
[null,"Center Water Depth",null,null,null,"  ft"]
[null,"Media Depth",null,null,null,"  ft"]
[null,"Underdrain Depth",null,null,null,"  ft"]
[null,"Minimum Water Depth Over Media",null,null,null,"  ft"]
[null,"Average Porosity",null,null,null,"  %"]
[null,"Maximum Volume (each)",null,null,{"$f":"IF(OR(E2824=\"Clearwell\",E2824=\"Transfer Well\"),IF(H2824=\"Circular\",PI()*(E2830/2)^2*(2*E2833+E2834)/3*7.4815,IF(H2824=\"Rectangular\",E2831*E2832*E2833*7.4815,\"\")),\"\")","v":""},"  gal"]
[null,"Maximum Volume (each)",null,null,null,"  gal"]
[null,"Minimum Operating Level",null,null,null,"  ft"]
[null,"Worst Case Volume (each)",null,null,{"$f":"IF(OR(E2824=\"Transfer Well\",E2824=\"Clearwell\"),IF(H2824=\"Circular\",PI()*(E2830/2)^2*(2*E2841+E2834-(E2833-E2841))/3*7.4815,IF(H2824=\"Rectangular\",E2831*E2832*E2841*7.4815,\"\")),\"\")","v":""},"  gal"]
[null,{"$f":"IF(OR(E2824=\"Clearwell\",E2824=\"Transfer Well\"),\"Worst Case Volume (each)\", \"Volume (each)\")","v":"Volume (each)"},null,null,null,"  gal"]
[null,"Percent of Maximum Volume",null,null,{"$f":"IF(H2824=\"Other\",IF(E2840 = 0,\"\",E2843/E2840*100),IF(OR(E2824=\"Clearwell\",E2824=\"Transfer Well\"),IF(E2839 =0,\"\",E2842/E2839*100),\"\"))","v":""},"  %"]
[]
[null,{"$f":" IF(OR(E2824=\"Clearwell\",E2824=\"Transfer Well\"),\"Worst Case Volume (each)\",\"Volume (each)\")","v":"Volume (each)"},null,null,{"$f":"IF(E2824=\"Filter\",IF(H2824=\"Circular\",PI()*(E2830/2)^2*(E2835*E2838/100+E2837+E2836),IF(H2824=\"Rectangular\",E2831*E2832*(E2835*E2838/100+E2837+E2836),\"error\")),IF(AND(E2824=\"Piping\",H2824=\"Pipe\"),PI()*(E2830/12/2)^2*E2831,IF(H2824=\"Circular\",IF(OR(E2824=\"Transfer Well\",E2824=\"Clearwell\"),E2842/7.4815,PI()*(E2830/2)^2*(2*E2833+E2834)/3),IF(H2824=\"Rectangular\",IF(OR(E2824=\"Transfer Well\",E2824=\"Clearwell\"),E2842/7.4815,E2831*E2832*E2833),E2843/7.4815))))*7.4815","v":0},"  gal"]
[null,"Flow Rate (each)",null,null,null,"  gpm"]
[null,"Detention Time",null,null,{"$f":"IF(OR(E2847=\"\",E2847=0),0,E2846/E2847)","v":0},"  min"]
[]
[null,"Baffling Factor",null,null,{"$f":"IF(I2851=\"Unbaffled\",0.1,IF(I2851=\"Poor\",0.3,IF(I2851=\"Average\",0.5,IF(I2851=\"Superior\",0.7,IF(I2851=\"Perfect\",1,IF(I2851=\"\",\" \",I2852))))))","v":0.1}]
[null,null,null,null,null,null,null,"Baffling Characteristics:  ","Unbaffled"]
[null,null,null,null,null,null,null,"Approved Baffling Factor:  "]
[null,"T10",null,null,{"$f":"E2848*E2850","v":0},"  min"]
[]
[null,{"$f":"CONCATENATE(D2543,\" FLOW RATE\")","v":"D9 FLOW RATE"},null,null,{"$f":"MaxUnitFlow(E2574,E2605,E2636,E2667,E2698,E2729,E2760,E2791,E2822,E2853,E2568,E2599,E2630,E2661,E2692,E2723,E2754,E2785,E2816,E2847)*60*24/10^6","v":0},"  mgd"]
[]
[null,{"$f":"CONCATENATE(\"T10 SUM FOR \",D2543)","v":"T10 SUM FOR D9"},null,null,{"$f":"SUM(E2574,E2605,E2636,E2667,E2698,E2729,E2760,E2791,E2822,E2853)","v":0},"  min"]
[]
["Disinfection Zone:",null,null,{"$f":"CONCATENATE(\"D\",Calculator!$BM$6)","v":"D10"},null,"Disinfectant:"]
[]
[null,"Unit - 1",null,"Type:",null,null,"Shape:"]
[]
[null,null,"Further Description:"]
[]
[null,"Characteristic",null,null,null,null,"Comments"]
[null,"Number of Units"]
[null,"Diameter",null,null,null,{"$f":"IF(H2861=\"pipe\",\"  in\",\"  ft\")","v":"  ft"}]
[null,"Length",null,null,null,"  ft"]
[null,"Width",null,null,null,"  ft"]
[null,"Side Water Depth",null,null,null,"  ft"]
[null,"Center Water Depth",null,null,null,"  ft"]
[null,"Media Depth",null,null,null,"  ft"]
[null,"Underdrain Depth",null,null,null,"  ft"]
[null,"Minimum Water Depth Over Media",null,null,null,"  ft"]
[null,"Average Porosity",null,null,null,"  %"]
[null,"Maximum Volume (each)",null,null,{"$f":"IF(OR(E2861=\"Clearwell\",E2861=\"Transfer Well\"),IF(H2861=\"Circular\",PI()*(E2867/2)^2*(2*E2870+E2871)/3*7.4815,IF(H2861=\"Rectangular\",E2868*E2869*E2870*7.4815,\"\")),\"\")","v":""},"  gal"]
[null,"Maximum Volume (each)",null,null,null,"  gal"]
[null,"Minimum Operating Level",null,null,null,"  ft"]
[null,"Worst Case Volume (each)",null,null,{"$f":"IF(OR(E2861=\"Transfer Well\",E2861=\"Clearwell\"),IF(H2861=\"Circular\",PI()*(E2867/2)^2*(2*E2878+E2871-(E2870-E2878))/3*7.4815,IF(H2861=\"Rectangular\",E2868*E2869*E2878*7.4815,\"\")),\"\")","v":""},"  gal"]
[null,{"$f":"IF(OR(E2861=\"Clearwell\",E2861=\"Transfer Well\"),\"Worst Case Volume (each)\", \"Volume (each)\")","v":"Volume (each)"},null,null,null,"  gal"]
[null,"Percent of Maximum Volume",null,null,{"$f":"IF(H2861=\"Other\",IF(E2877 = 0,\"\",E2880/E2877*100),IF(OR(E2861=\"Clearwell\",E2861=\"Transfer Well\"),IF(E2876 = 0,\"\",E2879/E2876*100),\"\"))","v":""},"  %"]
[]
[null,{"$f":" IF(OR(E2861=\"Clearwell\",E2861=\"Transfer Well\"),\"Worst Case Volume (each)\",\"Volume (each)\")","v":"Volume (each)"},null,null,{"$f":"IF(E2861=\"Filter\",IF(H2861=\"Circular\",PI()*(E2867/2)^2*(E2872*E2875/100+E2874+E2873),IF(H2861=\"Rectangular\",E2868*E2869*(E2872*E2875/100+E2874+E2873),\"error\")),IF(AND(E2861=\"Piping\",H2861=\"Pipe\"),PI()*(E2867/12/2)^2*E2868,IF(H2861=\"Circular\",IF(OR(E2861=\"Transfer Well\",E2861=\"Clearwell\"),E2879/7.4815,PI()*(E2867/2)^2*(2*E2870+E2871)/3),IF(H2861=\"Rectangular\",IF(OR(E2861=\"Transfer Well\",E2861=\"Clearwell\"),E2879/7.4815,E2868*E2869*E2870),E2880/7.4815))))*7.4815","v":0},"  gal"]
[null,"Flow Rate (each)",null,null,null,"  gpm"]
[null,"Detention Time",null,null,{"$f":"IF(OR(E2884=\"\",E2884=0),0,E2883/E2884)","v":0},"  min"]
[]
[null,"Baffling Factor",null,null,{"$f":"IF(I2888=\"Unbaffled\",0.1,IF(I2888=\"Poor\",0.3,IF(I2888=\"Average\",0.5,IF(I2888=\"Superior\",0.7,IF(I2888=\"Perfect\",1,IF(I2888=\"\",\" \",I2889))))))","v":0.1}]
[null,null,null,null,null,null,null,"Baffling Characteristics:  ","Unbaffled"]
[null,null,null,null,null,null,null,"Approved Baffling Factor:  "]
[null,"T10",null,null,{"$f":"E2885*E2887","v":0},"  min"]
[]
[null,"Unit - 2",null,"Type:",null,null,"Shape:"]
[]
[null,null,"Further Description:"]
[]
[null,"Characteristic",null,null,null,null,"Comments"]
[null,"Number of Units"]
[null,"Diameter",null,null,null,{"$f":"IF(H2892=\"pipe\",\"  in\",\"  ft\")","v":"  ft"}]
[null,"Length",null,null,null,"  ft"]
[null,"Width",null,null,null,"  ft"]
[null,"Side Water Depth",null,null,null,"  ft"]
[null,"Center Water Depth",null,null,null,"  ft"]
[null,"Media Depth",null,null,null,"  ft"]
[null,"Underdrain Depth",null,null,null,"  ft"]
[null,"Minimum Water Depth Over Media",null,null,null,"  ft"]
[null,"Average Porosity",null,null,null,"  %"]
[null,"Maximum Volume (each)",null,null,{"$f":"IF(OR(E2892=\"Clearwell\",E2892=\"Transfer Well\"),IF(H2892=\"Circular\",PI()*(E2898/2)^2*(2*E2901+E2902)/3*7.4815,IF(H2892=\"Rectangular\",E2899*E2900*E2901*7.4815,\"\")),\"\")","v":""},"  gal"]
[null,"Maximum Volume (each)",null,null,null,"  gal"]
[null,"Minimum Operating Level",null,null,null,"  ft"]
[null,"Worst Case Volume (each)",null,null,{"$f":"IF(OR(E2892=\"Transfer Well\",E2892=\"Clearwell\"),IF(H2892=\"Circular\",PI()*(E2898/2)^2*(2*E2909+E2902-(E2901-E2909))/3*7.4815,IF(H2892=\"Rectangular\",E2899*E2900*E2909*7.4815,\"\")),\"\")","v":""},"  gal"]
[null,{"$f":"IF(OR(E2892=\"Clearwell\",E2892=\"Transfer Well\"),\"Worst Case Volume (each)\", \"Volume (each)\")","v":"Volume (each)"},null,null,null,"  gal"]
[null,"Percent of Maximum Volume",null,null,{"$f":"IF(H2892=\"Other\",IF(E2908 = 0,\"\",E2911/E2908*100),IF(OR(E2892=\"Clearwell\",E2892=\"Transfer Well\"),IF(E2907 =0,\"\",E2910/E2907*100),\"\"))","v":""},"  %"]
[]
[null,{"$f":" IF(OR(E2892=\"Clearwell\",E2892=\"Transfer Well\"),\"Worst Case Volume (each)\",\"Volume (each)\")","v":"Volume (each)"},null,null,{"$f":"IF(E2892=\"Filter\",IF(H2892=\"Circular\",PI()*(E2898/2)^2*(E2903*E2906/100+E2905+E2904),IF(H2892=\"Rectangular\",E2899*E2900*(E2903*E2906/100+E2905+E2904),\"error\")),IF(AND(E2892=\"Piping\",H2892=\"Pipe\"),PI()*(E2898/12/2)^2*E2899,IF(H2892=\"Circular\",IF(OR(E2892=\"Transfer Well\",E2892=\"Clearwell\"),E2910/7.4815,PI()*(E2898/2)^2*(2*E2901+E2902)/3),IF(H2892=\"Rectangular\",IF(OR(E2892=\"Transfer Well\",E2892=\"Clearwell\"),E2910/7.4815,E2899*E2900*E2901),E2911/7.4815))))*7.4815","v":0},"  gal"]
[null,"Flow Rate (each)",null,null,null,"  gpm"]
[null,"Detention Time",null,null,{"$f":"IF(OR(E2915=\"\",E2915=0),0,E2914/E2915)","v":0},"  min"]
[]
[null,"Baffling Factor",null,null,{"$f":"IF(I2919=\"Unbaffled\",0.1,IF(I2919=\"Poor\",0.3,IF(I2919=\"Average\",0.5,IF(I2919=\"Superior\",0.7,IF(I2919=\"Perfect\",1,IF(I2919=\"\",\" \",I2920))))))","v":0.1}]
[null,null,null,null,null,null,null,"Baffling Characteristics:  ","Unbaffled"]
[null,null,null,null,null,null,null,"Approved Baffling Factor:  "]
[null,"T10",null,null,{"$f":"E2916*E2918","v":0},"  min"]
[]
[null,"Unit - 3",null,"Type:",null,null,"Shape:"]
[]
[null,null,"Further Description:"]
[]
[null,"Characteristic",null,null,null,null,"Comments"]
[null,"Number of Units"]
[null,"Diameter",null,null,null,{"$f":"IF(H2923=\"pipe\",\"  in\",\"  ft\")","v":"  ft"}]
[null,"Length",null,null,null,"  ft"]
[null,"Width",null,null,null,"  ft"]
[null,"Side Water Depth",null,null,null,"  ft"]
[null,"Center Water Depth",null,null,null,"  ft"]
[null,"Media Depth",null,null,null,"  ft"]
[null,"Underdrain Depth",null,null,null,"  ft"]
[null,"Minimum Water Depth Over Media",null,null,null,"  ft"]
[null,"Average Porosity",null,null,null,"  %"]
[null,"Maximum Volume (each)",null,null,{"$f":"IF(OR(E2923=\"Clearwell\",E2923=\"Transfer Well\"),IF(H2923=\"Circular\",PI()*(E2929/2)^2*(2*E2932+E2933)/3*7.4815,IF(H2923=\"Rectangular\",E2930*E2931*E2932*7.4815,\"\")),\"\")","v":""},"  gal"]
[null,"Maximum Volume (each)",null,null,null,"  gal"]
[null,"Minimum Operating Level",null,null,null,"  ft"]
[null,"Worst Case Volume (each)",null,null,{"$f":"IF(OR(E2923=\"Transfer Well\",E2923=\"Clearwell\"),IF(H2923=\"Circular\",PI()*(E2929/2)^2*(2*E2940+E2933-(E2932-E2940))/3*7.4815,IF(H2923=\"Rectangular\",E2930*E2931*E2940*7.4815,\"\")),\"\")","v":""},"  gal"]
[null,{"$f":"IF(OR(E2923=\"Clearwell\",E2923=\"Transfer Well\"),\"Worst Case Volume (each)\", \"Volume (each)\")","v":"Volume (each)"},null,null,null,"  gal"]
[null,"Percent of Maximum Volume",null,null,{"$f":"IF(H2923=\"Other\",IF(E2939 = 0,\"\",E2942/E2939*100),IF(OR(E2923=\"Clearwell\",E2923=\"Transfer Well\"),IF(E2938 = 0,\"\",E2941/E2938*100),\"\"))","v":""},"  %"]
[]
[null,{"$f":" IF(OR(E2923=\"Clearwell\",E2923=\"Transfer Well\"),\"Worst Case Volume (each)\",\"Volume (each)\")","v":"Volume (each)"},null,null,{"$f":"IF(E2923=\"Filter\",IF(H2923=\"Circular\",PI()*(E2929/2)^2*(E2934*E2937/100+E2936+E2935),IF(H2923=\"Rectangular\",E2930*E2931*(E2934*E2937/100+E2936+E2935),\"error\")),IF(AND(E2923=\"Piping\",H2923=\"Pipe\"),PI()*(E2929/12/2)^2*E2930,IF(H2923=\"Circular\",IF(OR(E2923=\"Transfer Well\",E2923=\"Clearwell\"),E2941/7.4815,PI()*(E2929/2)^2*(2*E2932+E2933)/3),IF(H2923=\"Rectangular\",IF(OR(E2923=\"Transfer Well\",E2923=\"Clearwell\"),E2941/7.4815,E2930*E2931*E2932),E2942/7.4815))))*7.4815","v":0},"  gal"]
[null,"Flow Rate (each)",null,null,null,"  gpm"]
[null,"Detention Time",null,null,{"$f":"IF(OR(E2946=\"\",E2946=0),0,E2945/E2946)","v":0},"  min"]
[]
[null,"Baffling Factor",null,null,{"$f":"IF(I2950=\"Unbaffled\",0.1,IF(I2950=\"Poor\",0.3,IF(I2950=\"Average\",0.5,IF(I2950=\"Superior\",0.7,IF(I2950=\"Perfect\",1,IF(I2950=\"\",\" \",I2951))))))","v":0.1}]
[null,null,null,null,null,null,null,"Baffling Characteristics:  ","Unbaffled"]
[null,null,null,null,null,null,null,"Approved Baffling Factor:  "]
[null,"T10",null,null,{"$f":"E2947*E2949","v":0},"  min"]
[]
[null,"Unit - 4",null,"Type:",null,null,"Shape:"]
[]
[null,null,"Further Description:"]
[]
[null,"Characteristic",null,null,null,null,"Comments"]
[null,"Number of Units"]
[null,"Diameter",null,null,null,{"$f":"IF(H2954=\"pipe\",\"  in\",\"  ft\")","v":"  ft"}]
[null,"Length",null,null,null,"  ft"]
[null,"Width",null,null,null,"  ft"]
[null,"Side Water Depth",null,null,null,"  ft"]
[null,"Center Water Depth",null,null,null,"  ft"]
[null,"Media Depth",null,null,null,"  ft"]
[null,"Underdrain Depth",null,null,null,"  ft"]
[null,"Minimum Water Depth Over Media",null,null,null,"  ft"]
[null,"Average Porosity",null,null,null,"  %"]
[null,"Maximum Volume (each)",null,null,{"$f":"IF(OR(E2954=\"Clearwell\",E2954=\"Transfer Well\"),IF(H2954=\"Circular\",PI()*(E2960/2)^2*(2*E2963+E2964)/3*7.4815,IF(H2954=\"Rectangular\",E2961*E2962*E2963*7.4815,\"\")),\"\")","v":""},"  gal"]
[null,"Maximum Volume (each)",null,null,null,"  gal"]
[null,"Minimum Operating Level",null,null,null,"  ft"]
[null,"Worst Case Volume (each)",null,null,{"$f":"IF(OR(E2954=\"Transfer Well\",E2954=\"Clearwell\"),IF(H2954=\"Circular\",PI()*(E2960/2)^2*(2*E2971+E2964-(E2963-E2971))/3*7.4815,IF(H2954=\"Rectangular\",E2961*E2962*E2971*7.4815,\"\")),\"\")","v":""},"  gal"]
[null,{"$f":"IF(OR(E2954=\"Clearwell\",E2954=\"Transfer Well\"),\"Worst Case Volume (each)\", \"Volume (each)\")","v":"Volume (each)"},null,null,null,"  gal"]
[null,"Percent of Maximum Volume",null,null,{"$f":"IF(H2954=\"Other\",IF(E2970 = 0,\"\",E2973/E2970*100),IF(OR(E2954=\"Clearwell\",E2954=\"Transfer Well\"),IF(E2969 = 0,\"\",E2972/E2969*100),\"\"))","v":""},"  %"]
[]
[null,{"$f":" IF(OR(E2954=\"Clearwell\",E2954=\"Transfer Well\"),\"Worst Case Volume (each)\",\"Volume (each)\")","v":"Volume (each)"},null,null,{"$f":"IF(E2954=\"Filter\",IF(H2954=\"Circular\",PI()*(E2960/2)^2*(E2965*E2968/100+E2967+E2966),IF(H2954=\"Rectangular\",E2961*E2962*(E2965*E2968/100+E2967+E2966),\"error\")),IF(AND(E2954=\"Piping\",H2954=\"Pipe\"),PI()*(E2960/12/2)^2*E2961,IF(H2954=\"Circular\",IF(OR(E2954=\"Transfer Well\",E2954=\"Clearwell\"),E2972/7.4815,PI()*(E2960/2)^2*(2*E2963+E2964)/3),IF(H2954=\"Rectangular\",IF(OR(E2954=\"Transfer Well\",E2954=\"Clearwell\"),E2972/7.4815,E2961*E2962*E2963),E2973/7.4815))))*7.4815","v":0},"  gal"]
[null,"Flow Rate (each)",null,null,null,"  gpm"]
[null,"Detention Time",null,null,{"$f":"IF(OR(E2977=\"\",E2977=0),0,E2976/E2977)","v":0},"  min"]
[]
[null,"Baffling Factor",null,null,{"$f":"IF(I2981=\"Unbaffled\",0.1,IF(I2981=\"Poor\",0.3,IF(I2981=\"Average\",0.5,IF(I2981=\"Superior\",0.7,IF(I2981=\"Perfect\",1,IF(I2981=\"\",\" \",I2982))))))","v":0.1}]
[null,null,null,null,null,null,null,"Baffling Characteristics:  ","Unbaffled"]
[null,null,null,null,null,null,null,"Approved Baffling Factor:  "]
[null,"T10",null,null,{"$f":"E2978*E2980","v":0},"  min"]
[]
[null,"Unit - 5",null,"Type:",null,null,"Shape:"]
[]
[null,null,"Further Description:"]
[]
[null,"Characteristic",null,null,null,null,"Comments"]
[null,"Number of Units"]
[null,"Diameter",null,null,null,{"$f":"IF(H2985=\"pipe\",\"  in\",\"  ft\")","v":"  ft"}]
[null,"Length",null,null,null,"  ft"]
[null,"Width",null,null,null,"  ft"]
[null,"Side Water Depth",null,null,null,"  ft"]
[null,"Center Water Depth",null,null,null,"  ft"]
[null,"Media Depth",null,null,null,"  ft"]
[null,"Underdrain Depth",null,null,null,"  ft"]
[null,"Minimum Water Depth Over Media",null,null,null,"  ft"]
[null,"Average Porosity",null,null,null,"  %"]
[null,"Maximum Volume (each)",null,null,{"$f":"IF(OR(E2985=\"Clearwell\",E2985=\"Transfer Well\"),IF(H2985=\"Circular\",PI()*(E2991/2)^2*(2*E2994+E2995)/3*7.4815,IF(H2985=\"Rectangular\",E2992*E2993*E2994*7.4815,\"\")),\"\")","v":""},"  gal"]
[null,"Maximum Volume (each)",null,null,null,"  gal"]
[null,"Minimum Operating Level",null,null,null,"  ft"]
[null,"Worst Case Volume (each)",null,null,{"$f":"IF(OR(E2985=\"Transfer Well\",E2985=\"Clearwell\"),IF(H2985=\"Circular\",PI()*(E2991/2)^2*(2*E3002+E2995-(E2994-E3002))/3*7.4815,IF(H2985=\"Rectangular\",E2992*E2993*E3002*7.4815,\"\")),\"\")","v":""},"  gal"]
[null,{"$f":"IF(OR(E2985=\"Clearwell\",E2985=\"Transfer Well\"),\"Worst Case Volume (each)\", \"Volume (each)\")","v":"Volume (each)"},null,null,null,"  gal"]
[null,"Percent of Maximum Volume",null,null,{"$f":"IF(H2985=\"Other\",IF(E3001 = 0,\"\",E3004/E3001*100),IF(OR(E2985=\"Clearwell\",E2985=\"Transfer Well\"),IF(E3000 = 0,\"\",E3003/E3000*100),\"\"))","v":""},"  %"]
[]
[null,{"$f":" IF(OR(E2985=\"Clearwell\",E2985=\"Transfer Well\"),\"Worst Case Volume (each)\",\"Volume (each)\")","v":"Volume (each)"},null,null,{"$f":"IF(E2985=\"Filter\",IF(H2985=\"Circular\",PI()*(E2991/2)^2*(E2996*E2999/100+E2998+E2997),IF(H2985=\"Rectangular\",E2992*E2993*(E2996*E2999/100+E2998+E2997),\"error\")),IF(AND(E2985=\"Piping\",H2985=\"Pipe\"),PI()*(E2991/12/2)^2*E2992,IF(H2985=\"Circular\",IF(OR(E2985=\"Transfer Well\",E2985=\"Clearwell\"),E3003/7.4815,PI()*(E2991/2)^2*(2*E2994+E2995)/3),IF(H2985=\"Rectangular\",IF(OR(E2985=\"Transfer Well\",E2985=\"Clearwell\"),E3003/7.4815,E2992*E2993*E2994),E3004/7.4815))))*7.4815","v":0},"  gal"]
[null,"Flow Rate (each)",null,null,null,"  gpm"]
[null,"Detention Time",null,null,{"$f":"IF(OR(E3008=\"\",E3008=0),0,E3007/E3008)","v":0},"  min"]
[]
[null,"Baffling Factor",null,null,{"$f":"IF(I3012=\"Unbaffled\",0.1,IF(I3012=\"Poor\",0.3,IF(I3012=\"Average\",0.5,IF(I3012=\"Superior\",0.7,IF(I3012=\"Perfect\",1,IF(I3012=\"\",\" \",I3013))))))","v":0.1}]
[null,null,null,null,null,null,null,"Baffling Characteristics:  ","Unbaffled"]
[null,null,null,null,null,null,null,"Approved Baffling Factor:  "]
[null,"T10",null,null,{"$f":"E3009*E3011","v":0},"  min"]
[]
[null,"Unit - 6",null,"Type:",null,null,"Shape:"]
[]
[null,null,"Further Description:"]
[]
[null,"Characteristic",null,null,null,null,"Comments"]
[null,"Number of Units"]
[null,"Diameter",null,null,null,{"$f":"IF(H3016=\"pipe\",\"  in\",\"  ft\")","v":"  ft"}]
[null,"Length",null,null,null,"  ft"]
[null,"Width",null,null,null,"  ft"]
[null,"Side Water Depth",null,null,null,"  ft"]
[null,"Center Water Depth",null,null,null,"  ft"]
[null,"Media Depth",null,null,null,"  ft"]
[null,"Underdrain Depth",null,null,null,"  ft"]
[null,"Minimum Water Depth Over Media",null,null,null,"  ft"]
[null,"Average Porosity",null,null,null,"  %"]
[null,"Maximum Volume (each)",null,null,{"$f":"IF(OR(E3016=\"Clearwell\",E3016=\"Transfer Well\"),IF(H3016=\"Circular\",PI()*(E3022/2)^2*(2*E3025+E3026)/3*7.4815,IF(H3016=\"Rectangular\",E3023*E3024*E3025*7.4815,\"\")),\"\")","v":""},"  gal"]
[null,"Maximum Volume (each)",null,null,null,"  gal"]
[null,"Minimum Operating Level",null,null,null,"  ft"]
[null,"Worst Case Volume (each)",null,null,{"$f":"IF(OR(E3016=\"Transfer Well\",E3016=\"Clearwell\"),IF(H3016=\"Circular\",PI()*(E3022/2)^2*(2*E3033+E3026-(E3025-E3033))/3*7.4815,IF(H3016=\"Rectangular\",E3023*E3024*E3033*7.4815,\"\")),\"\")","v":""},"  gal"]
[null,{"$f":"IF(OR(E3016=\"Clearwell\",E3016=\"Transfer Well\"),\"Worst Case Volume (each)\", \"Volume (each)\")","v":"Volume (each)"},null,null,null,"  gal"]
[null,"Percent of Maximum Volume",null,null,{"$f":"IF(H3016=\"Other\",IF(E3032 = 0,\"\",E3035/E3032*100),IF(OR(E3016=\"Clearwell\",E3016=\"Transfer Well\"),IF(E3031 = 0,\"\",E3034/E3031*100),\"\"))","v":""},"  %"]
[]
[null,{"$f":" IF(OR(E3016=\"Clearwell\",E3016=\"Transfer Well\"),\"Worst Case Volume (each)\",\"Volume (each)\")","v":"Volume (each)"},null,null,{"$f":"IF(E3016=\"Filter\",IF(H3016=\"Circular\",PI()*(E3022/2)^2*(E3027*E3030/100+E3029+E3028),IF(H3016=\"Rectangular\",E3023*E3024*(E3027*E3030/100+E3029+E3028),\"error\")),IF(AND(E3016=\"Piping\",H3016=\"Pipe\"),PI()*(E3022/12/2)^2*E3023,IF(H3016=\"Circular\",IF(OR(E3016=\"Transfer Well\",E3016=\"Clearwell\"),E3034/7.4815,PI()*(E3022/2)^2*(2*E3025+E3026)/3),IF(H3016=\"Rectangular\",IF(OR(E3016=\"Transfer Well\",E3016=\"Clearwell\"),E3034/7.4815,E3023*E3024*E3025),E3035/7.4815))))*7.4815","v":0},"  gal"]
[null,"Flow Rate (each)",null,null,null,"  gpm"]
[null,"Detention Time",null,null,{"$f":"IF(OR(E3039=\"\",E3039=0),0,E3038/E3039)","v":0},"  min"]
[]
[null,"Baffling Factor",null,null,{"$f":"IF(I3043=\"Unbaffled\",0.1,IF(I3043=\"Poor\",0.3,IF(I3043=\"Average\",0.5,IF(I3043=\"Superior\",0.7,IF(I3043=\"Perfect\",1,IF(I3043=\"\",\" \",I3044))))))","v":0.1}]
[null,null,null,null,null,null,null,"Baffling Characteristics:  ","Unbaffled"]
[null,null,null,null,null,null,null,"Approved Baffling Factor:  "]
[null,"T10",null,null,{"$f":"E3040*E3042","v":0},"  min"]
[]
[null,"Unit - 7",null,"Type:",null,null,"Shape:"]
[]
[null,null,"Further Description:"]
[]
[null,"Characteristic",null,null,null,null,"Comments"]
[null,"Number of Units"]
[null,"Diameter",null,null,null,{"$f":"IF(H3047=\"pipe\",\"  in\",\"  ft\")","v":"  ft"}]
[null,"Length",null,null,null,"  ft"]
[null,"Width",null,null,null,"  ft"]
[null,"Side Water Depth",null,null,null,"  ft"]
[null,"Center Water Depth",null,null,null,"  ft"]
[null,"Media Depth",null,null,null,"  ft"]
[null,"Underdrain Depth",null,null,null,"  ft"]
[null,"Minimum Water Depth Over Media",null,null,null,"  ft"]
[null,"Average Porosity",null,null,null,"  %"]
[null,"Maximum Volume (each)",null,null,{"$f":"IF(OR(E3047=\"Clearwell\",E3047=\"Transfer Well\"),IF(H3047=\"Circular\",PI()*(E3053/2)^2*(2*E3056+E3057)/3*7.4815,IF(H3047=\"Rectangular\",E3054*E3055*E3056*7.4815,\"\")),\"\")","v":""},"  gal"]
[null,"Maximum Volume (each)",null,null,null,"  gal"]
[null,"Minimum Operating Level",null,null,null,"  ft"]
[null,"Worst Case Volume (each)",null,null,{"$f":"IF(OR(E3047=\"Transfer Well\",E3047=\"Clearwell\"),IF(H3047=\"Circular\",PI()*(E3053/2)^2*(2*E3064+E3057-(E3056-E3064))/3*7.4815,IF(H3047=\"Rectangular\",E3054*E3055*E3064*7.4815,\"\")),\"\")","v":""},"  gal"]
[null,{"$f":"IF(OR(E3047=\"Clearwell\",E3047=\"Transfer Well\"),\"Worst Case Volume (each)\", \"Volume (each)\")","v":"Volume (each)"},null,null,null,"  gal"]
[null,"Percent of Maximum Volume",null,null,{"$f":"IF(H3047=\"Other\",IF(E3063 = 0,\"\",E3066/E3063*100),IF(OR(E3047=\"Clearwell\",E3047=\"Transfer Well\"),IF(E3062 = 0,\"\",E3065/E3062*100),\"\"))","v":""},"  %"]
[]
[null,{"$f":" IF(OR(E3047=\"Clearwell\",E3047=\"Transfer Well\"),\"Worst Case Volume (each)\",\"Volume (each)\")","v":"Volume (each)"},null,null,{"$f":"IF(E3047=\"Filter\",IF(H3047=\"Circular\",PI()*(E3053/2)^2*(E3058*E3061/100+E3060+E3059),IF(H3047=\"Rectangular\",E3054*E3055*(E3058*E3061/100+E3060+E3059),\"error\")),IF(AND(E3047=\"Piping\",H3047=\"Pipe\"),PI()*(E3053/12/2)^2*E3054,IF(H3047=\"Circular\",IF(OR(E3047=\"Transfer Well\",E3047=\"Clearwell\"),E3065/7.4815,PI()*(E3053/2)^2*(2*E3056+E3057)/3),IF(H3047=\"Rectangular\",IF(OR(E3047=\"Transfer Well\",E3047=\"Clearwell\"),E3065/7.4815,E3054*E3055*E3056),E3066/7.4815))))*7.4815","v":0},"  gal"]
[null,"Flow Rate (each)",null,null,null,"  gpm"]
[null,"Detention Time",null,null,{"$f":"IF(OR(E3070=\"\",E3070=0),0,E3069/E3070)","v":0},"  min"]
[]
[null,"Baffling Factor",null,null,{"$f":"IF(I3074=\"Unbaffled\",0.1,IF(I3074=\"Poor\",0.3,IF(I3074=\"Average\",0.5,IF(I3074=\"Superior\",0.7,IF(I3074=\"Perfect\",1,IF(I3074=\"\",\" \",I3075))))))","v":0.1}]
[null,null,null,null,null,null,null,"Baffling Characteristics:  ","Unbaffled"]
[null,null,null,null,null,null,null,"Approved Baffling Factor:  "]
[null,"T10",null,null,{"$f":"E3071*E3073","v":0},"  min"]
[]
[null,"Unit - 8",null,"Type:",null,null,"Shape:"]
[]
[null,null,"Further Description:"]
[]
[null,"Characteristic",null,null,null,null,"Comments"]
[null,"Number of Units"]
[null,"Diameter",null,null,null,{"$f":"IF(H3078=\"pipe\",\"  in\",\"  ft\")","v":"  ft"}]
[null,"Length",null,null,null,"  ft"]
[null,"Width",null,null,null,"  ft"]
[null,"Side Water Depth",null,null,null,"  ft"]
[null,"Center Water Depth",null,null,null,"  ft"]
[null,"Media Depth",null,null,null,"  ft"]
[null,"Underdrain Depth",null,null,null,"  ft"]
[null,"Minimum Water Depth Over Media",null,null,null,"  ft"]
[null,"Average Porosity",null,null,null,"  %"]
[null,"Maximum Volume (each)",null,null,{"$f":"IF(OR(E3078=\"Clearwell\",E3078=\"Transfer Well\"),IF(H3078=\"Circular\",PI()*(E3084/2)^2*(2*E3087+E3088)/3*7.4815,IF(H3078=\"Rectangular\",E3085*E3086*E3087*7.4815,\"\")),\"\")","v":""},"  gal"]
[null,"Maximum Volume (each)",null,null,null,"  gal"]
[null,"Minimum Operating Level",null,null,null,"  ft"]
[null,"Worst Case Volume (each)",null,null,{"$f":"IF(OR(E3078=\"Transfer Well\",E3078=\"Clearwell\"),IF(H3078=\"Circular\",PI()*(E3084/2)^2*(2*E3095+E3088-(E3087-E3095))/3*7.4815,IF(H3078=\"Rectangular\",E3085*E3086*E3095*7.4815,\"\")),\"\")","v":""},"  gal"]
[null,{"$f":"IF(OR(E3078=\"Clearwell\",E3078=\"Transfer Well\"),\"Worst Case Volume (each)\", \"Volume (each)\")","v":"Volume (each)"},null,null,null,"  gal"]
[null,"Percent of Maximum Volume",null,null,{"$f":"IF(H3078=\"Other\",IF(E3094 = 0,\"\",E3097/E3094*100),IF(OR(E3078=\"Clearwell\",E3078=\"Transfer Well\"),IF(E3093 = 0,\"\",E3096/E3093*100),\"\"))","v":""},"  %"]
[]
[null,{"$f":" IF(OR(E3078=\"Clearwell\",E3078=\"Transfer Well\"),\"Worst Case Volume (each)\",\"Volume (each)\")","v":"Volume (each)"},null,null,{"$f":"IF(E3078=\"Filter\",IF(H3078=\"Circular\",PI()*(E3084/2)^2*(E3089*E3092/100+E3091+E3090),IF(H3078=\"Rectangular\",E3085*E3086*(E3089*E3092/100+E3091+E3090),\"error\")),IF(AND(E3078=\"Piping\",H3078=\"Pipe\"),PI()*(E3084/12/2)^2*E3085,IF(H3078=\"Circular\",IF(OR(E3078=\"Transfer Well\",E3078=\"Clearwell\"),E3096/7.4815,PI()*(E3084/2)^2*(2*E3087+E3088)/3),IF(H3078=\"Rectangular\",IF(OR(E3078=\"Transfer Well\",E3078=\"Clearwell\"),E3096/7.4815,E3085*E3086*E3087),E3097/7.4815))))*7.4815","v":0},"  gal"]
[null,"Flow Rate (each)",null,null,null,"  gpm"]
[null,"Detention Time",null,null,{"$f":"IF(OR(E3101=\"\",E3101=0),0,E3100/E3101)","v":0},"  min"]
[]
[null,"Baffling Factor",null,null,{"$f":"IF(I3105=\"Unbaffled\",0.1,IF(I3105=\"Poor\",0.3,IF(I3105=\"Average\",0.5,IF(I3105=\"Superior\",0.7,IF(I3105=\"Perfect\",1,IF(I3105=\"\",\" \",I3106))))))","v":0.1}]
[null,null,null,null,null,null,null,"Baffling Characteristics:  ","Unbaffled"]
[null,null,null,null,null,null,null,"Approved Baffling Factor:  "]
[null,"T10",null,null,{"$f":"E3102*E3104","v":0},"  min"]
[]
[null,"Unit - 9",null,"Type:",null,null,"Shape:"]
[]
[null,null,"Further Description:"]
[]
[null,"Characteristic",null,null,null,null,"Comments"]
[null,"Number of Units"]
[null,"Diameter",null,null,null,{"$f":"IF(H3109=\"pipe\",\"  in\",\"  ft\")","v":"  ft"}]
[null,"Length",null,null,null,"  ft"]
[null,"Width",null,null,null,"  ft"]
[null,"Side Water Depth",null,null,null,"  ft"]
[null,"Center Water Depth",null,null,null,"  ft"]
[null,"Media Depth",null,null,null,"  ft"]
[null,"Underdrain Depth",null,null,null,"  ft"]
[null,"Minimum Water Depth Over Media",null,null,null,"  ft"]
[null,"Average Porosity",null,null,null,"  %"]
[null,"Maximum Volume (each)",null,null,{"$f":"IF(OR(E3109=\"Clearwell\",E3109=\"Transfer Well\"),IF(H3109=\"Circular\",PI()*(E3115/2)^2*(2*E3118+E3119)/3*7.4815,IF(H3109=\"Rectangular\",E3116*E3117*E3118*7.4815,\"\")),\"\")","v":""},"  gal"]
[null,"Maximum Volume (each)",null,null,null,"  gal"]
[null,"Minimum Operating Level",null,null,null,"  ft"]
[null,"Worst Case Volume (each)",null,null,{"$f":"IF(OR(E3109=\"Transfer Well\",E3109=\"Clearwell\"),IF(H3109=\"Circular\",PI()*(E3115/2)^2*(2*E3126+E3119-(E3118-E3126))/3*7.4815,IF(H3109=\"Rectangular\",E3116*E3117*E3126*7.4815,\"\")),\"\")","v":""},"  gal"]
[null,{"$f":"IF(OR(E3109=\"Clearwell\",E3109=\"Transfer Well\"),\"Worst Case Volume (each)\", \"Volume (each)\")","v":"Volume (each)"},null,null,null,"  gal"]
[null,"Percent of Maximum Volume",null,null,{"$f":"IF(H3109=\"Other\",IF(E3125 = 0,\"\",E3128/E3125*100),IF(OR(E3109=\"Clearwell\",E3109=\"Transfer Well\"),IF(E3124 = 0,\"\",E3127/E3124*100),\"\"))","v":""},"  %"]
[]
[null,{"$f":" IF(OR(E3109=\"Clearwell\",E3109=\"Transfer Well\"),\"Worst Case Volume (each)\",\"Volume (each)\")","v":"Volume (each)"},null,null,{"$f":"IF(E3109=\"Filter\",IF(H3109=\"Circular\",PI()*(E3115/2)^2*(E3120*E3123/100+E3122+E3121),IF(H3109=\"Rectangular\",E3116*E3117*(E3120*E3123/100+E3122+E3121),\"error\")),IF(AND(E3109=\"Piping\",H3109=\"Pipe\"),PI()*(E3115/12/2)^2*E3116,IF(H3109=\"Circular\",IF(OR(E3109=\"Transfer Well\",E3109=\"Clearwell\"),E3127/7.4815,PI()*(E3115/2)^2*(2*E3118+E3119)/3),IF(H3109=\"Rectangular\",IF(OR(E3109=\"Transfer Well\",E3109=\"Clearwell\"),E3127/7.4815,E3116*E3117*E3118),E3128/7.4815))))*7.4815","v":0},"  gal"]
[null,"Flow Rate (each)",null,null,null,"  gpm"]
[null,"Detention Time",null,null,{"$f":"IF(OR(E3132=\"\",E3132=0),0,E3131/E3132)","v":0},"  min"]
[]
[null,"Baffling Factor",null,null,{"$f":"IF(I3136=\"Unbaffled\",0.1,IF(I3136=\"Poor\",0.3,IF(I3136=\"Average\",0.5,IF(I3136=\"Superior\",0.7,IF(I3136=\"Perfect\",1,IF(I3136=\"\",\" \",I3137))))))","v":0.1}]
[null,null,null,null,null,null,null,"Baffling Characteristics:  ","Unbaffled"]
[null,null,null,null,null,null,null,"Approved Baffling Factor:  "]
[null,"T10",null,null,{"$f":"E3133*E3135","v":0},"  min"]
[]
[null,"Unit - 10",null,"Type:",null,null,"Shape:"]
[]
[null,null,"Further Description:"]
[]
[null,"Characteristic",null,null,null,null,"Comments"]
[null,"Number of Units"]
[null,"Diameter",null,null,null,{"$f":"IF(H3140=\"pipe\",\"  in\",\"  ft\")","v":"  ft"}]
[null,"Length",null,null,null,"  ft"]
[null,"Width",null,null,null,"  ft"]
[null,"Side Water Depth",null,null,null,"  ft"]
[null,"Center Water Depth",null,null,null,"  ft"]
[null,"Media Depth",null,null,null,"  ft"]
[null,"Underdrain Depth",null,null,null,"  ft"]
[null,"Minimum Water Depth Over Media",null,null,null,"  ft"]
[null,"Average Porosity",null,null,null,"  %"]
[null,"Maximum Volume (each)",null,null,{"$f":"IF(OR(E3140=\"Clearwell\",E3140=\"Transfer Well\"),IF(H3140=\"Circular\",PI()*(E3146/2)^2*(2*E3149+E3150)/3*7.4815,IF(H3140=\"Rectangular\",E3147*E3148*E3149*7.4815,\"\")),\"\")","v":""},"  gal"]
[null,"Maximum Volume (each)",null,null,null,"  gal"]
[null,"Minimum Operating Level",null,null,null,"  ft"]
[null,"Worst Case Volume (each)",null,null,{"$f":"IF(OR(E3140=\"Transfer Well\",E3140=\"Clearwell\"),IF(H3140=\"Circular\",PI()*(E3146/2)^2*(2*E3157+E3150-(E3149-E3157))/3*7.4815,IF(H3140=\"Rectangular\",E3147*E3148*E3157*7.4815,\"\")),\"\")","v":""},"  gal"]
[null,{"$f":"IF(OR(E3140=\"Clearwell\",E3140=\"Transfer Well\"),\"Worst Case Volume (each)\", \"Volume (each)\")","v":"Volume (each)"},null,null,null,"  gal"]
[null,"Percent of Maximum Volume",null,null,{"$f":"IF(H3140=\"Other\",IF(E3156 = 0,\"\",E3159/E3156*100),IF(OR(E3140=\"Clearwell\",E3140=\"Transfer Well\"),IF(E3155 =0,\"\",E3158/E3155*100),\"\"))","v":""},"  %"]
[]
[null,{"$f":" IF(OR(E3140=\"Clearwell\",E3140=\"Transfer Well\"),\"Worst Case Volume (each)\",\"Volume (each)\")","v":"Volume (each)"},null,null,{"$f":"IF(E3140=\"Filter\",IF(H3140=\"Circular\",PI()*(E3146/2)^2*(E3151*E3154/100+E3153+E3152),IF(H3140=\"Rectangular\",E3147*E3148*(E3151*E3154/100+E3153+E3152),\"error\")),IF(AND(E3140=\"Piping\",H3140=\"Pipe\"),PI()*(E3146/12/2)^2*E3147,IF(H3140=\"Circular\",IF(OR(E3140=\"Transfer Well\",E3140=\"Clearwell\"),E3158/7.4815,PI()*(E3146/2)^2*(2*E3149+E3150)/3),IF(H3140=\"Rectangular\",IF(OR(E3140=\"Transfer Well\",E3140=\"Clearwell\"),E3158/7.4815,E3147*E3148*E3149),E3159/7.4815))))*7.4815","v":0},"  gal"]
[null,"Flow Rate (each)",null,null,null,"  gpm"]
[null,"Detention Time",null,null,{"$f":"IF(OR(E3163=\"\",E3163=0),0,E3162/E3163)","v":0},"  min"]
[]
[null,"Baffling Factor",null,null,{"$f":"IF(I3167=\"Unbaffled\",0.1,IF(I3167=\"Poor\",0.3,IF(I3167=\"Average\",0.5,IF(I3167=\"Superior\",0.7,IF(I3167=\"Perfect\",1,IF(I3167=\"\",\" \",I3168))))))","v":0.1}]
[null,null,null,null,null,null,null,"Baffling Characteristics:  ","Unbaffled"]
[null,null,null,null,null,null,null,"Approved Baffling Factor:  "]
[null,"T10",null,null,{"$f":"E3164*E3166","v":0},"  min"]
[]
[null,{"$f":"CONCATENATE(D2859,\" FLOW RATE\")","v":"D10 FLOW RATE"},null,null,{"$f":"MaxUnitFlow(E2890,E2921,E2952,E2983,E3014,E3045,E3076,E3107,E3138,E3169,E2884,E2915,E2946,E2977,E3008,E3039,E3070,E3101,E3132,E3163)*60*24/10^6","v":0},"  mgd"]
[]
[null,{"$f":"CONCATENATE(\"T10 SUM FOR \",D2859)","v":"T10 SUM FOR D10"},null,null,{"$f":"SUM(E2890,E2921,E2952,E2983,E3014,E3045,E3076,E3107,E3138,E3169)","v":0},"  min"]

{"sheet":"Summary","index":3,"n_rows":117,"n_cols":10,"rows_kept":117,"cut":false,"hidden":false,"merged":[[112,1,112,4],[113,1,113,4],[0,0,0,9],[1,0,1,9],[2,0,2,9],[3,0,3,9],[108,1,108,4],[109,1,109,4],[110,1,110,4],[111,1,111,4],[104,1,104,4],[105,1,105,4],[106,1,106,4],[107,1,107,4],[100,1,100,4],[101,1,101,4],[102,1,102,4],[103,1,103,4],[96,1,96,4],[97,1,97,4],[98,1,98,4],[99,1,99,4],[92,1,92,4],[93,1,93,4],[94,1,94,4],[95,1,95,4],[88,1,88,4],[89,1,89,4],[90,1,90,4],[91,1,91,4],[84,1,84,4],[85,1,85,4],[86,1,86,4],[87,1,87,4],[82,1,82,4],[83,1,83,4],[79,1,79,4],[80,1,80,4],[81,1,81,4],[68,1,68,4],[69,1,69,4],[70,1,70,4],[71,1,71,4],[62,1,62,4],[56,1,56,4],[57,1,57,4],[58,1,58,4],[59,1,59,4],[60,1,60,4],[61,1,61,4],[72,1,72,4],[73,1,73,4],[45,1,45,4],[46,1,46,4],[104,0,113,0],[94,0,103,0],[34,0,43,0],[54,0,63,0],[64,0,73,0],[74,0,83,0],[84,0,93,0],[54,1,54,4],[55,1,55,4],[74,1,74,4],[75,1,75,4],[76,1,76,4],[77,1,77,4],[78,1,78,4],[63,1,63,4],[64,1,64,4],[65,1,65,4],[66,1,66,4],[67,1,67,4],[51,1,51,4],[52,1,52,4],[53,1,53,4],[14,9,23,9],[6,1,6,5],[9,1,9,5],[11,1,13,4],[12,8,12,9],[9,7,9,9],[6,7,6,9],[11,8,11,9],[42,1,42,4],[25,1,25,4],[26,1,26,4],[27,1,27,4],[28,1,28,4],[29,1,29,4],[30,1,30,4],[33,1,33,4],[34,1,34,4],[35,1,35,4],[14,1,14,4],[15,1,15,4],[16,1,16,4],[17,1,17,4],[18,1,18,4],[19,1,19,4],[11,0,13,0],[11,7,13,7],[31,1,31,4],[32,1,32,4],[14,0,23,0],[24,0,33,0],[44,0,53,0],[22,1,22,4],[23,1,23,4],[36,1,36,4],[37,1,37,4],[38,1,38,4],[39,1,39,4],[40,1,40,4],[41,1,41,4],[20,1,20,4],[21,1,21,4],[24,1,24,4],[47,1,47,4],[48,1,48,4],[49,1,49,4],[50,1,50,4],[43,1,43,4],[44,1,44,4],[104,9,113,9],[24,9,33,9],[34,9,43,9],[64,9,73,9],[74,9,83,9],[84,9,93,9],[94,9,103,9],[44,9,53,9],[54,9,63,9]]}
["CT STUDY"]
["FOR PUBLIC WATER SYSTEMS THAT ARE USING SURFACE WATER SOURCES"]
["OR GROUND WATER SOURCES UNDER THE INFLUENCE OF SURFACE WATER (cont.)"]
["Summary Worksheet"]
[]
["PUBLIC WATER"]
["SYSTEM NAME:",{"$f":"IF(Description!B7=\"\",\"\",Description!B7)","v":""},null,null,null,null,"PWS ID No.:",{"$f":"IF(Description!H7=\"\",\"\",Description!H7)","v":""}]
[]
["PLANT NAME"]
["OR NUMBER:",{"$f":"IF(Description!B10=\"\",\"\",Description!B10)","v":""},null,null,null,null,"Date:",{"$f":"IF(OR(Description!H7=\"\",Description!H10=\"\",Description!H11=\"\"),\"\",Description!H9&\" \"&Description!H10&\", \"&Description!H11)","v":""}]
[]
["Disinfection Zone","Treatment Unit",null,null,null,"Volume*","Flow Rate*","Baffling Factor*","T10*"]
[null,null,null,null,null,"(each)","(each)",null,"(min)"]
[null,null,null,null,null,"(gal)","(MGD)",null,"Unit","Zone"]
[{"$f":"CONCATENATE(\"D\",Calculator!$BD$6)","v":"D1"},{"$f":"IF('T10 Details'!D19=\"\",IF('T10 Details'!E17=\"\",\"\",'T10 Details'!E17&\" (\"&'T10 Details'!E22&\")\"),'T10 Details'!D19&\" (\"&'T10 Details'!E22&\")\")","v":""},null,null,null,{"$f":"'T10 Details'!E39","v":0},{"$f":"'T10 Details'!E40*0.00144","v":0},{"$f":"'T10 Details'!E43","v":0.1},{"$f":"'T10 Details'!E46","v":0},{"$f":"'T10 Details'!E329","v":0}]
[null,{"$f":"IF('T10 Details'!D50=\"\",IF('T10 Details'!E48=\"\",\"\",'T10 Details'!E48&\" (\"&'T10 Details'!E53&\")\"),'T10 Details'!D50&\" (\"&'T10 Details'!E53&\")\")","v":""},null,null,null,{"$f":"'T10 Details'!E70","v":0},{"$f":"'T10 Details'!E71*0.00144","v":0},{"$f":"'T10 Details'!E74","v":0.1},{"$f":"'T10 Details'!E77","v":0}]
[null,{"$f":"IF('T10 Details'!D81=\"\",IF('T10 Details'!E79=\"\",\"\",'T10 Details'!E79&\" (\"&'T10 Details'!E84&\")\"),'T10 Details'!D81&\" (\"&'T10 Details'!E84&\")\")","v":""},null,null,null,{"$f":"'T10 Details'!E101","v":0},{"$f":"'T10 Details'!E102*0.00144","v":0},{"$f":"'T10 Details'!E105","v":0.1},{"$f":"'T10 Details'!E108","v":0}]
[null,{"$f":"IF('T10 Details'!D112=\"\",IF('T10 Details'!E110=\"\",\"\",'T10 Details'!E110&\" (\"&'T10 Details'!E115&\")\"),'T10 Details'!D112&\" (\"&'T10 Details'!E115&\")\")","v":""},null,null,null,{"$f":"'T10 Details'!E132","v":0},{"$f":"'T10 Details'!E133*0.00144","v":0},{"$f":"'T10 Details'!E136","v":0.1},{"$f":"'T10 Details'!E139","v":0}]
[null,{"$f":"IF('T10 Details'!D143=\"\",IF('T10 Details'!E141=\"\",\"\",'T10 Details'!E141&\" (\"&'T10 Details'!E146&\")\"),'T10 Details'!D143&\" (\"&'T10 Details'!E146&\")\")","v":""},null,null,null,{"$f":"'T10 Details'!E163","v":0},{"$f":"'T10 Details'!E164*0.00144","v":0},{"$f":"'T10 Details'!E167","v":0.1},{"$f":"'T10 Details'!E170","v":0}]
[null,{"$f":"IF('T10 Details'!D174=\"\",IF('T10 Details'!E172=\"\",\"\",'T10 Details'!E172&\" (\"&'T10 Details'!E177&\")\"),'T10 Details'!D174&\" (\"&'T10 Details'!E177&\")\")","v":""},null,null,null,{"$f":"'T10 Details'!E194","v":0},{"$f":"'T10 Details'!E195*0.00144","v":0},{"$f":"'T10 Details'!E198","v":0.1},{"$f":"'T10 Details'!E201","v":0}]
[null,{"$f":"IF('T10 Details'!D205=\"\",IF('T10 Details'!E203=\"\",\"\",'T10 Details'!E203&\" (\"&'T10 Details'!E208&\")\"),'T10 Details'!D205&\" (\"&'T10 Details'!E208&\")\")","v":""},null,null,null,{"$f":"'T10 Details'!E225","v":0},{"$f":"'T10 Details'!E226*0.00144","v":0},{"$f":"'T10 Details'!E229","v":0.1},{"$f":"'T10 Details'!E232","v":0}]
[null,{"$f":"IF('T10 Details'!D236=\"\",IF('T10 Details'!E234=\"\",\"\",'T10 Details'!E234&\" (\"&'T10 Details'!E239&\")\"),'T10 Details'!D236&\" (\"&'T10 Details'!E239&\")\")","v":""},null,null,null,{"$f":"'T10 Details'!E256","v":0},{"$f":"'T10 Details'!E257*0.00144","v":0},{"$f":"'T10 Details'!E260","v":0.1},{"$f":"'T10 Details'!E263","v":0}]
[null,{"$f":"IF('T10 Details'!D267=\"\",IF('T10 Details'!E265=\"\",\"\",'T10 Details'!E265&\" (\"&'T10 Details'!E270&\")\"),'T10 Details'!D267&\" (\"&'T10 Details'!E270&\")\")","v":""},null,null,null,{"$f":"'T10 Details'!E287","v":0},{"$f":"'T10 Details'!E288*0.00144","v":0},{"$f":"'T10 Details'!E291","v":0.1},{"$f":"'T10 Details'!E294","v":0}]
[null,{"$f":"IF('T10 Details'!D298=\"\",IF('T10 Details'!E296=\"\",\"\",'T10 Details'!E296&\" (\"&'T10 Details'!E301&\")\"),'T10 Details'!D298&\" (\"&'T10 Details'!E301&\")\")","v":""},null,null,null,{"$f":"'T10 Details'!E318","v":0},{"$f":"'T10 Details'!E319*0.00144","v":0},{"$f":"'T10 Details'!E322","v":0.1},{"$f":"'T10 Details'!E325","v":0}]
[{"$f":"CONCATENATE(\"D\",Calculator!$BE$6)","v":"D2"},{"$f":"IF('T10 Details'!D335=\"\",IF('T10 Details'!E333=\"\",\"\",'T10 Details'!E333&\" (\"&'T10 Details'!E338&\")\"),'T10 Details'!D335&\" (\"&'T10 Details'!E338&\")\")","v":""},null,null,null,{"$f":"'T10 Details'!E355","v":0},{"$f":"'T10 Details'!E356*0.00144","v":0},{"$f":"'T10 Details'!E359","v":0.1},{"$f":"'T10 Details'!E362","v":0},{"$f":"'T10 Details'!E645","v":0}]
[null,{"$f":"IF('T10 Details'!D366=\"\",IF('T10 Details'!E364=\"\",\"\",'T10 Details'!E364&\" (\"&'T10 Details'!E369&\")\"),'T10 Details'!D366&\" (\"&'T10 Details'!E369&\")\")","v":""},null,null,null,{"$f":"'T10 Details'!E386","v":0},{"$f":"'T10 Details'!E387*0.00144","v":0},{"$f":"'T10 Details'!E390","v":0.1},{"$f":"'T10 Details'!E393","v":0}]
[null,{"$f":"IF('T10 Details'!D397=\"\",IF('T10 Details'!E395=\"\",\"\",'T10 Details'!E395&\" (\"&'T10 Details'!E400&\")\"),'T10 Details'!D397&\" (\"&'T10 Details'!E400&\")\")","v":""},null,null,null,{"$f":"'T10 Details'!E417","v":0},{"$f":"'T10 Details'!E418*0.00144","v":0},{"$f":"'T10 Details'!E421","v":0.1},{"$f":"'T10 Details'!E424","v":0}]
[null,{"$f":"IF('T10 Details'!D428=\"\",IF('T10 Details'!E426=\"\",\"\",'T10 Details'!E426&\" (\"&'T10 Details'!E431&\")\"),'T10 Details'!D428&\" (\"&'T10 Details'!E431&\")\")","v":""},null,null,null,{"$f":"'T10 Details'!E448","v":0},{"$f":"'T10 Details'!E449*0.00144","v":0},{"$f":"'T10 Details'!E452","v":0.1},{"$f":"'T10 Details'!E455","v":0}]
[null,{"$f":"IF('T10 Details'!D459=\"\",IF('T10 Details'!E457=\"\",\"\",'T10 Details'!E457&\" (\"&'T10 Details'!E462&\")\"),'T10 Details'!D459&\" (\"&'T10 Details'!E462&\")\")","v":""},null,null,null,{"$f":"'T10 Details'!E479","v":0},{"$f":"'T10 Details'!E480*0.00144","v":0},{"$f":"'T10 Details'!E483","v":0.1},{"$f":"'T10 Details'!E486","v":0}]
[null,{"$f":"IF('T10 Details'!D490=\"\",IF('T10 Details'!E488=\"\",\"\",'T10 Details'!E488&\" (\"&'T10 Details'!E493&\")\"),'T10 Details'!D490&\" (\"&'T10 Details'!E493&\")\")","v":""},null,null,null,{"$f":"'T10 Details'!E510","v":0},{"$f":"'T10 Details'!E511*0.00144","v":0},{"$f":"'T10 Details'!E514","v":0.1},{"$f":"'T10 Details'!E517","v":0}]
[null,{"$f":"IF('T10 Details'!D521=\"\",IF('T10 Details'!E519=\"\",\"\",'T10 Details'!E519&\" (\"&'T10 Details'!E524&\")\"),'T10 Details'!D521&\" (\"&'T10 Details'!E524&\")\")","v":""},null,null,null,{"$f":"'T10 Details'!E541","v":0},{"$f":"'T10 Details'!E542*0.00144","v":0},{"$f":"'T10 Details'!E545","v":0.1},{"$f":"'T10 Details'!E548","v":0}]
[null,{"$f":"IF('T10 Details'!D552=\"\",IF('T10 Details'!E550=\"\",\"\",'T10 Details'!E550&\" (\"&'T10 Details'!E555&\")\"),'T10 Details'!D551&\" (\"&'T10 Details'!E555&\")\")","v":""},null,null,null,{"$f":"'T10 Details'!E572","v":0},{"$f":"'T10 Details'!E573*0.00144","v":0},{"$f":"'T10 Details'!E576","v":0.1},{"$f":"'T10 Details'!E579","v":0}]
[null,{"$f":"IF('T10 Details'!D583=\"\",IF('T10 Details'!E581=\"\",\"\",'T10 Details'!E581&\" (\"&'T10 Details'!E586&\")\"),'T10 Details'!D583&\" (\"&'T10 Details'!E586&\")\")","v":""},null,null,null,{"$f":"'T10 Details'!E603","v":0},{"$f":"'T10 Details'!E604*0.00144","v":0},{"$f":"'T10 Details'!E607","v":0.1},{"$f":"'T10 Details'!E610","v":0}]
[null,{"$f":"IF('T10 Details'!D614=\"\",IF('T10 Details'!E612=\"\",\"\",'T10 Details'!E612&\" (\"&'T10 Details'!E617&\")\"),'T10 Details'!D614&\" (\"&'T10 Details'!E617&\")\")","v":""},null,null,null,{"$f":"'T10 Details'!E634","v":0},{"$f":"'T10 Details'!E635*0.00144","v":0},{"$f":"'T10 Details'!E638","v":0.1},{"$f":"'T10 Details'!E641","v":0}]
[{"$f":"CONCATENATE(\"D\",Calculator!$BF$6)","v":"D3"},{"$f":"IF('T10 Details'!D651=\"\",IF('T10 Details'!E649=\"\",\"\",'T10 Details'!E649&\" (\"&'T10 Details'!E654&\")\"),'T10 Details'!D651&\" (\"&'T10 Details'!E654&\")\")","v":""},null,null,null,{"$f":"'T10 Details'!E671","v":0},{"$f":"'T10 Details'!E672*0.00144","v":0},{"$f":"'T10 Details'!E675","v":0.1},{"$f":"'T10 Details'!E678","v":0},{"$f":"'T10 Details'!E961","v":0}]
[null,{"$f":"IF('T10 Details'!D682=\"\",IF('T10 Details'!E680=\"\",\"\",'T10 Details'!E680&\" (\"&'T10 Details'!E685&\")\"),'T10 Details'!D682&\" (\"&'T10 Details'!E685&\")\")","v":""},null,null,null,{"$f":"'T10 Details'!E702","v":0},{"$f":"'T10 Details'!E703*0.00144","v":0},{"$f":"'T10 Details'!E706","v":0.1},{"$f":"'T10 Details'!E709","v":0}]
[null,{"$f":"IF('T10 Details'!D713=\"\",IF('T10 Details'!E711=\"\",\"\",'T10 Details'!E711&\" (\"&'T10 Details'!E716&\")\"),'T10 Details'!D713&\" (\"&'T10 Details'!E716&\")\")","v":""},null,null,null,{"$f":"'T10 Details'!E733","v":0},{"$f":"'T10 Details'!E734*0.00144","v":0},{"$f":"'T10 Details'!E737","v":0.1},{"$f":"'T10 Details'!E740","v":0}]
[null,{"$f":"IF('T10 Details'!D744=\"\",IF('T10 Details'!E742=\"\",\"\",'T10 Details'!E742&\" (\"&'T10 Details'!E747&\")\"),'T10 Details'!D744&\" (\"&'T10 Details'!E747&\")\")","v":""},null,null,null,{"$f":"'T10 Details'!E764","v":0},{"$f":"'T10 Details'!E765*0.00144","v":0},{"$f":"'T10 Details'!E768","v":0.1},{"$f":"'T10 Details'!E771","v":0}]
[null,{"$f":"IF('T10 Details'!D775=\"\",IF('T10 Details'!E773=\"\",\"\",'T10 Details'!E773&\" (\"&'T10 Details'!E778&\")\"),'T10 Details'!D775&\" (\"&'T10 Details'!E778&\")\")","v":""},null,null,null,{"$f":"'T10 Details'!E795","v":0},{"$f":"'T10 Details'!E796*0.00144","v":0},{"$f":"'T10 Details'!E799","v":0.1},{"$f":"'T10 Details'!E802","v":0}]
[null,{"$f":"IF('T10 Details'!D806=\"\",IF('T10 Details'!E804=\"\",\"\",'T10 Details'!E804&\" (\"&'T10 Details'!E809&\")\"),'T10 Details'!D806&\" (\"&'T10 Details'!E809&\")\")","v":""},null,null,null,{"$f":"'T10 Details'!E826","v":0},{"$f":"'T10 Details'!E827*0.00144","v":0},{"$f":"'T10 Details'!E830","v":0.1},{"$f":"'T10 Details'!E833","v":0}]
[null,{"$f":"IF('T10 Details'!D837=\"\",IF('T10 Details'!E835=\"\",\"\",'T10 Details'!E835&\" (\"&'T10 Details'!E840&\")\"),'T10 Details'!D837&\" (\"&'T10 Details'!E840&\")\")","v":""},null,null,null,{"$f":"'T10 Details'!E857","v":0},{"$f":"'T10 Details'!E858*0.00144","v":0},{"$f":"'T10 Details'!E861","v":0.1},{"$f":"'T10 Details'!E864","v":0}]
[null,{"$f":"IF('T10 Details'!D868=\"\",IF('T10 Details'!E866=\"\",\"\",'T10 Details'!E866&\" (\"&'T10 Details'!E871&\")\"),'T10 Details'!D868&\" (\"&'T10 Details'!E871&\")\")","v":""},null,null,null,{"$f":"'T10 Details'!E888","v":0},{"$f":"'T10 Details'!E889*0.00144","v":0},{"$f":"'T10 Details'!E892","v":0.1},{"$f":"'T10 Details'!E895","v":0}]
[null,{"$f":"IF('T10 Details'!D899=\"\",IF('T10 Details'!E897=\"\",\"\",'T10 Details'!E897&\" (\"&'T10 Details'!E902&\")\"),'T10 Details'!D899&\" (\"&'T10 Details'!E902&\")\")","v":""},null,null,null,{"$f":"'T10 Details'!E919","v":0},{"$f":"'T10 Details'!E920*0.00144","v":0},{"$f":"'T10 Details'!E923","v":0.1},{"$f":"'T10 Details'!E926","v":0}]
[null,{"$f":"IF('T10 Details'!D930=\"\",IF('T10 Details'!E928=\"\",\"\",'T10 Details'!E928&\" (\"&'T10 Details'!E933&\")\"),'T10 Details'!D930&\" (\"&'T10 Details'!E933&\")\")","v":""},null,null,null,{"$f":"'T10 Details'!E950","v":0},{"$f":"'T10 Details'!E9511*0.00144","v":0},{"$f":"'T10 Details'!E954","v":0.1},{"$f":"'T10 Details'!E957","v":0}]
[{"$f":"CONCATENATE(\"D\",Calculator!$BG$6)","v":"D4"},{"$f":"IF('T10 Details'!D967=\"\",IF('T10 Details'!E965=\"\",\"\",'T10 Details'!E965&\" (\"&'T10 Details'!E970&\")\"),'T10 Details'!D967&\" (\"&'T10 Details'!E970&\")\")","v":""},null,null,null,{"$f":"'T10 Details'!E987","v":0},{"$f":"'T10 Details'!E988*0.00144","v":0},{"$f":"'T10 Details'!E991","v":0.1},{"$f":"'T10 Details'!E994","v":0},{"$f":"'T10 Details'!E1277","v":0}]
[null,{"$f":"IF('T10 Details'!D998=\"\",IF('T10 Details'!E996=\"\",\"\",'T10 Details'!E996&\" (\"&'T10 Details'!E1001&\")\"),'T10 Details'!D998&\" (\"&'T10 Details'!E1001&\")\")","v":""},null,null,null,{"$f":"'T10 Details'!E1018","v":0},{"$f":"'T10 Details'!E1019*0.00144","v":0},{"$f":"'T10 Details'!E1022","v":0.1},{"$f":"'T10 Details'!E1025","v":0}]
[null,{"$f":"IF('T10 Details'!D1029=\"\",IF('T10 Details'!E1027=\"\",\"\",'T10 Details'!E1027&\" (\"&'T10 Details'!E1032&\")\"),'T10 Details'!D1029&\" (\"&'T10 Details'!E1032&\")\")","v":""},null,null,null,{"$f":"'T10 Details'!E1049","v":0},{"$f":"'T10 Details'!E1050*0.00144","v":0},{"$f":"'T10 Details'!E1053","v":0.1},{"$f":"'T10 Details'!E1056","v":0}]
[null,{"$f":"IF('T10 Details'!D1060=\"\",IF('T10 Details'!E1058=\"\",\"\",'T10 Details'!E1058&\" (\"&'T10 Details'!E1063&\")\"),'T10 Details'!D1060&\" (\"&'T10 Details'!E1063&\")\")","v":""},null,null,null,{"$f":"'T10 Details'!E1080","v":0},{"$f":"'T10 Details'!E1081*0.00144","v":0},{"$f":"'T10 Details'!E1084","v":0.1},{"$f":"'T10 Details'!E1087","v":0}]
[null,{"$f":"IF('T10 Details'!D1091=\"\",IF('T10 Details'!E1089=\"\",\"\",'T10 Details'!E1089&\" (\"&'T10 Details'!E1094&\")\"),'T10 Details'!D1091&\" (\"&'T10 Details'!E1094&\")\")","v":""},null,null,null,{"$f":"'T10 Details'!E1111","v":0},{"$f":"'T10 Details'!E1112*0.00144","v":0},{"$f":"'T10 Details'!E1115","v":0.1},{"$f":"'T10 Details'!E1118","v":0}]
[null,{"$f":"IF('T10 Details'!D1122=\"\",IF('T10 Details'!E1120=\"\",\"\",'T10 Details'!E1120&\" (\"&'T10 Details'!E1125&\")\"),'T10 Details'!D1122&\" (\"&'T10 Details'!E1125&\")\")","v":""},null,null,null,{"$f":"'T10 Details'!E1142","v":0},{"$f":"'T10 Details'!E1143*0.00144","v":0},{"$f":"'T10 Details'!E1146","v":0.1},{"$f":"'T10 Details'!E1149","v":0}]
[null,{"$f":"IF('T10 Details'!D1153=\"\",IF('T10 Details'!E1151=\"\",\"\",'T10 Details'!E1151&\" (\"&'T10 Details'!E1156&\")\"),'T10 Details'!D1153&\" (\"&'T10 Details'!E1156&\")\")","v":""},null,null,null,{"$f":"'T10 Details'!E1173","v":0},{"$f":"'T10 Details'!E1174*0.00144","v":0},{"$f":"'T10 Details'!E1177","v":0.1},{"$f":"'T10 Details'!E1180","v":0}]
[null,{"$f":"IF('T10 Details'!D1184=\"\",IF('T10 Details'!E1182=\"\",\"\",'T10 Details'!E1182&\" (\"&'T10 Details'!E1187&\")\"),'T10 Details'!D1184&\" (\"&'T10 Details'!E1187&\")\")","v":""},null,null,null,{"$f":"'T10 Details'!E1204","v":0},{"$f":"'T10 Details'!E1205*0.00144","v":0},{"$f":"'T10 Details'!E1208","v":0.1},{"$f":"'T10 Details'!E1211","v":0}]
[null,{"$f":"IF('T10 Details'!D1215=\"\",IF('T10 Details'!E1213=\"\",\"\",'T10 Details'!E1213&\" (\"&'T10 Details'!E1218&\")\"),'T10 Details'!D1215&\" (\"&'T10 Details'!E1218&\")\")","v":""},null,null,null,{"$f":"'T10 Details'!E1235","v":0},{"$f":"'T10 Details'!E1236*0.00144","v":0},{"$f":"'T10 Details'!E1239","v":0.1},{"$f":"'T10 Details'!E1242","v":0}]
[null,{"$f":"IF('T10 Details'!D1246=\"\",IF('T10 Details'!E1244=\"\",\"\",'T10 Details'!E1244&\" (\"&'T10 Details'!E1249&\")\"),'T10 Details'!D1246&\" (\"&'T10 Details'!E1249&\")\")","v":""},null,null,null,{"$f":"'T10 Details'!E1266","v":0},{"$f":"'T10 Details'!E1267*0.00144","v":0},{"$f":"'T10 Details'!E1270","v":0.1},{"$f":"'T10 Details'!E1273","v":0}]
[{"$f":"CONCATENATE(\"D\",Calculator!$BH$6)","v":"D5"},{"$f":"IF('T10 Details'!D1283=\"\",IF('T10 Details'!E1281=\"\",\"\",'T10 Details'!E1281&\" (\"&'T10 Details'!E1286&\")\"),'T10 Details'!D1283&\" (\"&'T10 Details'!E1286&\")\")","v":""},null,null,null,{"$f":"'T10 Details'!E1303","v":0},{"$f":"'T10 Details'!E1304*0.00144","v":0},{"$f":"'T10 Details'!E1307","v":0.1},{"$f":"'T10 Details'!E1310","v":0},{"$f":"'T10 Details'!E1593","v":0}]
[null,{"$f":"IF('T10 Details'!D1314=\"\",IF('T10 Details'!E1312=\"\",\"\",'T10 Details'!E1312&\" (\"&'T10 Details'!E1317&\")\"),'T10 Details'!D1314&\" (\"&'T10 Details'!E1317&\")\")","v":""},null,null,null,{"$f":"'T10 Details'!E1334","v":0},{"$f":"'T10 Details'!E1335*0.00144","v":0},{"$f":"'T10 Details'!E1338","v":0.1},{"$f":"'T10 Details'!E1341","v":0}]
[null,{"$f":"IF('T10 Details'!D1345=\"\",IF('T10 Details'!E1343=\"\",\"\",'T10 Details'!E1343&\" (\"&'T10 Details'!E1348&\")\"),'T10 Details'!D1345&\" (\"&'T10 Details'!E1348&\")\")","v":""},null,null,null,{"$f":"'T10 Details'!E1365","v":0},{"$f":"'T10 Details'!E1366*0.00144","v":0},{"$f":"'T10 Details'!E1369","v":0.1},{"$f":"'T10 Details'!E1372","v":0}]
[null,{"$f":"IF('T10 Details'!D1376=\"\",IF('T10 Details'!E1374=\"\",\"\",'T10 Details'!E1374&\" (\"&'T10 Details'!E1379&\")\"),'T10 Details'!D1376&\" (\"&'T10 Details'!E1379&\")\")","v":""},null,null,null,{"$f":"'T10 Details'!E1396","v":0},{"$f":"'T10 Details'!E1397*0.00144","v":0},{"$f":"'T10 Details'!E1400","v":0.1},{"$f":"'T10 Details'!E1403","v":0}]
[null,{"$f":"IF('T10 Details'!D1407=\"\",IF('T10 Details'!E1405=\"\",\"\",'T10 Details'!E1405&\" (\"&'T10 Details'!E1410&\")\"),'T10 Details'!D1407&\" (\"&'T10 Details'!E1410&\")\")","v":""},null,null,null,{"$f":"'T10 Details'!E1427","v":0},{"$f":"'T10 Details'!E1428*0.00144","v":0},{"$f":"'T10 Details'!E1431","v":0.1},{"$f":"'T10 Details'!E1434","v":0}]
[null,{"$f":"IF('T10 Details'!D1438=\"\",IF('T10 Details'!E1436=\"\",\"\",'T10 Details'!E1436&\" (\"&'T10 Details'!E1441&\")\"),'T10 Details'!D1438&\" (\"&'T10 Details'!E1441&\")\")","v":""},null,null,null,{"$f":"'T10 Details'!E1458","v":0},{"$f":"'T10 Details'!E1459*0.00144","v":0},{"$f":"'T10 Details'!E1462","v":0.1},{"$f":"'T10 Details'!E1465","v":0}]
[null,{"$f":"IF('T10 Details'!D1469=\"\",IF('T10 Details'!E1467=\"\",\"\",'T10 Details'!E1467&\" (\"&'T10 Details'!E1472&\")\"),'T10 Details'!D1469&\" (\"&'T10 Details'!E1472&\")\")","v":""},null,null,null,{"$f":"'T10 Details'!E1489","v":0},{"$f":"'T10 Details'!E1490*0.00144","v":0},{"$f":"'T10 Details'!E1493","v":0.1},{"$f":"'T10 Details'!E1496","v":0}]
[null,{"$f":"IF('T10 Details'!D1500=\"\",IF('T10 Details'!E1498=\"\",\"\",'T10 Details'!E1498&\" (\"&'T10 Details'!E1503&\")\"),'T10 Details'!D1500&\" (\"&'T10 Details'!E1503&\")\")","v":""},null,null,null,{"$f":"'T10 Details'!E1520","v":0},{"$f":"'T10 Details'!E1521*0.00144","v":0},{"$f":"'T10 Details'!E1524","v":0.1},{"$f":"'T10 Details'!E1527","v":0}]
[null,{"$f":"IF('T10 Details'!D1531=\"\",IF('T10 Details'!E1529=\"\",\"\",'T10 Details'!E1529&\" (\"&'T10 Details'!E1534&\")\"),'T10 Details'!D1531&\" (\"&'T10 Details'!E1534&\")\")","v":""},null,null,null,{"$f":"'T10 Details'!E1551","v":0},{"$f":"'T10 Details'!E1552*0.00144","v":0},{"$f":"'T10 Details'!E1555","v":0.1},{"$f":"'T10 Details'!E1558","v":0}]
[null,{"$f":"IF('T10 Details'!D1562=\"\",IF('T10 Details'!E1560=\"\",\"\",'T10 Details'!E1560&\" (\"&'T10 Details'!E1565&\")\"),'T10 Details'!D1562&\" (\"&'T10 Details'!E1565&\")\")","v":""},null,null,null,{"$f":"'T10 Details'!E1582","v":0},{"$f":"'T10 Details'!E1583*0.00144","v":0},{"$f":"'T10 Details'!E1586","v":0.1},{"$f":"'T10 Details'!E1589","v":0}]
[{"$f":"CONCATENATE(\"D\",Calculator!$BI$6)","v":"D6"},{"$f":"IF('T10 Details'!D1599=\"\",IF('T10 Details'!E1597=\"\",\"\",'T10 Details'!E1597&\" (\"&'T10 Details'!E1602&\")\"),'T10 Details'!D1599&\" (\"&'T10 Details'!E1602&\")\")","v":""},null,null,null,{"$f":"'T10 Details'!E1619","v":0},{"$f":"'T10 Details'!E1620*0.00144","v":0},{"$f":"'T10 Details'!E1623","v":0.1},{"$f":"'T10 Details'!E1626","v":0},{"$f":"'T10 Details'!E1909","v":0}]
[null,{"$f":"IF('T10 Details'!D1630=\"\",IF('T10 Details'!E1628=\"\",\"\",'T10 Details'!E1628&\" (\"&'T10 Details'!E1633&\")\"),'T10 Details'!D1630&\" (\"&'T10 Details'!E1633&\")\")","v":""},null,null,null,{"$f":"'T10 Details'!E1650","v":0},{"$f":"'T10 Details'!E1651*0.00144","v":0},{"$f":"'T10 Details'!E1654","v":0.1},{"$f":"'T10 Details'!E1657","v":0}]
[null,{"$f":"IF('T10 Details'!D1661=\"\",IF('T10 Details'!E1659=\"\",\"\",'T10 Details'!E1659&\" (\"&'T10 Details'!E1664&\")\"),'T10 Details'!D1661&\" (\"&'T10 Details'!E1664&\")\")","v":""},null,null,null,{"$f":"'T10 Details'!E1681","v":0},{"$f":"'T10 Details'!E1682*0.00144","v":0},{"$f":"'T10 Details'!E1685","v":0.1},{"$f":"'T10 Details'!E1688","v":0}]
[null,{"$f":"IF('T10 Details'!D1692=\"\",IF('T10 Details'!E1690=\"\",\"\",'T10 Details'!E1690&\" (\"&'T10 Details'!E1695&\")\"),'T10 Details'!D1692&\" (\"&'T10 Details'!E1695&\")\")","v":""},null,null,null,{"$f":"'T10 Details'!E1712","v":0},{"$f":"'T10 Details'!E1713*0.00144","v":0},{"$f":"'T10 Details'!E1716","v":0.1},{"$f":"'T10 Details'!E1719","v":0}]
[null,{"$f":"IF('T10 Details'!D1723=\"\",IF('T10 Details'!E1721=\"\",\"\",'T10 Details'!E1721&\" (\"&'T10 Details'!E1726&\")\"),'T10 Details'!D1723&\" (\"&'T10 Details'!E1726&\")\")","v":""},null,null,null,{"$f":"'T10 Details'!E1743","v":0},{"$f":"'T10 Details'!E1744*0.00144","v":0},{"$f":"'T10 Details'!E1747","v":0.1},{"$f":"'T10 Details'!E1750","v":0}]
[null,{"$f":"IF('T10 Details'!D1754=\"\",IF('T10 Details'!E1752=\"\",\"\",'T10 Details'!E1752&\" (\"&'T10 Details'!E1757&\")\"),'T10 Details'!D1754&\" (\"&'T10 Details'!E1757&\")\")","v":""},null,null,null,{"$f":"'T10 Details'!E1774","v":0},{"$f":"'T10 Details'!E1775*0.00144","v":0},{"$f":"'T10 Details'!E1778","v":0.1},{"$f":"'T10 Details'!E1781","v":0}]
[null,{"$f":"IF('T10 Details'!D1785=\"\",IF('T10 Details'!E1783=\"\",\"\",'T10 Details'!E1783&\" (\"&'T10 Details'!E1788&\")\"),'T10 Details'!D1785&\" (\"&'T10 Details'!E1788&\")\")","v":""},null,null,null,{"$f":"'T10 Details'!E1805","v":0},{"$f":"'T10 Details'!E1806*0.00144","v":0},{"$f":"'T10 Details'!E1809","v":0.1},{"$f":"'T10 Details'!E1812","v":0}]
[null,{"$f":"IF('T10 Details'!D1816=\"\",IF('T10 Details'!E1814=\"\",\"\",'T10 Details'!E1814&\" (\"&'T10 Details'!E1819&\")\"),'T10 Details'!D1816&\" (\"&'T10 Details'!E1819&\")\")","v":""},null,null,null,{"$f":"'T10 Details'!E1836","v":0},{"$f":"'T10 Details'!E1837*0.00144","v":0},{"$f":"'T10 Details'!E1840","v":0.1},{"$f":"'T10 Details'!E1843","v":0}]
[null,{"$f":"IF('T10 Details'!D1847=\"\",IF('T10 Details'!E1845=\"\",\"\",'T10 Details'!E1845&\" (\"&'T10 Details'!E1850&\")\"),'T10 Details'!D2847&\" (\"&'T10 Details'!E1850&\")\")","v":""},null,null,null,{"$f":"'T10 Details'!E1867","v":0},{"$f":"'T10 Details'!E1868*0.00144","v":0},{"$f":"'T10 Details'!E1871","v":0.1},{"$f":"'T10 Details'!E1874","v":0}]
[null,{"$f":"IF('T10 Details'!D1878=\"\",IF('T10 Details'!E1876=\"\",\"\",'T10 Details'!E1876&\" (\"&'T10 Details'!E1881&\")\"),'T10 Details'!D1878&\" (\"&'T10 Details'!E1881&\")\")","v":""},null,null,null,{"$f":"'T10 Details'!E1898","v":0},{"$f":"'T10 Details'!E1899*0.00144","v":0},{"$f":"'T10 Details'!E1902","v":0.1},{"$f":"'T10 Details'!E1905","v":0}]
[{"$f":"CONCATENATE(\"D\",Calculator!$BJ$6)","v":"D7"},{"$f":"IF('T10 Details'!D1915=\"\",IF('T10 Details'!E1913=\"\",\"\",'T10 Details'!E1913&\" (\"&'T10 Details'!E1918&\")\"),'T10 Details'!D1915&\" (\"&'T10 Details'!E1918&\")\")","v":""},null,null,null,{"$f":"'T10 Details'!E1935","v":0},{"$f":"'T10 Details'!E1936*0.00144","v":0},{"$f":"'T10 Details'!E1939","v":0.1},{"$f":"'T10 Details'!E1942","v":0},{"$f":"'T10 Details'!E2225","v":0}]
[null,{"$f":"IF('T10 Details'!D1946=\"\",IF('T10 Details'!E1944=\"\",\"\",'T10 Details'!E1944&\" (\"&'T10 Details'!E1949&\")\"),'T10 Details'!D1946&\" (\"&'T10 Details'!E1949&\")\")","v":""},null,null,null,{"$f":"'T10 Details'!E1966","v":0},{"$f":"'T10 Details'!E1967*0.00144","v":0},{"$f":"'T10 Details'!E1970","v":0.1},{"$f":"'T10 Details'!E1973","v":0}]
[null,{"$f":"IF('T10 Details'!D1977=\"\",IF('T10 Details'!E1975=\"\",\"\",'T10 Details'!E1975&\" (\"&'T10 Details'!E1980&\")\"),'T10 Details'!D1977&\" (\"&'T10 Details'!E1980&\")\")","v":""},null,null,null,{"$f":"'T10 Details'!E1997","v":0},{"$f":"'T10 Details'!E1998*0.00144","v":0},{"$f":"'T10 Details'!E2001","v":0.1},{"$f":"'T10 Details'!E2004","v":0}]
[null,{"$f":"IF('T10 Details'!D2008=\"\",IF('T10 Details'!E2006=\"\",\"\",'T10 Details'!E2006&\" (\"&'T10 Details'!E2011&\")\"),'T10 Details'!D2008&\" (\"&'T10 Details'!E2011&\")\")","v":""},null,null,null,{"$f":"'T10 Details'!E2028","v":0},{"$f":"'T10 Details'!E2029*0.00144","v":0},{"$f":"'T10 Details'!E2032","v":0.1},{"$f":"'T10 Details'!E2035","v":0}]
[null,{"$f":"IF('T10 Details'!D2039=\"\",IF('T10 Details'!E2037=\"\",\"\",'T10 Details'!E2037&\" (\"&'T10 Details'!E2042&\")\"),'T10 Details'!D2039&\" (\"&'T10 Details'!E2042&\")\")","v":""},null,null,null,{"$f":"'T10 Details'!E2059","v":0},{"$f":"'T10 Details'!E2060*0.00144","v":0},{"$f":"'T10 Details'!E2063","v":0.1},{"$f":"'T10 Details'!E2066","v":0}]
[null,{"$f":"IF('T10 Details'!D2070=\"\",IF('T10 Details'!E2068=\"\",\"\",'T10 Details'!E2068&\" (\"&'T10 Details'!E2073&\")\"),'T10 Details'!D2070&\" (\"&'T10 Details'!E2073&\")\")","v":""},null,null,null,{"$f":"'T10 Details'!E2090","v":0},{"$f":"'T10 Details'!E2091*0.00144","v":0},{"$f":"'T10 Details'!E2094","v":0.1},{"$f":"'T10 Details'!E2097","v":0}]
[null,{"$f":"IF('T10 Details'!D2101=\"\",IF('T10 Details'!E2099=\"\",\"\",'T10 Details'!E2099&\" (\"&'T10 Details'!E2104&\")\"),'T10 Details'!D2101&\" (\"&'T10 Details'!E2104&\")\")","v":""},null,null,null,{"$f":"'T10 Details'!E2121","v":0},{"$f":"'T10 Details'!E2122*0.00144","v":0},{"$f":"'T10 Details'!E2125","v":0.1},{"$f":"'T10 Details'!E2128","v":0}]
[null,{"$f":"IF('T10 Details'!D2132=\"\",IF('T10 Details'!E2130=\"\",\"\",'T10 Details'!E2130&\" (\"&'T10 Details'!E2135&\")\"),'T10 Details'!D2132&\" (\"&'T10 Details'!E2135&\")\")","v":""},null,null,null,{"$f":"'T10 Details'!E2152","v":0},{"$f":"'T10 Details'!E2153*0.00144","v":0},{"$f":"'T10 Details'!E2156","v":0.1},{"$f":"'T10 Details'!E2159","v":0}]
[null,{"$f":"IF('T10 Details'!D2163=\"\",IF('T10 Details'!E2161=\"\",\"\",'T10 Details'!E2161&\" (\"&'T10 Details'!E2166&\")\"),'T10 Details'!D2163&\" (\"&'T10 Details'!E2166&\")\")","v":""},null,null,null,{"$f":"'T10 Details'!E2183","v":0},{"$f":"'T10 Details'!E2184*0.00144","v":0},{"$f":"'T10 Details'!E2187","v":0.1},{"$f":"'T10 Details'!E2190","v":0}]
[null,{"$f":"IF('T10 Details'!D2194=\"\",IF('T10 Details'!E2192=\"\",\"\",'T10 Details'!E2192&\" (\"&'T10 Details'!E2197&\")\"),'T10 Details'!D2194&\" (\"&'T10 Details'!E2197&\")\")","v":""},null,null,null,{"$f":"'T10 Details'!E2214","v":0},{"$f":"'T10 Details'!E2215*0.00144","v":0},{"$f":"'T10 Details'!E2218","v":0.1},{"$f":"'T10 Details'!E2221","v":0}]
[{"$f":"CONCATENATE(\"D\",Calculator!$BK$6)","v":"D8"},{"$f":"IF('T10 Details'!D2231=\"\",IF('T10 Details'!E2229=\"\",\"\",'T10 Details'!E2229&\" (\"&'T10 Details'!E2234&\")\"),'T10 Details'!D2231&\" (\"&'T10 Details'!E2234&\")\")","v":""},null,null,null,{"$f":"'T10 Details'!E2251","v":0},{"$f":"'T10 Details'!E2252*0.00144","v":0},{"$f":"'T10 Details'!E2255","v":0.1},{"$f":"'T10 Details'!E2258","v":0},{"$f":"'T10 Details'!E2541","v":0}]
[null,{"$f":"IF('T10 Details'!D2262=\"\",IF('T10 Details'!E2260=\"\",\"\",'T10 Details'!E2260&\" (\"&'T10 Details'!E2265&\")\"),'T10 Details'!D2262&\" (\"&'T10 Details'!E2265&\")\")","v":""},null,null,null,{"$f":"'T10 Details'!E2282","v":0},{"$f":"'T10 Details'!E2283*0.00144","v":0},{"$f":"'T10 Details'!E2286","v":0.1},{"$f":"'T10 Details'!E2289","v":0}]
[null,{"$f":"IF('T10 Details'!D2293=\"\",IF('T10 Details'!E2291=\"\",\"\",'T10 Details'!E2291&\" (\"&'T10 Details'!E2296&\")\"),'T10 Details'!D2293&\" (\"&'T10 Details'!E2296&\")\")","v":""},null,null,null,{"$f":"'T10 Details'!E2313","v":0},{"$f":"'T10 Details'!E2314*0.00144","v":0},{"$f":"'T10 Details'!E2317","v":0.1},{"$f":"'T10 Details'!E2320","v":0}]
[null,{"$f":"IF('T10 Details'!D2324=\"\",IF('T10 Details'!E2322=\"\",\"\",'T10 Details'!E2322&\" (\"&'T10 Details'!E2327&\")\"),'T10 Details'!D2324&\" (\"&'T10 Details'!E2327&\")\")","v":""},null,null,null,{"$f":"'T10 Details'!E2344","v":0},{"$f":"'T10 Details'!E2345*0.00144","v":0},{"$f":"'T10 Details'!E2348","v":0.1},{"$f":"'T10 Details'!E2351","v":0}]
[null,{"$f":"IF('T10 Details'!D2355=\"\",IF('T10 Details'!E2353=\"\",\"\",'T10 Details'!E2353&\" (\"&'T10 Details'!E2358&\")\"),'T10 Details'!D2355&\" (\"&'T10 Details'!E2358&\")\")","v":""},null,null,null,{"$f":"'T10 Details'!E2375","v":0},{"$f":"'T10 Details'!E2376*0.00144","v":0},{"$f":"'T10 Details'!E2379","v":0.1},{"$f":"'T10 Details'!E2382","v":0}]
[null,{"$f":"IF('T10 Details'!D2386=\"\",IF('T10 Details'!E2384=\"\",\"\",'T10 Details'!E2384&\" (\"&'T10 Details'!E2389&\")\"),'T10 Details'!D2386&\" (\"&'T10 Details'!E2389&\")\")","v":""},null,null,null,{"$f":"'T10 Details'!E2406","v":0},{"$f":"'T10 Details'!E2407*0.00144","v":0},{"$f":"'T10 Details'!E2410","v":0.1},{"$f":"'T10 Details'!E2413","v":0}]
[null,{"$f":"IF('T10 Details'!D2417=\"\",IF('T10 Details'!E2415=\"\",\"\",'T10 Details'!E2415&\" (\"&'T10 Details'!E2420&\")\"),'T10 Details'!D2417&\" (\"&'T10 Details'!E2420&\")\")","v":""},null,null,null,{"$f":"'T10 Details'!E2437","v":0},{"$f":"'T10 Details'!E2438*0.00144","v":0},{"$f":"'T10 Details'!E2441","v":0.1},{"$f":"'T10 Details'!E2444","v":0}]
[null,{"$f":"IF('T10 Details'!D2448=\"\",IF('T10 Details'!E2446=\"\",\"\",'T10 Details'!E2446&\" (\"&'T10 Details'!E2451&\")\"),'T10 Details'!D2448&\" (\"&'T10 Details'!E2451&\")\")","v":""},null,null,null,{"$f":"'T10 Details'!E2468","v":0},{"$f":"'T10 Details'!E2469*0.00144","v":0},{"$f":"'T10 Details'!E2472","v":0.1},{"$f":"'T10 Details'!E2475","v":0}]
[null,{"$f":"IF('T10 Details'!D2479=\"\",IF('T10 Details'!E2477=\"\",\"\",'T10 Details'!E2477&\" (\"&'T10 Details'!E2482&\")\"),'T10 Details'!D2479&\" (\"&'T10 Details'!E2482&\")\")","v":""},null,null,null,{"$f":"'T10 Details'!E2499","v":0},{"$f":"'T10 Details'!E2500*0.00144","v":0},{"$f":"'T10 Details'!E2503","v":0.1},{"$f":"'T10 Details'!E2506","v":0}]
[null,{"$f":"IF('T10 Details'!D2510=\"\",IF('T10 Details'!E2508=\"\",\"\",'T10 Details'!E2508&\" (\"&'T10 Details'!E2513&\")\"),'T10 Details'!D2510&\" (\"&'T10 Details'!E2513&\")\")","v":""},null,null,null,{"$f":"'T10 Details'!E2530","v":0},{"$f":"'T10 Details'!E2531*0.00144","v":0},{"$f":"'T10 Details'!E2534","v":0.1},{"$f":"'T10 Details'!E2537","v":0}]
[{"$f":"CONCATENATE(\"D\",Calculator!$BL$6)","v":"D9"},{"$f":"IF('T10 Details'!D2547=\"\",IF('T10 Details'!E2545=\"\",\"\",'T10 Details'!E2545&\" (\"&'T10 Details'!E2550&\")\"),'T10 Details'!D2547&\" (\"&'T10 Details'!E2550&\")\")","v":""},null,null,null,{"$f":"'T10 Details'!E2567","v":0},{"$f":"'T10 Details'!E2568*0.00144","v":0},{"$f":"'T10 Details'!E2571","v":0.1},{"$f":"'T10 Details'!E2574","v":0},{"$f":"'T10 Details'!E2857","v":0}]
[null,{"$f":"IF('T10 Details'!D2578=\"\",IF('T10 Details'!E2576=\"\",\"\",'T10 Details'!E2576&\" (\"&'T10 Details'!E2581&\")\"),'T10 Details'!D2578&\" (\"&'T10 Details'!E2581&\")\")","v":""},null,null,null,{"$f":"'T10 Details'!E2598","v":0},{"$f":"'T10 Details'!E2599*0.00144","v":0},{"$f":"'T10 Details'!E2602","v":0.1},{"$f":"'T10 Details'!E2605","v":0}]
[null,{"$f":"IF('T10 Details'!D2609=\"\",IF('T10 Details'!E2607=\"\",\"\",'T10 Details'!E2607&\" (\"&'T10 Details'!E2612&\")\"),'T10 Details'!D2609&\" (\"&'T10 Details'!E2612&\")\")","v":""},null,null,null,{"$f":"'T10 Details'!E2629","v":0},{"$f":"'T10 Details'!E2630*0.00144","v":0},{"$f":"'T10 Details'!E2633","v":0.1},{"$f":"'T10 Details'!E2636","v":0}]
[null,{"$f":"IF('T10 Details'!D2640=\"\",IF('T10 Details'!E2638=\"\",\"\",'T10 Details'!E2638&\" (\"&'T10 Details'!E2643&\")\"),'T10 Details'!D2640&\" (\"&'T10 Details'!E2643&\")\")","v":""},null,null,null,{"$f":"'T10 Details'!E2660","v":0},{"$f":"'T10 Details'!E2661*0.00144","v":0},{"$f":"'T10 Details'!E2664","v":0.1},{"$f":"'T10 Details'!E2667","v":0}]
[null,{"$f":"IF('T10 Details'!D2671=\"\",IF('T10 Details'!E2669=\"\",\"\",'T10 Details'!E2669&\" (\"&'T10 Details'!E2674&\")\"),'T10 Details'!D2671&\" (\"&'T10 Details'!E2674&\")\")","v":""},null,null,null,{"$f":"'T10 Details'!E2691","v":0},{"$f":"'T10 Details'!E2692*0.00144","v":0},{"$f":"'T10 Details'!E2695","v":0.1},{"$f":"'T10 Details'!E2698","v":0}]
[null,{"$f":"IF('T10 Details'!D2702=\"\",IF('T10 Details'!E2700=\"\",\"\",'T10 Details'!E2700&\" (\"&'T10 Details'!E2705&\")\"),'T10 Details'!D2702&\" (\"&'T10 Details'!E2705&\")\")","v":""},null,null,null,{"$f":"'T10 Details'!E2922","v":0},{"$f":"'T10 Details'!E2923*0.00144","v":0},{"$f":"'T10 Details'!E2726","v":0.1},{"$f":"'T10 Details'!E2729","v":0}]
[null,{"$f":"IF('T10 Details'!D2733=\"\",IF('T10 Details'!E2731=\"\",\"\",'T10 Details'!E2731&\" (\"&'T10 Details'!E2736&\")\"),'T10 Details'!D2733&\" (\"&'T10 Details'!E2736&\")\")","v":""},null,null,null,{"$f":"'T10 Details'!E2753","v":0},{"$f":"'T10 Details'!E2754*0.00144","v":0},{"$f":"'T10 Details'!E2757","v":0.1},{"$f":"'T10 Details'!E2760","v":0}]
[null,{"$f":"IF('T10 Details'!D2764=\"\",IF('T10 Details'!E2762=\"\",\"\",'T10 Details'!E2762&\" (\"&'T10 Details'!E2767&\")\"),'T10 Details'!D2764&\" (\"&'T10 Details'!E2767&\")\")","v":""},null,null,null,{"$f":"'T10 Details'!E2784","v":0},{"$f":"'T10 Details'!E2785*0.00144","v":0},{"$f":"'T10 Details'!E2788","v":0.1},{"$f":"'T10 Details'!E2791","v":0}]
[null,{"$f":"IF('T10 Details'!D2795=\"\",IF('T10 Details'!E2793=\"\",\"\",'T10 Details'!E2793&\" (\"&'T10 Details'!E2798&\")\"),'T10 Details'!D2795&\" (\"&'T10 Details'!E2798&\")\")","v":""},null,null,null,{"$f":"'T10 Details'!E2815","v":0},{"$f":"'T10 Details'!E2816*0.00144","v":0},{"$f":"'T10 Details'!E2819","v":0.1},{"$f":"'T10 Details'!E2822","v":0}]
[null,{"$f":"IF('T10 Details'!D2826=\"\",IF('T10 Details'!E2824=\"\",\"\",'T10 Details'!E2824&\" (\"&'T10 Details'!E2829&\")\"),'T10 Details'!D2826&\" (\"&'T10 Details'!E2829&\")\")","v":""},null,null,null,{"$f":"'T10 Details'!E2846","v":0},{"$f":"'T10 Details'!E2847*0.00144","v":0},{"$f":"'T10 Details'!E2850","v":0.1},{"$f":"'T10 Details'!E2853","v":0}]
[{"$f":"CONCATENATE(\"D\",Calculator!$BM$6)","v":"D10"},{"$f":"IF('T10 Details'!D2863=\"\",IF('T10 Details'!E2861=\"\",\"\",'T10 Details'!E2861&\" (\"&'T10 Details'!E2866&\")\"),'T10 Details'!D2863&\" (\"&'T10 Details'!E2866&\")\")","v":""},null,null,null,{"$f":"'T10 Details'!E2883","v":0},{"$f":"'T10 Details'!E2884*0.00144","v":0},{"$f":"'T10 Details'!E2887","v":0.1},{"$f":"'T10 Details'!E2890","v":0},{"$f":"'T10 Details'!E3173","v":0}]
[null,{"$f":"IF('T10 Details'!D2894=\"\",IF('T10 Details'!E2892=\"\",\"\",'T10 Details'!E2892&\" (\"&'T10 Details'!E2897&\")\"),'T10 Details'!D2894&\" (\"&'T10 Details'!E2897&\")\")","v":""},null,null,null,{"$f":"'T10 Details'!E2914","v":0},{"$f":"'T10 Details'!E2915*0.00144","v":0},{"$f":"'T10 Details'!E2918","v":0.1},{"$f":"'T10 Details'!E2921","v":0}]
[null,{"$f":"IF('T10 Details'!D2925=\"\",IF('T10 Details'!E2923=\"\",\"\",'T10 Details'!E2923&\" (\"&'T10 Details'!E2928&\")\"),'T10 Details'!D2925&\" (\"&'T10 Details'!E2928&\")\")","v":""},null,null,null,{"$f":"'T10 Details'!E2945","v":0},{"$f":"'T10 Details'!E2946*0.00144","v":0},{"$f":"'T10 Details'!E2949","v":0.1},{"$f":"'T10 Details'!E2952","v":0}]
[null,{"$f":"IF('T10 Details'!D2956=\"\",IF('T10 Details'!E2954=\"\",\"\",'T10 Details'!E2954&\" (\"&'T10 Details'!E2959&\")\"),'T10 Details'!D2956&\" (\"&'T10 Details'!E2959&\")\")","v":""},null,null,null,{"$f":"'T10 Details'!E2976","v":0},{"$f":"'T10 Details'!E2977*0.00144","v":0},{"$f":"'T10 Details'!E2980","v":0.1},{"$f":"'T10 Details'!E2983","v":0}]
[null,{"$f":"IF('T10 Details'!D2984=\"\",IF('T10 Details'!E2985=\"\",\"\",'T10 Details'!E2985&\" (\"&'T10 Details'!E2990&\")\"),'T10 Details'!D2987&\" (\"&'T10 Details'!E2990&\")\")","v":""},null,null,null,{"$f":"'T10 Details'!E3007","v":0},{"$f":"'T10 Details'!E3008*0.00144","v":0},{"$f":"'T10 Details'!E3011","v":0.1},{"$f":"'T10 Details'!E3014","v":0}]
[null,{"$f":"IF('T10 Details'!D3018=\"\",IF('T10 Details'!E3016=\"\",\"\",'T10 Details'!E3016&\" (\"&'T10 Details'!E3021&\")\"),'T10 Details'!D3018&\" (\"&'T10 Details'!E3021&\")\")","v":""},null,null,null,{"$f":"'T10 Details'!E3038","v":0},{"$f":"'T10 Details'!E3039*0.00144","v":0},{"$f":"'T10 Details'!E3042","v":0.1},{"$f":"'T10 Details'!E3045","v":0}]
[null,{"$f":"IF('T10 Details'!D3049=\"\",IF('T10 Details'!E3047=\"\",\"\",'T10 Details'!E3047&\" (\"&'T10 Details'!E3052&\")\"),'T10 Details'!D3049&\" (\"&'T10 Details'!E3052&\")\")","v":""},null,null,null,{"$f":"'T10 Details'!E3069","v":0},{"$f":"'T10 Details'!E3070*0.00144","v":0},{"$f":"'T10 Details'!E3073","v":0.1},{"$f":"'T10 Details'!E3076","v":0}]
[null,{"$f":"IF('T10 Details'!D3080=\"\",IF('T10 Details'!E3078=\"\",\"\",'T10 Details'!E3078&\" (\"&'T10 Details'!E3083&\")\"),'T10 Details'!D3080&\" (\"&'T10 Details'!E3083&\")\")","v":""},null,null,null,{"$f":"'T10 Details'!E3100","v":0},{"$f":"'T10 Details'!E3101*0.00144","v":0},{"$f":"'T10 Details'!E3104","v":0.1},{"$f":"'T10 Details'!E3107","v":0}]
[null,{"$f":"IF('T10 Details'!D3111=\"\",IF('T10 Details'!E3109=\"\",\"\",'T10 Details'!E3109&\" (\"&'T10 Details'!E3114&\")\"),'T10 Details'!D3111&\" (\"&'T10 Details'!E3114&\")\")","v":""},null,null,null,{"$f":"'T10 Details'!E3131","v":0},{"$f":"'T10 Details'!E3132*0.00144","v":0},{"$f":"'T10 Details'!E3135","v":0.1},{"$f":"'T10 Details'!E3138","v":0}]
[null,{"$f":"IF('T10 Details'!D3142=\"\",IF('T10 Details'!E3140=\"\",\"\",'T10 Details'!E3140&\" (\"&'T10 Details'!E3145&\")\"),'T10 Details'!D3142&\" (\"&'T10 Details'!E3145&\")\")","v":""},null,null,null,{"$f":"'T10 Details'!E3162","v":0},{"$f":"'T10 Details'!E3163*0.00144","v":0},{"$f":"'T10 Details'!E3166","v":0.1},{"$f":"'T10 Details'!E3169","v":0}]
["* These values are calculated on the T10 Details Sheet"]
[]
[{"$f":"Description!A54","v":"TCEQ - (05-01-13)"},null,null,null,null,null,null,null,null,"CT STUDY"]

{"sheet":"Calculator","index":4,"n_rows":54,"n_cols":99,"rows_kept":54,"cut":false,"hidden":false,"merged":[[51,4,51,8],[51,11,51,12],[33,1,34,8],[33,9,34,14],[44,1,44,2],[43,1,43,2],[36,12,36,14],[36,9,36,11],[41,1,42,11],[41,12,42,14],[35,1,36,3],[35,4,35,8],[35,9,35,14],[37,9,38,11],[37,12,38,14],[32,6,32,10],[29,11,29,12],[6,4,6,8],[6,11,6,14],[8,4,8,8],[11,1,12,8],[11,9,12,14],[10,6,10,10],[8,11,8,14],[29,4,29,8],[19,1,20,11],[22,1,22,2],[13,1,14,3],[13,4,13,8],[21,1,21,2],[0,1,0,14],[1,1,1,14],[2,1,2,14],[3,1,3,14],[11,65,12,66],[11,67,12,69],[13,84,14,87],[13,88,14,91],[13,92,14,94],[13,95,14,96],[13,97,14,98],[15,9,16,11],[15,12,16,14],[14,12,14,14],[19,12,20,14],[13,9,13,14],[14,9,14,11]]}
[null,"CT STUDY"]
[null,"FOR PUBLIC WATER SYSTEMS THAT ARE USING SURFACE WATER SOURCES",null,null,null,null,null,null,null,null,null,null,null,null,null,null,null,null,null,null,null,null,null,null,null,null,null,null,null,null,null,null,null,null,null,null,null,null,null,null,null,null,null,null,null,null,null,null,null,null,null,null,null,null,null,null,null,"NUMBER OF TREATMENT TRAINS"]
[null,"OR GROUND WATER SOURCES UNDER THE INFLUENCE OF SURFACE WATER (cont.)",null,null,null,null,null,null,null,null,null,null,null,null,null,null,null,null,null,null,null,null,null,null,null,null,null,null,null,null,null,null,null,null,null,null,null,null,null,null,null,null,null,null,null,null,null,null,null,null,null,null,null,null,null,"D1","D2","D3","D4","D5","D6","D7","D8","D9","D10","TOTAL"]
[null,"CT Calculator Worksheet",null,null,null,null,null,null,null,null,null,null,null,null,null,null,null,null,null,null,null,null,null,null,null,null,null,null,null,null,null,null,null,null,null,null,null,null,null,null,null,null,null,null,null,null,null,null,null,"DISINFECTION ZONES",null,3,null,null,null,1,1,1,null,null,null,null,null,null,null,{"$f":"IF(AZ4=\"\",\"missing\",SUM(BD4:BM4))","v":3}]
[]
[null,"PUBLIC WATER",null,null,null,null,null,null,null,"PLANT NAME",null,null,null,null,null,null,null,null,null,null,null,null,null,null,null,null,null,null,null,null,null,null,null,null,null,null,null,null,null,null,null,null,null,null,null,null,null,null,null,null,null,null,null,null,"Disinfection Zone Labels",{"$f":"IF(AZ4=\"missing\",VALUE(RIGHT(BD3,LEN(BD3)-1)),IF(BD4=1,1,\"1A\"))","v":1},{"$f":"IF(AZ4=\"missing\",VALUE(RIGHT(BE3,LEN(BE3)-1)),IF(ISNUMBER(BD6),IF(OFFSET(BD4,0,BD6,1,1)>1,BD6+1&\"A\",BD6+1),IF(SUM(OFFSET(BD4,0,0,1,LEFT(BD6,LEN(BD6)-1)))>=VALUE(RIGHT(BE3,LEN(BE3)-1)),LEFT(BD6,LEN(BD6)-1)&CHAR(CODE(RIGHT(BD6,1))+1),IF(OFFSET(BD4,0,LEFT(BD6,LEN(BD6)-1),1,1)>1,LEFT(BD6,LEN(BD6)-1)+1&\"A\",LEFT(BD6,LEN(BD6)-1)+1))))","v":2},{"$f":"IF(AZ4=\"missing\",VALUE(RIGHT(BF3,LEN(BF3)-1)),IF(ISNUMBER(BE6),IF(OFFSET(BD4,0,BE6,1,1)>1,BE6+1&\"A\",BE6+1),IF(SUM(OFFSET(BD4,0,0,1,LEFT(BE6,LEN(BE6)-1)))>=VALUE(RIGHT(BF3,LEN(BF3)-1)),LEFT(BE6,LEN(BE6)-1)&CHAR(CODE(RIGHT(BE6,1))+1),IF(OFFSET(BD4,0,LEFT(BE6,LEN(BE6)-1),1,1)>1,LEFT(BE6,LEN(BE6)-1)+1&\"A\",LEFT(BE6,LEN(BE6)-1)+1))))","v":3},{"$f":"IF(AZ4=\"missing\",VALUE(RIGHT(BG3,LEN(BG3)-1)),IF(ISNUMBER(BF6),IF(OFFSET(BD4,0,BF6,1,1)>1,BF6+1&\"A\",BF6+1),IF(SUM(OFFSET(BD4,0,0,1,LEFT(BF6,LEN(BF6)-1)))>=VALUE(RIGHT(BG3,LEN(BG3)-1)),LEFT(BF6,LEN(BF6)-1)&CHAR(CODE(RIGHT(BF6,1))+1),IF(OFFSET(BD4,0,LEFT(BF6,LEN(BF6)-1),1,1)>1,LEFT(BF6,LEN(BF6)-1)+1&\"A\",LEFT(BF6,LEN(BF6)-1)+1))))","v":4},{"$f":"IF(AZ4=\"missing\",VALUE(RIGHT(BH3,LEN(BH3)-1)),IF(ISNUMBER(BG6),IF(OFFSET(BD4,0,BG6,1,1)>1,BG6+1&\"A\",BG6+1),IF(SUM(OFFSET(BD4,0,0,1,LEFT(BG6,LEN(BG6)-1)))>=VALUE(RIGHT(BH3,LEN(BH3)-1)),LEFT(BG6,LEN(BG6)-1)&CHAR(CODE(RIGHT(BG6,1))+1),IF(OFFSET(BD4,0,LEFT(BG6,LEN(BG6)-1),1,1)>1,LEFT(BG6,LEN(BG6)-1)+1&\"A\",LEFT(BG6,LEN(BG6)-1)+1))))","v":5},{"$f":"IF(AZ4=\"missing\",VALUE(RIGHT(BI3,LEN(BI3)-1)),IF(ISNUMBER(BH6),IF(OFFSET(BD4,0,BH6,1,1)>1,BH6+1&\"A\",BH6+1),IF(SUM(OFFSET(BD4,0,0,1,LEFT(BH6,LEN(BH6)-1)))>=VALUE(RIGHT(BI3,LEN(BI3)-1)),LEFT(BH6,LEN(BH6)-1)&CHAR(CODE(RIGHT(BH6,1))+1),IF(OFFSET(BD4,0,LEFT(BH6,LEN(BH6)-1),1,1)>1,LEFT(BH6,LEN(BH6)-1)+1&\"A\",LEFT(BH6,LEN(BH6)-1)+1))))","v":6},{"$f":"IF(AZ4=\"missing\",VALUE(RIGHT(BJ3,LEN(BJ3)-1)),IF(ISNUMBER(BI6),IF(OFFSET(BD4,0,BI6,1,1)>1,BI6+1&\"A\",BI6+1),IF(SUM(OFFSET(BD4,0,0,1,LEFT(BI6,LEN(BI6)-1)))>=VALUE(RIGHT(BJ3,LEN(BJ3)-1)),LEFT(BI6,LEN(BI6)-1)&CHAR(CODE(RIGHT(BI6,1))+1),IF(OFFSET(BD4,0,LEFT(BI6,LEN(BI6)-1),1,1)>1,LEFT(BI6,LEN(BI6)-1)+1&\"A\",LEFT(BI6,LEN(BI6)-1)+1))))","v":7},{"$f":"IF(AZ4=\"missing\",VALUE(RIGHT(BK3,LEN(BK3)-1)),IF(ISNUMBER(BJ6),IF(OFFSET(BD4,0,BJ6,1,1)>1,BJ6+1&\"A\",BJ6+1),IF(SUM(OFFSET(BD4,0,0,1,LEFT(BJ6,LEN(BJ6)-1)))>=VALUE(RIGHT(BK3,LEN(BK3)-1)),LEFT(BJ6,LEN(BJ6)-1)&CHAR(CODE(RIGHT(BJ6,1))+1),IF(OFFSET(BD4,0,LEFT(BJ6,LEN(BJ6)-1),1,1)>1,LEFT(BJ6,LEN(BJ6)-1)+1&\"A\",LEFT(BJ6,LEN(BJ6)-1)+1))))","v":8},{"$f":"IF(AZ4=\"missing\",VALUE(RIGHT(BL3,LEN(BL3)-1)),IF(ISNUMBER(BK6),IF(OFFSET(BD4,0,BK6,1,1)>1,BK6+1&\"A\",BK6+1),IF(SUM(OFFSET(BD4,0,0,1,LEFT(BK6,LEN(BK6)-1)))>=VALUE(RIGHT(BL3,LEN(BL3)-1)),LEFT(BK6,LEN(BK6)-1)&CHAR(CODE(RIGHT(BK6,1))+1),IF(OFFSET(BD4,0,LEFT(BK6,LEN(BK6)-1),1,1)>1,LEFT(BK6,LEN(BK6)-1)+1&\"A\",LEFT(BK6,LEN(BK6)-1)+1))))","v":9},{"$f":"IF(AZ4=\"missing\",VALUE(RIGHT(BM3,LEN(BM3)-1)),IF(ISNUMBER(BL6),IF(OFFSET(BD4,0,BL6,1,1)>1,BL6+1&\"A\",BL6+1),IF(SUM(OFFSET(BD4,0,0,1,LEFT(BL6,LEN(BL6)-1)))>=VALUE(RIGHT(BM3,LEN(BM3)-1)),LEFT(BL6,LEN(BL6)-1)&CHAR(CODE(RIGHT(BL6,1))+1),IF(OFFSET(BD4,0,LEFT(BL6,LEN(BL6)-1),1,1)>1,LEFT(BL6,LEN(BL6)-1)+1&\"A\",LEFT(BL6,LEN(BL6)-1)+1))))","v":10}]
[null,"SYSTEM NAME:",null,null,{"$f":"IF(Description!B7=\"\",\"\",Description!B7)","v":""},null,null,null,null,"OR NUMBER:",null,{"$f":"IF(Description!B10=\"\",\"\",Description!B10)","v":""}]
[]
[null,"PWS ID No.:",null,null,{"$f":"IF(Description!H7=\"\",\"\",Description!H7)","v":""},null,null,null,null,"Date:",null,{"$f":"IF(OR(Description!H7=\"\",Description!H10=\"\",Description!H11=\"\"),\"\",Description!H9&\" \"&Description!H10&\", \"&Description!H11)","v":""},null,null,null,null,null,null,null,null,null,null,null,null,null,null,null,null,null,null,null,null,null,null,null,null,null,null,null,null,null,null,null,null,null,null,null,null,null,null,null,null,null,null,null,"BLANK FORM"]
[]
[null,null,null,null,null,null,"DISINFECTION PROCESS PARAMETERS",null,null,null,null,null,null,null,null,null,null,null,null,null,null,null,null,null,null,null,null,null,null,null,null,null,null,null,null,null,null,null,null,null,null,null,null,null,null,null,null,null,null,null,null,null,null,null,null,{"$f":"IF($AZ$4=\"missing\",VALUE(RIGHT(BD3,LEN(BD3)-1)),IF(BD4=1,1,\"1A\"))","v":1},{"$f":"IF($AZ$4=\"missing\",VALUE(RIGHT(BE3,LEN(BE3)-1)),IF(ISNUMBER(BD11),IF(OFFSET($BD$4,0,BD11,1,1)>1,BD11+1&\"A\",BD11+1),IF(SUM(OFFSET($BD$4,0,0,1,LEFT(BD11,LEN(BD11)-1)))>=VALUE(RIGHT(BE3,LEN(BE3)-1)),LEFT(BD11,LEN(BD11)-1)&CHAR(CODE(RIGHT(BD11,1))+1),IF(OFFSET($BD$4,0,LEFT(BD11,LEN(BD11)-1),1,1)>1,LEFT(BD11,LEN(BD11)-1)+1&\"A\",LEFT(BD11,LEN(BD11)-1)+1))))","v":2},3,4,5,6,7,8,9,10,"GIARDIA LOG",null,"VIRUS LOG"]
[null,"APPROVED CT STUDY PARAMETERS",null,null,null,null,null,null,null,"PERFORMANCE STANDARDS",null,null,null,null,null,null,null,null,null,null,null,null,null,null,null,null,null,null,null,null,null,null,null,null,null,null,null,null,null,null,null,null,null,null,null,null,null,null,null,"FLOW RATE",null,null,null,null,null,{"$f":"IF(IF(ISNUMBER(BD$11),BD$11,VALUE(LEFT(BD$11,LEN(BD$11)-1)))<=IF($AZ$4=\"missing\",10,$AZ$4),IF(E16=\"\",\"missing\",IF(IF(COUNTIF($AY$24:$AY$28,0)+COUNTIF($AY$24:$AY$28,\"\")=5,E16=\"na\",AND(ISNUMBER(E16),E16>0)),E16,\"!error\")),\"\")","v":"missing"},"missing","missing","","",{"$f":"IF(IF(ISNUMBER(BI$11),BI$11,VALUE(LEFT(BI$11,LEN(BI$11)-1)))<=IF($AZ$4=\"missing\",10,$AZ$4),IF(E38=\"\",\"missing\",IF(IF(COUNTIF($AY$24:$AY$28,0)+COUNTIF($AY$24:$AY$28,\"\")=5,E38=\"na\",AND(ISNUMBER(E38),E38>0)),E38,\"!error\")),\"\")","v":""},"","","","",{"$f":"IF(ISBLANK(J16),\"missing\",IF(IF(COUNTIF($AY$24:$AY$28,0)+COUNTIF($AY$24:$AY$28,\"\")=5,J16=\"na\",AND(ISNUMBER(J16),J16>=0,J16<=10)),J16,\"!error\"))","v":0.5},null,{"$f":"IF(ISBLANK(M16),\"missing\",IF(IF(COUNTIF($AY$24:$AY$28,0)+COUNTIF($AY$24:$AY$28,\"\")=5,M16=\"na\",AND(ISNUMBER(M16),M16>=0,M16<=10)),M16,\"!error\"))","v":2}]
[null,null,null,null,null,null,null,null,null,null,null,null,null,null,null,null,null,null,null,null,null,null,null,null,null,null,null,null,null,null,null,null,null,null,null,null,null,null,null,null,null,null,null,null,null,null,null,null,null,"T10",null,null,null,null,null,"missing","missing","missing","","","","","","","",null,null,null,null,null,null,null,null,null,null,null,null,null,null,null,null,null,null,null,"DISINFECTION DATA STATISTICS"]
[null,"Parameters",null,null,"Disinfection Zones",null,null,null,null,"Log Inactivations",null,null,null,null,null,null,null,null,null,null,null,null,null,null,null,null,null,null,null,null,null,null,null,null,null,null,null,null,null,null,null,null,null,null,null,null,null,null,null,"NUMBER OF TREATMENT TRAINS IN ALL PRECEDING ZONES",null,null,null,null,null,{"$f":"IF($AZ$4=\"missing\",BD11-1,IF(OR(BD11=1,COUNTIF(BD11,\"=1?\")),0,SUM(OFFSET($BD$4,0,0,1,IF(ISNUMBER(BD11),BD11,VALUE(LEFT(BD11,LEN(BD11)-1)))-1))))","v":0},1,2,3,3,3,3,3,3,3,null,null,null,null,null,null,null,null,null,null,null,null,null,null,null,null,null,null,null,null,null,null,null,"MAXIMUM",null,null,null,"MINIMUM",null,null,"AVERAGE",null,"STANDARD DEVIATION"]
[null,null,null,null,{"$f":"BD11","v":1},{"$f":"BE11","v":2},3,4,5,"Giardia lamblia Cysts",null,null,"Viruses",null,null,null,null,null,null,null,null,null,null,null,null,null,null,null,null,null,null,null,null,null,null,null,null,null,null,null,null,null,null,null,null,null,null,null,null,"NUMBER OF TREATMENT TRAINS",null,null,null,null,null,{"$f":"IF($AZ$4=\"missing\",1,OFFSET($BD$4,0,IF(ISNUMBER(BD11),BD11,LEFT(BD11,LEN(BD11)-1))-1,1,1))","v":1},1,1,0,0,0,0,0,0,0]
[null,"   Flow Rate (MGD)",null,null,{"$f":"IF('T10 Details'!$E$327=0,\"\",'T10 Details'!$E$327)","v":""},{"$f":"IF('T10 Details'!$E$643=0,\"\",'T10 Details'!$E$643)","v":""},{"$f":"IF('T10 Details'!$E$959=0,\"\",'T10 Details'!$E$959)","v":""},{"$f":"IF('T10 Details'!$E$1275=0,\"\",'T10 Details'!$E$1275)","v":""},{"$f":"IF('T10 Details'!$E$1591=0,\"\",'T10 Details'!$E$1591)","v":""},0.5,null,null,2,null,null,null,null,null,null,null,null,null,null,null,null,null,null,null,null,null,null,null,null,null,null,null,null,null,null,null,null,null,null,null,null,null,null,null,null,null,null,null,null,null,null,null,null,null,null,null,null,null,null,null,null,null,null,null,null,null,null,null,null,null,null,null,null,null,null,null,null,null,null,null," GIARDIA LOG",null,null,null,{"$f":"IF(COUNTIF(CG24:CG28,\"!error\")>0,\"!error\",IF(OR(COUNT(CG24:CG28)=0,COUNT(CG24:CG28)=COUNTIF(CH24:CH28,\"~*\")),\"NA \",DMAX(CG23:CH28,CG23,CM29:CM30)))","v":"NA "},null,null,null,{"$f":"IF(COUNTIF(CG24:CG28,\"!error\")>0,\"!error\",IF(OR(COUNT(CG24:CG28)=0,COUNT(CG24:CG28)=COUNTIF(CH24:CH28,\"~*\")),\"NA \",DMIN(CG23:CH28,CG23,CM29:CM30)))","v":"NA "},null,null,{"$f":"IF(COUNTIF(CG24:CG28,\"!error\")>0,\"!error\",IF(OR(COUNT(CG24:CG28)=0,COUNT(CG24:CG28)=COUNTIF(CH24:CH28,\"~*\")),\"NA \",DAVERAGE(CG23:CH28,CG23,CM29:CM30)))","v":"NA "},null,{"$f":"IF(COUNTIF(CG24:CG28,\"!error\")>0,\"!error\",IF(OR(COUNT(CG24:CG28)=0,COUNT(CG24:CG28)=COUNTIF(CH24:CH28,\"~*\")),\"NA \",DSTDEVP(CG23:CH28,CG23,CM29:CM30)))","v":"NA "}]
[null,"   T10 (minutes)",null,null,{"$f":"IF('T10 Details'!$E$329=0,\"\",'T10 Details'!$E$329)","v":""},{"$f":"IF('T10 Details'!$E$645=0,\"\",'T10 Details'!$E$645)","v":""},{"$f":"IF('T10 Details'!$E$961=0,\"\",'T10 Details'!$E$961)","v":""},{"$f":"IF('T10 Details'!$E$1277=0,\"\",'T10 Details'!$E$1277)","v":""},{"$f":"IF('T10 Details'!$E$1593=0,\"\",'T10 Details'!$E$1593)","v":""},null,null,null,null,null,null,null,null,null,null,null,null,null,null,null,null,null,null,null,null,null,null,null,null,null,null,null,null,null,null,null,null,null,null,null,null,null,null,null,null,"DROP-DOWN LIST",null,null,null,null,null,null,null,null,null,null,null,null,null,null,null,null,null,null,null,null,null,null,null,null,null,null,null,null,null,null,null,null,null,null," VIRUS LOG",null,null,null,{"$f":"IF(COUNTIF(CK24:CK28,\"!error\")>0,\"!error\",IF(OR(COUNT(CK24:CK28)=0,COUNT(CK24:CK28)=COUNTIF(CL24:CL28,\"~*\")),\"NA \",DMAX(CK23:CL28,CK23,CQ29:CQ30)))","v":"NA "},null,null,null,{"$f":"IF(COUNTIF(CK24:CK28,\"!error\")>0,\"!error\",IF(OR(COUNT(CK24:CK28)=0,COUNT(CK24:CK28)=COUNTIF(CL24:CL28,\"~*\")),\"NA \",DMIN(CK23:CL28,CK23,CQ29:CQ30)))","v":"NA "},null,null,{"$f":"IF(COUNTIF(CK24:CK28,\"!error\")>0,\"!error\",IF(OR(COUNT(CK24:CK28)=0,COUNT(CK24:CK28)=COUNTIF(CL24:CL28,\"~*\")),\"NA \",DAVERAGE(CK23:CL28,CK23,CQ29:CQ30)))","v":"NA "},null,{"$f":"IF(COUNTIF(CK24:CK28,\"!error\")>0,\"!error\",IF(OR(COUNT(CK24:CK28)=0,COUNT(CK24:CK28)=COUNTIF(CL24:CL28,\"~*\")),\"NA \",DSTDEVP(CK23:CL28,CK23,CQ29:CQ30)))","v":"NA "}]
[null,null,null,null,null,null,null,null,null,null,null,null,null,null,null,null,null,null,null,null,null,null,null,null,null,null,null,null,null,null,null,null,null,null,null,null,null,null,null,null,null,null,null,null,null,null,null,null,null,"DISINFECTANT",null,null,null,null," ","FCL","CLO2","CLA","O3","O3 Cell 1","NA"]
[null,null,null,null,null,null,null,null,"DISINFECTION PROCESS DATA",null,null,null,null,null,null,null,null,null,null,null,null,null,null,null,null,null,null,null,null,null,null,null,null,null,null,null,null,null,null,null,null,null,null,null,null,null,null,null,null,"DISINFECTANT LIST 5B",null,null,null,null," ","FCL","CLO2","CLA","O3","NA"]
[null,"INDIVIDUAL DISINFECTION ZONES",null,null,null,null,null,null,null,null,null,null,"PLANT TOTAL"]
[null,null,null,null,null,null,null,null,null,null,null,null,null,null,null,null,null,null,null,null,null,null,null,null,null,null,null,null,null,null,null,null,null,null,null,null,null,null,null,null,null,null,null,null,null,null,null,null,null,"PUMPAGE",null,null,null,null,{"$f":"\"DISINFECTION ZONES  ( D\"&$BD$11&\" - D\"&$BH$11&\" )\"","v":"DISINFECTION ZONES  ( D1 - D5 )"},null,null,null,null,null,null,null,null,null,null,null,null,null,null,null,null,null,{"$f":"\"DISINFECTION ZONES  ( D\"&$BI$11&\" - D\"&$BM$11&\" )\"","v":"DISINFECTION ZONES  ( D6 - D10 )"},null,null,null,null,null,null,null,null,null,null,null,null,null,null,null,"DAILY DISINFECTION DATA SUMMARY"]
[null,null,null,"C","Flow","Temp",null,null,"Giardia","Virus","Giardia","Virus","Giardia","Virus","Inact.",null,null,null,null,null,null,null,null,null,null,null,null,null,null,null,null,null,null,null,null,null,null,null,null,null,null,null,null,null,null,null,null,null,null,null,"RAW",null,null,null,null,null,null,null,null,null,null,null,null,"GIARDIA","GIARDIA","GIARDIA","VIRUS","VIRUS","VIRUS",null,null,null,null,null,null,null,null,null,null,null,null,"GIARDIA","GIARDIA","GIARDIA","VIRUS","VIRUS","VIRUS",null,"GIARDIA",null,"GIARDIA",null,"VIRUS",null,"VIRUS",null,"MINIMUM"]
[null,"Disinfectant",null,"(mg/L)","(MGD)","(oC)","pH","CTCALC","CTREQD","CTREQD","Log","Log","Log","Log","Ratio",null,null,null,"Disinfectant",null,null,null,null,null,null,null,null,null,null,null,null,null,null,null,null,null,null,null,null,null,null,null,null,null,null,null,null,null,null,"DATE","WATER",null,null,"AT LEAST ONE PRECEDING ZONE <> \"NA\"","DISINFECTANT",null,null,"C","FLOW","T10","TEMP","pH","CTACTUAL","CTREQD","INACT. RATIO","LOG","CTREQD","INACT. RATIO","LOG",null,null,null,"DISINFECTANT",null,null,"C","FLOW","T10","TEMP","pH","CTACTUAL","CTREQD","INACT. RATIO","LOG","CTREQD","INACT. RATIO","LOG",null,"LOG",null,"INACT. RATIO",null,"LOG",null,"INACT. RATIO",null,"INACT. RATIO"]
[{"$f":"S24","v":""},"",{"$f":"E15","v":1},null,null,null,null,{"$f":"IF(BL24=\"!error\",\"!error\",$BK24)","v":"missing"},{"$f":"$BL24","v":"missing"},{"$f":"$BO24","v":"missing"},{"$f":"$BN24","v":"missing"},{"$f":"$BQ24","v":"missing"},null,null,null,null,null,null,{"$f":"IF(B24=\"\",\"\",IF(B24=\"FCL\",1,IF(B24=\"CLO2\",2,IF(B24=\"O3\",3,IF(B24=\"CLA\",4,IF(B24=\"O3 cell 1\",99,0))))))","v":""},{"$f":"IF('T10 Details'!H15=\"\",\"\",IF('T10 Details'!H15=\"Free Chlorine\",\"FCL\",IF('T10 Details'!H15=\"Chlorine Dioxide\",\"CLO2\",IF('T10 Details'!H15=\"Ozone cell 1\",\"O3 cell 1\",IF('T10 Details'!H15=\"Ozone (any cell)\",\"O3\",IF('T10 Details'!H15=\"Chloramines\",\"CLA\"))))))","v":""},{"$f":"IF('T10 Details'!E15=\"\",\"\",IF('T10 Details'!E15=\"Free Chlorine\",\"FCL\",IF('T10 Details'!E15=\"Chlorine Dioxide\",\"CLO2\",IF('T10 Details'!E15=\"Ozone (Cell 1)\",\"O3 (Cell 1)\",IF('T10 Details'!E15=\"Ozone (Any Cell)\",\"O3\",IF('T10 Details'!E15=\"Chloramines\",\"CLA\"))))))","v":""},null,null,null,null,null,null,null,null,null,null,null,null,null,null,null,null,null,null,null,null,null,null,null,null,null,null,null,null,1,1,{"$f":"IF($BD$14=0,0,IF(COUNTIF(OFFSET($BD24,0,0,MIN($BD$14,5),1),\"<>NA\")+IF($BD$14>5,COUNTIF(OFFSET($BV24,0,0,$BD$14-5,1),\"<>NA\"),0),1,0))","v":0},{"$f":"IF($BD$14=0,0,IF(COUNTIF(OFFSET($BD24,0,0,MIN($BD$14,5),1),\"O3\")+COUNTIF(OFFSET($BD24,0,0,MIN($BD$14,5),1),\"O3 Cell 1\")+IF($BD$14>5,COUNTIF(OFFSET($BV24,0,0,$BD$14-5,1),\"O3\"),0)+IF($BD$14>5,COUNTIF(OFFSET($BV24,0,0,$BD$14-5,1),\"O3 Cell 1\"),0),1,0))","v":0},{"$f":"IF(OR($AY24=0,AND(COUNTA(D24,F24:G24)=0,COUNTIF(E24,0))),\"NA\",\n       IF(COUNTA(D24:G24),IF(BA24,4,\n                                                                     5),\n            IF($BD$15=1,IF(BA24,4,\n                                                        IF(AZ24,5,\n                                                                         6)),\n                    IF(BD24=\"!error\",IF(BA24,4,\n                                                                        5),\n                          IF(BA24,\"5B\",\n                                            6)))))","v":6},{"$f":"$BD$11","v":1},{"$f":"IF(AND(IF($BN$4=\"missing\",10,$BN$4)>=1,$AY24<>\"\"),IF(OR($AY24=0,AND($B24=\"NA\",COUNTA($D24,$F24:$G24)=0,COUNTIF($E24,0)),AND($B24=\"NA\",COUNTA($D24:$G24)=0,IF($BD$14=0,0,COUNTIF(OFFSET($BD24,0,0,MIN($BD$14,5),1),\"NA\")+IF($BD$14>5,COUNTIF(OFFSET($BV24,0,0,$BD$14-5,1),\"NA\"),0))=$BD$14),AND($B24=\"NA\",COUNTA($D24:$G24)=0,IF($BD$14<5,COUNTA(OFFSET($D24,$BD$14,0,MIN(5-$BD$14,$BD$15),4))-COUNTIF(OFFSET($E24,$BD$14,0,MIN(5-$BD$14,$BD$15),1),0),0)+IF($BD$14+$BD$15>5,COUNTA(OFFSET($D46,MAX($BD$14-5,0),0,MIN($BD$14+$BD$15-5,$BD$15),4))-COUNTIF(OFFSET($E46,MAX($BD$14-5,0),0,MIN($BD$14+$BD$15-5,$BD$15),1),0),0)),AND($B24=\"NA\",COUNTA($D24:$G24)=0,IF($BD$14<5,COUNTIF(OFFSET($B24,$BD$14,0,MIN(5-$BD$14,$BD$15),1),\"NA\"),0)+IF($BD$14+$BD$15>5,COUNTIF(OFFSET($B46,MAX($BD$14-5,0),0,MIN($BD$14+$BD$15-5,$BD$15),1),\"NA\"),0)<>$BD$15)),\"NA\",IF($B24=\"\",\"missing\",IF(AND($B24<>\"NA\",COUNTA($D24,$F24:$G24)+COUNTIF($E24,\"<>0\")),UPPER($B24),\"!error\"))),\"\")","v":"missing"},{"$f":"IF(BD24=\"\",\"\",IF(BD24=\"FCL\",1,IF(BD24=\"CLO2\",2,IF(BD24=\"O3 Cell 1\",99,IF(BD24=\"O3\",3,IF(BD24=\"CLA\",4,0))))))","v":0},{"$f":"IF(BD24=\"\",\"\",IF(BD24=\"NA\",\"NA\",IF(ISBLANK($D24),\"missing\",IF(AND(BE24=1,ISNUMBER($D24),$D24>4),4,IF(AND(ISNUMBER($D24),$D24>=0),$D24,IF(AND(ISTEXT($D24),$D24=\"ND\"),\"ND\",\"!error\"))))))","v":"missing"},{"$f":"IF(BD24=\"\",\"\",IF(BD24=\"NA\",\"NA\",IF(ISBLANK($E24),\"missing\",IF(OR(AND(ISBLANK($B24),COUNT(BF24,BI24:BJ24)=0,ISNUMBER($E24),$E24=0),AND(ISNUMBER($E24),$E24>0),AND(ISTEXT($E24),$E24=\"ND\")),$E24,\"!error\"))))","v":"missing"},{"$f":"IF(BD24=\"\",\"\",IF(AY24=0,\"NA\",IF(OR($BD$12=\"!error\",$BD$13=\"!error\",BG24=\"!error\"),\"!error\",IF(BD24=\"NA\",\"NA\",IF(AND(ISNUMBER(BG24),BG24=0),0,IF(AND(ISNUMBER($BD$12),ISNUMBER($BD$13),ISNUMBER(BG24)),$BD$13*$BD$12/BG24,IF(BG24=\"ND\",\"ND\",\"missing\")))))))","v":"missing"},{"$f":"IF(BD24=\"\",\"\",IF(BD24=\"NA\",\"NA\",IF(ISBLANK($F24),\"missing\",IF(OR(ISNUMBER($F24),$F24=\"ND\"),$F24,\"!error\"))))","v":"missing"},{"$f":"IF(BD24=\"\",\"\",IF(BD24=\"NA\",\"NA\",IF(ISBLANK($G24),\"missing\",IF(OR(AND(ISNUMBER($G24),$G24>=0,$G24<=14),$G24=\"ND\"),$G24,\"!error\"))))","v":"missing"},{"$f":"IF(BD24=\"\",\"\",IF(AY24=0,\"NA\",IF(OR(BF24=\"!error\",BH24=\"!error\"),\"!error\",IF(BD24=\"NA\",\"NA\",IF(OR(AND(ISNUMBER(BF24),BF24=0),AND(ISNUMBER(BH24),BH24=0)),0,IF(AND(ISNUMBER(BF24),ISNUMBER(BH24)),BF24*BH24,IF(OR(BF24=\"ND\",BH24=\"ND\"),\"ND\",\"missing\")))))))","v":"missing"},{"$f":"IF(BD24=\"\",\"\",IF(AY24=0,\"NA\",IF(CW24=\"ND\",\"ND\",IF(OR($BN$12=\"!error\",BD24=\"!error\",AND(BD24=\"missing\",ISNUMBER(BF24)),IF(BE24=1,BF24=\"!error\",0),BI24=\"!error\",BJ24=\"!error\"),\"!error\",IF(OR(BD24=\"NA\",AND(ISNUMBER($BN$12),$BN$12=0),AND(BE24<>0,ISNUMBER(BK24),BK24=0),AND(BE24=1,ISNUMBER(BJ24),BJ24>9),AND(BE24=2,ISNUMBER(BJ24),OR(BJ24<6,BJ24>=9.5)),AND(OR(BE24=3,BE24=4),ISNUMBER(BJ24),OR(BJ24<5.5,BJ24>=9.5))),\"NA\",IF(AND(ISNUMBER($BN$12),BE24<>0,IF(BE24=1,ISNUMBER(BF24),1),ISNUMBER(BI24),ISNUMBER(BJ24)),CT_Giardia(BE24,$BN$12,BI24,BJ24,IF(BE24=1,BF24,)),IF(COUNTIF(BE24,\"<>0\")+COUNT(BF24,BG24,BI24,BJ24)=5,\"!error\",\"missing\")))))))","v":"missing"},{"$f":"IF(BD24=\"\",\"\",IF(OR(AY24=0,AND(ISNUMBER($BN$12),$BN$12=0)),\"NA\",IF(CW24=\"ND\",\"ND\",IF(OR(BK24=\"!error\",BL24=\"!error\",BN24=\"!error\"),\"!error\",IF(BD24=\"NA\",\"NA\",IF(BL24=\"NA\",0,IF(AND(BE24<>99,ISNUMBER(BK24),ISNUMBER(BL24)),BK24/BL24,IF(AND(BE24=99,BN24=0.5),BN24/$BN$12,\"missing\"))))))))","v":"missing"},{"$f":"IF(BD24=\"\",\"\",IF(AY24=0,\"NA\",IF(CW24=\"ND\",\"ND\",IF(OR(BD24=\"!error\",AND(BD24=\"missing\",ISNUMBER(BF24)),BF24=\"!error\",BH24=\"!error\",BI24=\"!error\",BJ24=\"!error\"),\"!error\",IF(BD24=\"NA\",\"NA\",IF(OR(AND(BE24<>0,ISNUMBER(BK24),BK24=0),AND(BE24=1,ISNUMBER(BJ24),BJ24>9),AND(BE24=2,ISNUMBER(BJ24),OR(BJ24<6,BJ24>=9.5)),AND(OR(BE24=3,BE24=4),ISNUMBER(BJ24),OR(BJ24<5.5,BJ24>=9.5))),0,IF(AND(ISNUMBER($BN$12),BE24<>0,ISNUMBER(BF24),ISNUMBER(BH24),ISNUMBER(BI24),ISNUMBER(BJ24)),log_Giardia(BE24,$BN$12,BI24,BJ24,BF24,BH24),IF(COUNTIF(BE24,\"<>0\")+COUNT(BF24,BG24,BI24,BJ24)=5,\"!error\",\"missing\"))))))))","v":"missing"},{"$f":"IF(BD24=\"\",\"\",IF(AY24=0,\"NA\",IF(CW24=\"ND\",\"ND\",IF(OR($BP$12=\"!error\",BD24=\"!error\",AND(BD24=\"missing\",ISNUMBER(BF24)),BI24=\"!error\",BJ24=\"!error\"),\"!error\",IF(OR(BD24=\"NA\",AND(ISNUMBER($BP$12),$BP$12=0),AND(BE24<>0,ISNUMBER(BK24),BK24=0),AND(BE24=1,ISNUMBER(BJ24),BJ24>=10.5),AND(BE24=2,ISNUMBER(BJ24),OR(BJ24<6,BJ24>=9.5)),AND(BE24=3,ISNUMBER(BJ24),OR(BJ24<6,BJ24>9)),AND(BE24=4,ISNUMBER(BJ24),OR(BJ24<6,BJ24>10))),\"NA\",IF(AND(ISNUMBER($BP$12),BE24<>0,ISNUMBER(BI24),ISNUMBER(BJ24)),CT_Virus(BE24,$BP$12,BI24,BJ24),IF(COUNTIF(BE24,\"<>0\")+COUNT(BF24,BG24,BI24,BJ24)=5,\"!error\",\"missing\")))))))","v":"missing"},{"$f":"IF(BD24=\"\",\"\",IF(OR(AY24=0,AND(ISNUMBER($BP$12),$BP$12=0)),\"NA\",IF(CW24=\"ND\",\"ND\",IF(OR(BK24=\"!error\",BO24=\"!error\",BQ24=\"!error\"),\"!error\",IF(BD24=\"NA\",\"NA\",IF(BO24=\"NA\",0,IF(AND(BE24<>99,ISNUMBER(BK24),ISNUMBER(BO24)),BK24/BO24,IF(AND(BE24=99,BQ24=1),BQ24/$BP$12,\"missing\"))))))))","v":"missing"},{"$f":"IF(BD24=\"\",\"\",IF(AY24=0,\"NA\",IF(CW24=\"ND\",\"ND\",IF(OR(BD24=\"!error\",AND(BD24=\"missing\",ISNUMBER(BF24)),BF24=\"!error\",BH24=\"!error\",BI24=\"!error\",BJ24=\"!error\"),\"!error\",IF(BD24=\"NA\",\"NA\",IF(OR(AND(BE24<>0,ISNUMBER(BK24),BK24=0),AND(BE24=1,ISNUMBER(BJ24),BJ24>=10.5),AND(BE24=2,ISNUMBER(BJ24),OR(BJ24<6,BJ24>=9.5)),AND(BE24=3,ISNUMBER(BJ24),OR(BJ24<6,BJ24>9)),AND(BE24=4,ISNUMBER(BJ24),OR(BJ24<6,BJ24>10))),0,IF(AND(ISNUMBER($BP$12),BE24<>0,ISNUMBER(BF24),ISNUMBER(BH24),ISNUMBER(BI24),ISNUMBER(BJ24)),Log_Virus(BE24,$BP$12,BI24,BJ24,BF24,BH24),IF(COUNTIF(BE24,\"<>0\")+COUNT(BF24,BG24,BI24,BJ24)=5,\"!error\",\"missing\"))))))))","v":"missing"},{"$f":"IF($BI$14=0,0,IF(COUNTIF(OFFSET($BD24,0,0,MIN($BI$14,5),1),\"<>NA\")+IF($BI$14>5,COUNTIF(OFFSET($BV24,0,0,$BI$14-5,1),\"<>NA\"),0),1,0))","v":1},{"$f":"IF($BI$14=0,0,IF(COUNTIF(OFFSET($BD24,0,0,MIN($BI$14,5),1),\"O3\")+COUNTIF(OFFSET($BD24,0,0,MIN($BI$14,5),1),\"O3 Cell 1\")+IF($BI$14>5,COUNTIF(OFFSET($BV24,0,0,$BI$14-5,1),\"O3\"),0)+IF($BI$14>5,COUNTIF(OFFSET($BV24,0,0,$BI$14-5,1),\"O3 Cell 1\"),0),1,0))","v":0},{"$f":"IF(OR($AY24=0,AND(COUNTA(D46,F46:G46)=0,COUNTIF(E46,0))),\"NA\",IF(COUNTA(D46:G46),IF(BS24,4,5),IF($BI$15=1,IF(BS24,4,IF(BR24,5,6)),IF(BV24=\"!error\",IF(BS24,4,5),IF(BS24,\"5B\",6)))))","v":6},{"$f":"$BI$11","v":6},{"$f":"IF(AND(IF($BN$4=\"missing\",10,$BN$4)>=6,$AY24<>\"\"),IF(OR($AY24=0,AND($B46=\"NA\",COUNTA($D46,$F46:$G46)=0,COUNTIF($E46,0)),AND($B46=\"NA\",COUNTA($D46:$G46)=0,IF($BI$14=0,0,COUNTIF(OFFSET($BD24,0,0,MIN($BI$14,5),1),\"NA\")+IF($BI$14>5,COUNTIF(OFFSET($BV24,0,0,$BI$14-5,1),\"NA\"),0))=$BI$14),AND($B46=\"NA\",COUNTA($D46:$G46)=0,IF($BI$14<5,COUNTA(OFFSET($D24,$BI$14,0,MIN(5-$BI$14,$BI$15),4))-COUNTIF(OFFSET($E24,$BI$14,0,MIN(5-$BI$14,$BI$15),1),0),0)+IF($BI$14+$BI$15>5,COUNTA(OFFSET($D46,MAX($BI$14-5,0),0,MIN($BI$14+$BI$15-5,$BI$15),4))-COUNTIF(OFFSET($E46,MAX($BI$14-5,0),0,MIN($BI$14+$BI$15-5,$BI$15),1),0),0)),AND($B46=\"NA\",COUNTA($D46:$G46)=0,IF($BI$14<5,COUNTIF(OFFSET($B24,$BI$14,0,MIN(5-$BI$14,$BI$15),1),\"NA\"),0)+IF($BI$14+$BI$15>5,COUNTIF(OFFSET($B46,MAX($BI$14-5,0),0,MIN($BI$14+$BI$15-5,$BI$15),1),\"NA\"),0)<>$BI$15)),\"NA\",IF($B46=\"\",\"missing\",IF(AND($B46<>\"NA\",COUNTA($D46,$F46:$G46)+COUNTIF($E46,\"<>0\")),UPPER($B46),\"!error\"))),\"\")","v":""},{"$f":"IF(BV24=\"\",\"\",IF(BV24=\"FCL\",1,IF(BV24=\"CLO2\",2,IF(BV24=\"O3 Cell 1\",99,IF(BV24=\"O3\",3,IF(BV24=\"CLA\",4,0))))))","v":""},{"$f":"IF(BV24=\"\",\"\",IF(BV24=\"NA\",\"NA\",IF(ISBLANK($D46),\"missing\",IF(AND(BW24=1,ISNUMBER($D46),$D46>4),4,IF(AND(ISNUMBER($D46),$D46>=0),$D46,IF(AND(ISTEXT($D46),$D46=\"ND\"),\"ND\",\"!error\"))))))","v":""},{"$f":"IF(BV24=\"\",\"\",IF(BV24=\"NA\",\"NA\",IF(ISBLANK($E46),\"missing\",IF(OR(AND(ISBLANK($B46),COUNT(BX24,CA24:CB24)=0,ISNUMBER($E46),$E46=0),AND(ISNUMBER($E46),$E46>0),AND(ISTEXT($E46),$E46=\"ND\")),$E46,\"!error\"))))","v":""},{"$f":"IF(BV24=\"\",\"\",IF(AY24=0,\"NA\",IF(OR($BI$12=\"!error\",$BI$13=\"!error\",BY24=\"!error\"),\"!error\",IF(BV24=\"NA\",\"NA\",IF(AND(ISNUMBER(BY24),BY24=0),0,IF(AND(ISNUMBER($BI$12),ISNUMBER($BI$13),ISNUMBER(BY24)),$BI$13*$BI$12/BY24,IF(BY24=\"ND\",\"ND\",\"missing\")))))))","v":""},{"$f":"IF(BV24=\"\",\"\",IF(BV24=\"NA\",\"NA\",IF(ISBLANK($F46),\"missing\",IF(OR(ISNUMBER($F46),$F46=\"ND\"),$F46,\"!error\"))))","v":""},{"$f":"IF(BV24=\"\",\"\",IF(BV24=\"NA\",\"NA\",IF(ISBLANK($G46),\"missing\",IF(OR(AND(ISNUMBER($G46),$G46>=0,$G46<=14),$G46=\"ND\"),$G46,\"!error\"))))","v":""},{"$f":"IF(BV24=\"\",\"\",IF(AY24=0,\"NA\",IF(OR(BX24=\"!error\",BZ24=\"!error\"),\"!error\",IF(BV24=\"NA\",\"NA\",IF(OR(AND(ISNUMBER(BX24),BX24=0),AND(ISNUMBER(BZ24),BZ24=0)),0,IF(AND(ISNUMBER(BX24),ISNUMBER(BZ24)),BX24*BZ24,IF(OR(BX24=\"ND\",BZ24=\"ND\"),\"ND\",\"missing\")))))))","v":""},{"$f":"IF(BV24=\"\",\"\",IF(AY24=0,\"NA\",IF(CX24=\"ND\",\"ND\",IF(OR($BN$12=\"!error\",BV24=\"!error\",AND(BV24=\"missing\",ISNUMBER(BX24)),IF(BW24=1,BX24=\"!error\",0),CA24=\"!error\",CB24=\"!error\"),\"!error\",IF(OR(BV24=\"NA\",AND(ISNUMBER($BN$12),$BN$12=0),AND(BW24<>0,ISNUMBER(CC24),CC24=0),AND(BW24=1,ISNUMBER(CB24),CB24>9),AND(BW24>1,ISNUMBER(CB24),OR(CB24<6,CB24>=9.5))),\"NA\",IF(AND(ISNUMBER($BN$12),BW24<>0,IF(BW24=1,ISNUMBER(BX24),1),ISNUMBER(CA24),ISNUMBER(CB24)),CT_Giardia(BW24,$BN$12,CA24,CB24,IF(BW24=1,BX24,)),IF(COUNTIF(BW24,\"<>0\")+COUNT(BX24,BY24,CA24,CB24)=5,\"!error\",\"missing\")))))))","v":""},{"$f":"IF(BV24=\"\",\"\",IF(OR(AY24=0,AND(ISNUMBER($BN$12),$BN$12=0)),\"NA\",IF(CX24=\"ND\",\"ND\",IF(OR(CC24=\"!error\",CD24=\"!error\",CF24=\"!error\"),\"!error\",IF(BV24=\"NA\",\"NA\",IF(CD24=\"NA\",0,IF(AND(ISNUMBER(CC24),ISNUMBER(CD24)),CC24/CD24,IF(AND(BW24=99,CF24=0.5),CF24/$BN$12,\"missing\"))))))))","v":""},{"$f":"IF(BV24=\"\",\"\",IF(AY24=0,\"NA\",IF(CX24=\"ND\",\"ND\",IF(OR(BV24=\"!error\",AND(BV24=\"missing\",ISNUMBER(BX24)),BX24=\"!error\",BZ24=\"!error\",CA24=\"!error\",CB24=\"!error\"),\"!error\",IF(BV24=\"NA\",\"NA\",IF(OR(AND(BW24<>0,ISNUMBER(CC24),CC24=0),AND(BW24=1,ISNUMBER(CB24),CB24>9),AND(BW24>1,ISNUMBER(CB24),OR(CB24<6,CB24>=9.5))),0,IF(AND(ISNUMBER($BN$12),BW24<>0,ISNUMBER(BX24),ISNUMBER(BZ24),ISNUMBER(CA24),ISNUMBER(CB24)),log_Giardia(BW24,$BN$12,CA24,CB24,BX24,BZ24),IF(COUNTIF(BW24,\"<>0\")+COUNT(BX24,BY24,CA24,CB24)=5,\"!error\",\"missing\"))))))))","v":""},{"$f":"IF(BV24=\"\",\"\",IF(AY24=0,\"NA\",IF(CX24=\"ND\",\"ND\",IF(OR($BP$12=\"!error\",BV24=\"!error\",AND(BV24=\"missing\",ISNUMBER(BX24)),CA24=\"!error\",CB24=\"!error\"),\"!error\",IF(OR(BV24=\"NA\",AND(ISNUMBER($BP$12),$BP$12=0),AND(BW24<>0,ISNUMBER(CC24),CC24=0),AND(BW24=1,ISNUMBER(CB24),OR(CB24<5.5,CB24>=10.5)),AND(OR(BW24=2,BW24=4),ISNUMBER(CB24),OR(CB24<6,CB24>=9.5)),AND(BW24=3,ISNUMBER(CB24),OR(CB24<6,CB24>9))),\"NA\",IF(AND(ISNUMBER($BP$12),BW24<>0,ISNUMBER(CA24),ISNUMBER(CB24)),CT_Virus(BW24,$BP$12,CA24,CB24),IF(COUNTIF(BW24,\"<>0\")+COUNT(BX24,BY24,CA24,CB24)=5,\"!error\",\"missing\")))))))","v":""},{"$f":"IF(BV24=\"\",\"\",IF(OR(AY24=0,AND(ISNUMBER($BP$12),$BP$12=0)),\"NA\",IF(CX24=\"ND\",\"ND\",IF(OR(CC24=\"!error\",CG24=\"!error\",CI24=\"!error\"),\"!error\",IF(BV24=\"NA\",\"NA\",IF(CG24=\"NA\",0,IF(AND(ISNUMBER(CC24),ISNUMBER(CG24)),CC24/CG24,IF(AND(BW24=99,CI24=1),CI24/$BP$12,\"missing\"))))))))","v":""},{"$f":"IF(BV24=\"\",\"\",IF(AY24=0,\"NA\",IF(CX24=\"ND\",\"ND\",IF(OR(BV24=\"!error\",AND(BV24=\"missing\",ISNUMBER(BX24)),BX24=\"!error\",BZ24=\"!error\",CA24=\"!error\",CB24=\"!error\"),\"!error\",IF(BV24=\"NA\",\"NA\",IF(OR(AND(BW24<>0,ISNUMBER(CC24),CC24=0),AND(BW24=1,ISNUMBER(CB24),OR(CB24<5.5,CB24>=10.5)),AND(OR(BW24=2,BW24=4),ISNUMBER(CB24),OR(CB24<6,CB24>=9.5)),AND(BW24=3,ISNUMBER(CB24),OR(CB24<6,CB24>9))),0,IF(AND(ISNUMBER($BP$12),BW24<>0,ISNUMBER(BX24),ISNUMBER(BZ24),ISNUMBER(CA24),ISNUMBER(CB24)),Log_Virus(BW24,$BP$12,CA24,CB24,BX24,BZ24),IF(COUNTIF(BW24,\"<>0\")+COUNT(BX24,BY24,CA24,CB24)=5,\"!error\",\"missing\"))))))))","v":""},null,{"$f":"IF(AY24=\"\",\"\",IF(AY24=0,\"NA\",IF(COUNTIF(BN24:BN28,\"!error\")+COUNTIF(CF24:CF28,\"!error\")>0,\"!error\",IF(COUNT(BN24:BN28,CF24:CF28)>0,SUMIFF(BC24:BC28,\">0\",BN24:BN28)+SUMIFF(BU24:BU28,\">0\",CF24:CF28)+MINIF(BC24:BC28,BU24:BU28,\"1?\",BN24:BN28,CF24:CF28)+MINIF(BC24:BC28,BU24:BU28,\"2?\",BN24:BN28,CF24:CF28)+MINIF(BC24:BC28,BU24:BU28,\"3?\",BN24:BN28,CF24:CF28)+MINIF(BC24:BC28,BU24:BU28,\"4?\",BN24:BN28,CF24:CF28)+MINIF(BC24:BC28,BU24:BU28,\"5?\",BN24:BN28,CF24:CF28)+MINIF(BC24:BC28,BU24:BU28,\"6?\",BN24:BN28,CF24:CF28)+MINIF(BC24:BC28,BU24:BU28,\"7?\",BN24:BN28,CF24:CF28)+MINIF(BC24:BC28,BU24:BU28,\"8?\",BN24:BN28,CF24:CF28)+MINIF(BC24:BC28,BU24:BU28,\"9?\",BN24:BN28,CF24:CF28)+MINIF(BC24:BC28,BU24:BU28,\"10?\",BN24:BN28,CF24:CF28),IF(COUNTIF(BN24:BN28,\"NA\")+COUNTIF(CF24:CF28,\"NA\")=IF($AZ$4=\"missing\",10,SUM($BD$4:$BM$4)),0,\"missing\")))))","v":"missing"},{"$f":"IF(AND(ISNUMBER(CK24),COUNT(BN24:BN28,CF24:CF28)+COUNTIF(BN24:BN28,\"NA\")+COUNTIF(CF24:CF28,\"NA\")<IF($AZ$4=\"missing\",10,SUM($BD$4:$BM$4))),\"*\",\"\")","v":""},{"$f":"IF(AY24=\"\",\"\",IF(OR(AY24=0,AND(ISNUMBER($BN$12),$BN$12=0)),\"NA\",IF(COUNTIF(BM24:BM28,\"!error\")+COUNTIF(CE24:CE28,\"!error\")>0,\"!error\",IF(COUNT(BM24:BM28,CE24:CE28)>0,SUMIFF(BC24:BC28,\">0\",BM24:BM28)+SUMIFF(BU24:BU28,\">0\",CE24:CE28)+MINIF(BC24:BC28,BU24:BU28,\"1?\",BM24:BM28,CE24:CE28)+MINIF(BC24:BC28,BU24:BU28,\"2?\",BM24:BM28,CE24:CE28)+MINIF(BC24:BC28,BU24:BU28,\"3?\",BM24:BM28,CE24:CE28)+MINIF(BC24:BC28,BU24:BU28,\"4?\",BM24:BM28,CE24:CE28)+MINIF(BC24:BC28,BU24:BU28,\"5?\",BM24:BM28,CE24:CE28)+MINIF(BC24:BC28,BU24:BU28,\"6?\",BM24:BM28,CE24:CE28)+MINIF(BC24:BC28,BU24:BU28,\"7?\",BM24:BM28,CE24:CE28)+MINIF(BC24:BC28,BU24:BU28,\"8?\",BM24:BM28,CE24:CE28)+MINIF(BC24:BC28,BU24:BU28,\"9?\",BM24:BM28,CE24:CE28)+MINIF(BC24:BC28,BU24:BU28,\"10?\",BM24:BM28,CE24:CE28),IF(COUNTIF(BM24:BM28,\"NA\")+COUNTIF(CE24:CE28,\"NA\")=IF($AZ$4=\"missing\",10,SUM($BD$4:$BM$4)),0,\"missing\")))))","v":"missing"},{"$f":"IF(AND(ISNUMBER(CM24),COUNT(BM24:BM28,CE24:CE28)+COUNTIF(BM24:BM28,\"NA\")+COUNTIF(CE24:CE28,\"NA\")<IF($AZ$4=\"missing\",10,SUM($BD$4:$BM$4))),\"*\",\"\")","v":""},{"$f":"IF(AY24=\"\",\"\",IF(AY24=0,\"NA\",IF(COUNTIF(BQ24:BQ28,\"!error\")+COUNTIF(CI24:CI28,\"!error\")>0,\"!error\",IF(COUNT(BQ24:BQ28,CI24:CI28)>0,SUMIFF(BC24:BC28,\">0\",BQ24:BQ28)+SUMIFF(BU24:BU28,\">0\",CI24:CI28)+MINIF(BC24:BC28,BU24:BU28,\"1?\",BQ24:BQ28,CI24:CI28)+MINIF(BC24:BC28,BU24:BU28,\"2?\",BQ24:BQ28,CI24:CI28)+MINIF(BC24:BC28,BU24:BU28,\"3?\",BQ24:BQ28,CI24:CI28)+MINIF(BC24:BC28,BU24:BU28,\"4?\",BQ24:BQ28,CI24:CI28)+MINIF(BC24:BC28,BU24:BU28,\"5?\",BQ24:BQ28,CI24:CI28)+MINIF(BC24:BC28,BU24:BU28,\"6?\",BQ24:BQ28,CI24:CI28)+MINIF(BC24:BC28,BU24:BU28,\"7?\",BQ24:BQ28,CI24:CI28)+MINIF(BC24:BC28,BU24:BU28,\"8?\",BQ24:BQ28,CI24:CI28)+MINIF(BC24:BC28,BU24:BU28,\"9?\",BQ24:BQ28,CI24:CI28)+MINIF(BC24:BC28,BU24:BU28,\"10?\",BQ24:BQ28,CI24:CI28),IF(COUNTIF(BQ24:BQ28,\"NA\")+COUNTIF(CI24:CI28,\"NA\")=IF($AZ$4=\"missing\",10,SUM($BD$4:$BM$4)),0,\"missing\")))))","v":"missing"},{"$f":"IF(AND(ISNUMBER(CO24),COUNT(BQ24:BQ28,CI24:CI28)+COUNTIF(BQ24:BQ28,\"NA\")+COUNTIF(CI24:CI28,\"NA\")<IF($AZ$4=\"missing\",10,SUM($BD$4:$BM$4))),\"*\",\"\")","v":""},{"$f":"IF(AY24=\"\",\"\",IF(OR(AY24=0,AND(ISNUMBER($BP$12),$BP$12=0)),\"NA\",IF(COUNTIF(BP24:BP28,\"!error\")+COUNTIF(CH24:CH28,\"!error\")>0,\"!error\",IF(COUNT(BP24:BP28,CH24:CH28)>0,SUMIFF(BC24:BC28,\">0\",BP24:BP28)+SUMIFF(BU24:BU28,\">0\",CH24:CH28)+MINIF(BC24:BC28,BU24:BU28,\"1?\",BP24:BP28,CH24:CH28)+MINIF(BC24:BC28,BU24:BU28,\"2?\",BP24:BP28,CH24:CH28)+MINIF(BC24:BC28,BU24:BU28,\"3?\",BP24:BP28,CH24:CH28)+MINIF(BC24:BC28,BU24:BU28,\"4?\",BP24:BP28,CH24:CH28)+MINIF(BC24:BC28,BU24:BU28,\"5?\",BP24:BP28,CH24:CH28)+MINIF(BC24:BC28,BU24:BU28,\"6?\",BP24:BP28,CH24:CH28)+MINIF(BC24:BC28,BU24:BU28,\"7?\",BP24:BP28,CH24:CH28)+MINIF(BC24:BC28,BU24:BU28,\"8?\",BP24:BP28,CH24:CH28)+MINIF(BC24:BC28,BU24:BU28,\"9?\",BP24:BP28,CH24:CH28)+MINIF(BC24:BC28,BU24:BU28,\"10?\",BP24:BP28,CH24:CH28),IF(COUNTIF(BP24:BP28,\"NA\")+COUNTIF(CH24:CH28,\"NA\")=IF($AZ$4=\"missing\",10,SUM($BD$4:$BM$4)),0,\"missing\")))))","v":"missing"},{"$f":"IF(AND(ISNUMBER(CQ24),COUNT(BP24:BP28,CH24:CH28)+COUNTIF(BP24:BP28,\"NA\")+COUNTIF(CH24:CH28,\"NA\")<IF($AZ$4=\"missing\",10,SUM($BD$4:$BM$4))),\"*\",\"\")","v":""},{"$f":"IF(AY24=\"\",\"\",IF(AND(CM24=\"NA\",CQ24=\"NA\"),\"NA\",IF(OR(AND(ISNUMBER(CM24),ISNUMBER(CQ24)),AND(ISNUMBER(CM24),CQ24=\"NA\"),AND(CM24=\"NA\",ISNUMBER(CQ24)),AND(ISNUMBER(CM24),CM24=0),AND(ISNUMBER(CQ24),CQ24=0)),MIN(CM24,CQ24),IF(OR(CM24=\"!error\",CQ24=\"!error\"),\"!error\",\"missing\"))))","v":"missing"},{"$f":"IF(ISNUMBER(CS24),IF(CM24<CQ24,IF(CN24=\"*\",\"*\",\"\"),IF(CQ24<CM24,IF(CR24=\"*\",\"*\",\"\"),IF(AND(CN24=\"*\",CR24=\"*\"),\"*\",\"\"))),\"\")","v":""},{"$f":"IF(ISNUMBER(CS24),IF(CM24<CQ24,\"(G)\",IF(CQ24<CM24,\"(V)\",IF(AND(CN24=\"\",CR24=\"*\"),\"(G)\",IF(AND(CN24=\"*\",CR24=\"\"),\"(V)\",\"(G/V)\")))),\"\")","v":""}]
["","",{"$f":"F15","v":2},null,null,null,null,"missing",{"$f":"$BL25","v":"missing"},{"$f":"$BO25","v":"missing"},{"$f":"$BN25","v":"missing"},{"$f":"$BQ25","v":"missing"},null,null,null,null,null,null,{"$f":"IF(B25=\"\",\"\",IF(B25=\"FCL\",1,IF(B25=\"CLO2\",2,IF(B25=\"O3\",3,IF(B25=\"CLA\",4,IF(B25=\"O3 cell 1\",99,0))))))","v":""},{"$f":"IF('T10 Details'!H331=\"\",\"\",IF('T10 Details'!H331=\"Free Chlorine\",\"FCL\",IF('T10 Details'!H331=\"Chlorine Dioxide\",\"CLO2\",IF('T10 Details'!H331=\"Ozone cell 1\",\"O3 cell 1\",IF('T10 Details'!H331=\"Ozone (any cell)\",\"O3\",IF('T10 Details'!H331=\"Chloramines\",\"CLA\"))))))","v":""},{"$f":"IF('T10 Details'!E331=\"\",\"\",IF('T10 Details'!E331=\"Free Chlorine\",\"FCL\",IF('T10 Details'!E331=\"Chlorine Dioxide\",\"CLO2\",IF('T10 Details'!E331=\"Ozone (Cell 1)\",\"O3 (Cell 1)\",IF('T10 Details'!E331=\"Ozone (Any Cell)\",\"O3\",IF('T10 Details'!E331=\"Chloramines\",\"CLA\"))))))","v":""},null,null,null,null,null,null,null,null,null,null,null,null,null,null,null,null,null,null,null,null,null,null,null,null,null,null,null,null,null,1,{"$f":"IF($BE$14=0,0,IF(COUNTIF(OFFSET($BD24,0,0,MIN($BE$14,5),1),\"<>NA\")+IF($BE$14>5,COUNTIF(OFFSET($BV24,0,0,$BE$14-5,1),\"<>NA\"),0),1,0))","v":1},{"$f":"IF($BE$14=0,0,IF(COUNTIF(OFFSET($BD24,0,0,MIN($BE$14,5),1),\"O3\")+COUNTIF(OFFSET($BD24,0,0,MIN($BE$14,5),1),\"O3 Cell 1\")+IF($BE$14>5,COUNTIF(OFFSET($BV24,0,0,$BE$14-5,1),\"O3\"),0)+IF($BE$14>5,COUNTIF(OFFSET($BV24,0,0,$BE$14-5,1),\"O3 Cell 1\"),0),1,0))","v":0},{"$f":"IF(OR($AY25=0,AND(COUNTA(D25,F25:G25)=0,COUNTIF(E25,0))),\"NA\",IF(COUNTA(D25:G25),IF(BA25,4,5),IF($BE$15=1,IF(BA25,4,IF(AZ25,5,6)),IF(BD25=\"!error\",IF(BA25,4,5),IF(BA25,\"5B\",6)))))","v":5},{"$f":"$BE$11","v":2},{"$f":"IF(AND(IF($BN$4=\"missing\",10,$BN$4)>=2,$AY25<>\"\"),IF(OR($AY25=0,AND($B25=\"NA\",COUNTA($D25,$F25:$G25)=0,COUNTIF($E25,0)),AND($B25=\"NA\",COUNTA($D25:$G25)=0,IF($BE$14=0,0,COUNTIF(OFFSET($BD24,0,0,MIN($BE$14,5),1),\"NA\")+IF($BE$14>5,COUNTIF(OFFSET($BV24,0,0,$BE$14-5,1),\"NA\"),0))=$BE$14),AND($B25=\"NA\",COUNTA($D25:$G25)=0,IF($BE$14<5,COUNTA(OFFSET($D24,$BE$14,0,MIN(5-$BE$14,$BE$15),4))-COUNTIF(OFFSET($E24,$BE$14,0,MIN(5-$BE$14,$BE$15),1),0),0)+IF($BE$14+$BE$15>5,COUNTA(OFFSET($D46,MAX($BE$14-5,0),0,MIN($BE$14+$BE$15-5,$BE$15),4))-COUNTIF(OFFSET($E46,MAX($BE$14-5,0),0,MIN($BE$14+$BE$15-5,$BE$15),1),0),0)),AND($B25=\"NA\",COUNTA($D25:$G25)=0,IF($BE$14<5,COUNTIF(OFFSET($B24,$BE$14,0,MIN(5-$BE$14,$BE$15),1),\"NA\"),0)+IF($BE$14+$BE$15>5,COUNTIF(OFFSET($B46,MAX($BE$14-5,0),0,MIN($BE$14+$BE$15-5,$BE$15),1),\"NA\"),0)<>$BE$15)),\"NA\",IF($B25=\"\",\"missing\",IF(AND($B25<>\"NA\",COUNTA($D25,$F25:$G25)+COUNTIF($E25,\"<>0\")),UPPER($B25),\"!error\"))),\"\")","v":"missing"},0,{"$f":"IF(BD25=\"\",\"\",IF(BD25=\"NA\",\"NA\",IF(ISBLANK($D25),\"missing\",IF(AND(BE25=1,ISNUMBER($D25),$D25>4),4,IF(AND(ISNUMBER($D25),$D25>=0),$D25,IF(AND(ISTEXT($D25),$D25=\"ND\"),\"ND\",\"!error\"))))))","v":"missing"},{"$f":"IF(BD25=\"\",\"\",IF(BD25=\"NA\",\"NA\",IF(ISBLANK($E25),\"missing\",IF(OR(AND(ISBLANK($B25),COUNT(BF25,BI25:BJ25)=0,ISNUMBER($E25),$E25=0),AND(ISNUMBER($E25),$E25>0),AND(ISTEXT($E25),$E25=\"ND\")),$E25,\"!error\"))))","v":"missing"},{"$f":"IF(BD25=\"\",\"\",IF(AY25=0,\"NA\",IF(OR($BE$12=\"!error\",$BE$13=\"!error\",BG25=\"!error\"),\"!error\",IF(BD25=\"NA\",\"NA\",IF(AND(ISNUMBER(BG25),BG25=0),0,IF(AND(ISNUMBER($BE$12),ISNUMBER($BE$13),ISNUMBER(BG25)),$BE$13*$BE$12/BG25,IF(BG25=\"ND\",\"ND\",\"missing\")))))))","v":"missing"},{"$f":"IF(BD25=\"\",\"\",IF(BD25=\"NA\",\"NA\",IF(ISBLANK($F25),\"missing\",IF(OR(ISNUMBER($F25),$F25=\"ND\"),$F25,\"!error\"))))","v":"missing"},{"$f":"IF(BD25=\"\",\"\",IF(BD25=\"NA\",\"NA\",IF(ISBLANK($G25),\"missing\",IF(OR(AND(ISNUMBER($G25),$G25>=0,$G25<=14),$G25=\"ND\"),$G25,\"!error\"))))","v":"missing"},"missing",{"$f":"IF(BD25=\"\",\"\",IF(AY25=0,\"NA\",IF(CW25=\"ND\",\"ND\",IF(OR($BN$12=\"!error\",BD25=\"!error\",AND(BD25=\"missing\",ISNUMBER(BF25)),IF(BE25=1,BF25=\"!error\",0),BI25=\"!error\",BJ25=\"!error\"),\"!error\",IF(OR(BD25=\"NA\",AND(ISNUMBER($BN$12),$BN$12=0),AND(BE25<>0,ISNUMBER(BK25),BK25=0),AND(BE25=1,ISNUMBER(BJ25),BJ25>9),AND(BE25=2,ISNUMBER(BJ25),OR(BJ25<6,BJ25>=9.5)),AND(OR(BE25=3,BE25=4),ISNUMBER(BJ25),OR(BJ25<5.5,BJ25>=9.5))),\"NA\",IF(AND(ISNUMBER($BN$12),BE25<>0,IF(BE25=1,ISNUMBER(BF25),1),ISNUMBER(BI25),ISNUMBER(BJ25)),CT_Giardia(BE25,$BN$12,BI25,BJ25,IF(BE25=1,BF25,)),IF(COUNTIF(BE25,\"<>0\")+COUNT(BF25,BG25,BI25,BJ25)=5,\"!error\",\"missing\")))))))","v":"missing"},{"$f":"IF(BD25=\"\",\"\",IF(OR(AY25=0,AND(ISNUMBER($BN$12),$BN$12=0)),\"NA\",IF(CW25=\"ND\",\"ND\",IF(OR(BK25=\"!error\",BL25=\"!error\",BN25=\"!error\"),\"!error\",IF(BD25=\"NA\",\"NA\",IF(BL25=\"NA\",0,IF(AND(BE25<>99,ISNUMBER(BK25),ISNUMBER(BL25)),BK25/BL25,IF(AND(BE25=99,BN25=0.5),BN25/$BN$12,\"missing\"))))))))","v":"missing"},{"$f":"IF(BD25=\"\",\"\",IF(AY25=0,\"NA\",IF(CW25=\"ND\",\"ND\",IF(OR(BD25=\"!error\",AND(BD25=\"missing\",ISNUMBER(BF25)),BF25=\"!error\",BH25=\"!error\",BI25=\"!error\",BJ25=\"!error\"),\"!error\",IF(BD25=\"NA\",\"NA\",IF(OR(AND(BE25<>0,ISNUMBER(BK25),BK25=0),AND(BE25=1,ISNUMBER(BJ25),BJ25>9),AND(BE25=2,ISNUMBER(BJ25),OR(BJ25<6,BJ25>=9.5)),AND(OR(BE25=3,BE25=4),ISNUMBER(BJ25),OR(BJ25<5.5,BJ25>=9.5))),0,IF(AND(ISNUMBER($BN$12),BE25<>0,ISNUMBER(BF25),ISNUMBER(BH25),ISNUMBER(BI25),ISNUMBER(BJ25)),log_Giardia(BE25,$BN$12,BI25,BJ25,BF25,BH25),IF(COUNTIF(BE25,\"<>0\")+COUNT(BF25,BG25,BI25,BJ25)=5,\"!error\",\"missing\"))))))))","v":"missing"},{"$f":"IF(BD25=\"\",\"\",IF(AY25=0,\"NA\",IF(CW25=\"ND\",\"ND\",IF(OR($BP$12=\"!error\",BD25=\"!error\",AND(BD25=\"missing\",ISNUMBER(BF25)),BI25=\"!error\",BJ25=\"!error\"),\"!error\",IF(OR(BD25=\"NA\",AND(ISNUMBER($BP$12),$BP$12=0),AND(BE25<>0,ISNUMBER(BK25),BK25=0),AND(BE25=1,ISNUMBER(BJ25),BJ25>=10.5),AND(BE25=2,ISNUMBER(BJ25),OR(BJ25<6,BJ25>=9.5)),AND(BE25=3,ISNUMBER(BJ25),OR(BJ25<6,BJ25>9)),AND(BE25=4,ISNUMBER(BJ25),OR(BJ25<6,BJ25>10))),\"NA\",IF(AND(ISNUMBER($BP$12),BE25<>0,ISNUMBER(BI25),ISNUMBER(BJ25)),CT_Virus(BE25,$BP$12,BI25,BJ25),IF(COUNTIF(BE25,\"<>0\")+COUNT(BF25,BG25,BI25,BJ25)=5,\"!error\",\"missing\")))))))","v":"missing"},{"$f":"IF(BD25=\"\",\"\",IF(OR(AY25=0,AND(ISNUMBER($BP$12),$BP$12=0)),\"NA\",IF(CW25=\"ND\",\"ND\",IF(OR(BK25=\"!error\",BO25=\"!error\",BQ25=\"!error\"),\"!error\",IF(BD25=\"NA\",\"NA\",IF(BO25=\"NA\",0,IF(AND(BE25<>99,ISNUMBER(BK25),ISNUMBER(BO25)),BK25/BO25,IF(AND(BE25=99,BQ25=1),BQ25/$BP$12,\"missing\"))))))))","v":"missing"},{"$f":"IF(BD25=\"\",\"\",IF(AY25=0,\"NA\",IF(CW25=\"ND\",\"ND\",IF(OR(BD25=\"!error\",AND(BD25=\"missing\",ISNUMBER(BF25)),BF25=\"!error\",BH25=\"!error\",BI25=\"!error\",BJ25=\"!error\"),\"!error\",IF(BD25=\"NA\",\"NA\",IF(OR(AND(BE25<>0,ISNUMBER(BK25),BK25=0),AND(BE25=1,ISNUMBER(BJ25),BJ25>=10.5),AND(BE25=2,ISNUMBER(BJ25),OR(BJ25<6,BJ25>=9.5)),AND(BE25=3,ISNUMBER(BJ25),OR(BJ25<6,BJ25>9)),AND(BE25=4,ISNUMBER(BJ25),OR(BJ25<6,BJ25>10))),0,IF(AND(ISNUMBER($BP$12),BE25<>0,ISNUMBER(BF25),ISNUMBER(BH25),ISNUMBER(BI25),ISNUMBER(BJ25)),Log_Virus(BE25,$BP$12,BI25,BJ25,BF25,BH25),IF(COUNTIF(BE25,\"<>0\")+COUNT(BF25,BG25,BI25,BJ25)=5,\"!error\",\"missing\"))))))))","v":"missing"},{"$f":"IF($BJ$14=0,0,IF(COUNTIF(OFFSET($BD24,0,0,MIN($BJ$14,5),1),\"<>NA\")+IF($BJ$14>5,COUNTIF(OFFSET($BV24,0,0,$BJ$14-5,1),\"<>NA\"),0),1,0))","v":1},{"$f":"IF($BJ$14=0,0,IF(COUNTIF(OFFSET($BD24,0,0,MIN($BJ$14,5),1),\"O3\")+COUNTIF(OFFSET($BD24,0,0,MIN($BJ$14,5),1),\"O3 Cell 1\")+IF($BJ$14>5,COUNTIF(OFFSET($BV24,0,0,$BJ$14-5,1),\"O3\"),0)+IF($BJ$14>5,COUNTIF(OFFSET($BV24,0,0,$BJ$14-5,1),\"O3 Cell 1\"),0),1,0))","v":0},{"$f":"IF(OR($AY25=0,AND(COUNTA(D47,F47:G47)=0,COUNTIF(E47,0))),\"NA\",IF(COUNTA(D47:G47),IF(BS25,4,5),IF($BJ$15=1,IF(BS25,4,IF(BR25,5,6)),IF(BV25=\"!error\",IF(BS25,4,5),IF(BS25,\"5B\",6)))))","v":6},{"$f":"$BJ$11","v":7},{"$f":"IF(AND(IF($BN$4=\"missing\",10,$BN$4)>=7,$AY25<>\"\"),IF(OR($AY25=0,AND($B47=\"NA\",COUNTA($D47,$F47:$G47)=0,COUNTIF($E47,0)),AND($B47=\"NA\",COUNTA($D47:$G47)=0,IF($BJ$14=0,0,COUNTIF(OFFSET($BD24,0,0,MIN($BJ$14,5),1),\"NA\")+IF($BJ$14>5,COUNTIF(OFFSET($BV24,0,0,$BJ$14-5,1),\"NA\"),0))=$BJ$14),AND($B47=\"NA\",COUNTA($D47:$G47)=0,IF($BJ$14<5,COUNTA(OFFSET($D24,$BJ$14,0,MIN(5-$BJ$14,$BJ$15),4))-COUNTIF(OFFSET($E24,$BJ$14,0,MIN(5-$BJ$14,$BJ$15),1),0),0)+IF($BJ$14+$BJ$15>5,COUNTA(OFFSET($D46,MAX($BJ$14-5,0),0,MIN($BJ$14+$BJ$15-5,$BJ$15),4))-COUNTIF(OFFSET($E46,MAX($BJ$14-5,0),0,MIN($BJ$14+$BJ$15-5,$BJ$15),1),0),0)),AND($B47=\"NA\",COUNTA($D47:$G47)=0,IF($BJ$14<5,COUNTIF(OFFSET($B24,$BJ$14,0,MIN(5-$BJ$14,$BJ$15),1),\"NA\"),0)+IF($BJ$14+$BJ$15>5,COUNTIF(OFFSET($B46,MAX($BJ$14-5,0),0,MIN($BJ$14+$BJ$15-5,$BJ$15),1),\"NA\"),0)<>$BJ$15)),\"NA\",IF($B47=\"\",\"missing\",IF(AND($B47<>\"NA\",COUNTA($D47,$F47:$G47)+COUNTIF($E47,\"<>0\")),UPPER($B47),\"!error\"))),\"\")","v":""},"",{"$f":"IF(BV25=\"\",\"\",IF(BV25=\"NA\",\"NA\",IF(ISBLANK($D47),\"missing\",IF(AND(BW25=1,ISNUMBER($D47),$D47>4),4,IF(AND(ISNUMBER($D47),$D47>=0),$D47,IF(AND(ISTEXT($D47),$D47=\"ND\"),\"ND\",\"!error\"))))))","v":""},{"$f":"IF(BV25=\"\",\"\",IF(BV25=\"NA\",\"NA\",IF(ISBLANK($E47),\"missing\",IF(OR(AND(ISBLANK($B47),COUNT(BX25,CA25:CB25)=0,ISNUMBER($E47),$E47=0),AND(ISNUMBER($E47),$E47>0),AND(ISTEXT($E47),$E47=\"ND\")),$E47,\"!error\"))))","v":""},{"$f":"IF(BV25=\"\",\"\",IF(AY25=0,\"NA\",IF(OR($BJ$12=\"!error\",$BJ$13=\"!error\",BY25=\"!error\"),\"!error\",IF(BV25=\"NA\",\"NA\",IF(AND(ISNUMBER(BY25),BY25=0),0,IF(AND(ISNUMBER($BJ$12),ISNUMBER($BJ$13),ISNUMBER(BY25)),$BJ$13*$BJ$12/BY25,IF(BY25=\"ND\",\"ND\",\"missing\")))))))","v":""},{"$f":"IF(BV25=\"\",\"\",IF(BV25=\"NA\",\"NA\",IF(ISBLANK($F47),\"missing\",IF(OR(ISNUMBER($F47),$F47=\"ND\"),$F47,\"!error\"))))","v":""},{"$f":"IF(BV25=\"\",\"\",IF(BV25=\"NA\",\"NA\",IF(ISBLANK($G47),\"missing\",IF(OR(AND(ISNUMBER($G47),$G47>=0,$G47<=14),$G47=\"ND\"),$G47,\"!error\"))))","v":""},"",{"$f":"IF(BV25=\"\",\"\",IF(AY25=0,\"NA\",IF(CX25=\"ND\",\"ND\",IF(OR($BN$12=\"!error\",BV25=\"!error\",AND(BV25=\"missing\",ISNUMBER(BX25)),IF(BW25=1,BX25=\"!error\",0),CA25=\"!error\",CB25=\"!error\"),\"!error\",IF(OR(BV25=\"NA\",AND(ISNUMBER($BN$12),$BN$12=0),AND(BW25<>0,ISNUMBER(CC25),CC25=0),AND(BW25=1,ISNUMBER(CB25),CB25>9),AND(BW25>1,ISNUMBER(CB25),OR(CB25<6,CB25>=9.5))),\"NA\",IF(AND(ISNUMBER($BN$12),BW25<>0,IF(BW25=1,ISNUMBER(BX25),1),ISNUMBER(CA25),ISNUMBER(CB25)),CT_Giardia(BW25,$BN$12,CA25,CB25,IF(BW25=1,BX25,)),IF(COUNTIF(BW25,\"<>0\")+COUNT(BX25,BY25,CA25,CB25)=5,\"!error\",\"missing\")))))))","v":""},{"$f":"IF(BV25=\"\",\"\",IF(OR(AY25=0,AND(ISNUMBER($BN$12),$BN$12=0)),\"NA\",IF(CX25=\"ND\",\"ND\",IF(OR(CC25=\"!error\",CD25=\"!error\",CF25=\"!error\"),\"!error\",IF(BV25=\"NA\",\"NA\",IF(CD25=\"NA\",0,IF(AND(ISNUMBER(CC25),ISNUMBER(CD25)),CC25/CD25,IF(AND(BW25=99,CF25=0.5),CF25/$BN$12,\"missing\"))))))))","v":""},{"$f":"IF(BV25=\"\",\"\",IF(AY25=0,\"NA\",IF(CX25=\"ND\",\"ND\",IF(OR(BV25=\"!error\",AND(BV25=\"missing\",ISNUMBER(BX25)),BX25=\"!error\",BZ25=\"!error\",CA25=\"!error\",CB25=\"!error\"),\"!error\",IF(BV25=\"NA\",\"NA\",IF(OR(AND(BW25<>0,ISNUMBER(CC25),CC25=0),AND(BW25=1,ISNUMBER(CB25),CB25>9),AND(BW25>1,ISNUMBER(CB25),OR(CB25<6,CB25>=9.5))),0,IF(AND(ISNUMBER($BN$12),BW25<>0,ISNUMBER(BX25),ISNUMBER(BZ25),ISNUMBER(CA25),ISNUMBER(CB25)),log_Giardia(BW25,$BN$12,CA25,CB25,BX25,BZ25),IF(COUNTIF(BW25,\"<>0\")+COUNT(BX25,BY25,CA25,CB25)=5,\"!error\",\"missing\"))))))))","v":""},{"$f":"IF(BV25=\"\",\"\",IF(AY25=0,\"NA\",IF(CX25=\"ND\",\"ND\",IF(OR($BP$12=\"!error\",BV25=\"!error\",AND(BV25=\"missing\",ISNUMBER(BX25)),CA25=\"!error\",CB25=\"!error\"),\"!error\",IF(OR(BV25=\"NA\",AND(ISNUMBER($BP$12),$BP$12=0),AND(BW25<>0,ISNUMBER(CC25),CC25=0),AND(BW25=1,ISNUMBER(CB25),OR(CB25<5.5,CB25>=10.5)),AND(OR(BW25=2,BW25=4),ISNUMBER(CB25),OR(CB25<6,CB25>=9.5)),AND(BW25=3,ISNUMBER(CB25),OR(CB25<6,CB25>9))),\"NA\",IF(AND(ISNUMBER($BP$12),BW25<>0,ISNUMBER(CA25),ISNUMBER(CB25)),CT_Virus(BW25,$BP$12,CA25,CB25),IF(COUNTIF(BW25,\"<>0\")+COUNT(BX25,BY25,CA25,CB25)=5,\"!error\",\"missing\")))))))","v":""},{"$f":"IF(BV25=\"\",\"\",IF(OR(AY25=0,AND(ISNUMBER($BP$12),$BP$12=0)),\"NA\",IF(CX25=\"ND\",\"ND\",IF(OR(CC25=\"!error\",CG25=\"!error\",CI25=\"!error\"),\"!error\",IF(BV25=\"NA\",\"NA\",IF(CG25=\"NA\",0,IF(AND(ISNUMBER(CC25),ISNUMBER(CG25)),CC25/CG25,IF(AND(BW25=99,CI25=1),CI25/$BP$12,\"missing\"))))))))","v":""},{"$f":"IF(BV25=\"\",\"\",IF(AY25=0,\"NA\",IF(CX25=\"ND\",\"ND\",IF(OR(BV25=\"!error\",AND(BV25=\"missing\",ISNUMBER(BX25)),BX25=\"!error\",BZ25=\"!error\",CA25=\"!error\",CB25=\"!error\"),\"!error\",IF(BV25=\"NA\",\"NA\",IF(OR(AND(BW25<>0,ISNUMBER(CC25),CC25=0),AND(BW25=1,ISNUMBER(CB25),OR(CB25<5.5,CB25>=10.5)),AND(OR(BW25=2,BW25=4),ISNUMBER(CB25),OR(CB25<6,CB25>=9.5)),AND(BW25=3,ISNUMBER(CB25),OR(CB25<6,CB25>9))),0,IF(AND(ISNUMBER($BP$12),BW25<>0,ISNUMBER(BX25),ISNUMBER(BZ25),ISNUMBER(CA25),ISNUMBER(CB25)),Log_Virus(BW25,$BP$12,CA25,CB25,BX25,BZ25),IF(COUNTIF(BW25,\"<>0\")+COUNT(BX25,BY25,CA25,CB25)=5,\"!error\",\"missing\"))))))))","v":""}]
["","",{"$f":"G15","v":3},null,null,null,null,{"$f":"IF(BL26=\"!error\",\"!error\",$BK26)","v":"missing"},"missing","missing","missing","missing",{"$f":"IF($CK24=\"\",\"\",IF($CK24=\"NA\",\"NA\",IF($CK24=\"!error\",-99,IF(COUNTIF(CW24:CX28,\"ND\")=$BN$4,\"MD\",IF(ISNUMBER($CK24),FIXED($CK24,2)&IF($CL24=\"*\",\"*\",\" \"),\"\")))))","v":""},{"$f":"IF($CO24=\"\",\"\",IF($CO24=\"NA\",\"NA \",IF($CO24=\"!error\",-99,IF(COUNTIF(CW24:CX28,\"ND\")=$BN$4,\"MD\",IF(ISNUMBER($CO24),FIXED($CO24,2)&IF($CP24=\"*\",\"*\",\" \"),\"\")))))","v":""},{"$f":"IF($CS24=\"\",\"\",IF($CS24=\"NA\",\"NA\",IF($CS24=\"!error\",-99,IF(AND($CW24=\"ND\",$CW25=\"ND\",$CW26=\"ND\",$CW27=\"ND\",$CW28=\"ND\",$CX24=\"ND\",$CX25=\"ND\",$CX26=\"ND\",$CX27=\"ND\",$CX28=\"ND\"),\"ND\",IF(ISNUMBER($CS24),$CS24,\"\")))))","v":""},null,null,null,{"$f":"IF(B26=\"\",\"\",IF(B26=\"FCL\",1,IF(B26=\"CLO2\",2,IF(B26=\"O3\",3,IF(B26=\"CLA\",4,IF(B26=\"O3 cell 1\",99,0))))))","v":""},{"$f":"IF('T10 Details'!H647=\"\",\"\",IF('T10 Details'!H647=\"Free Chlorine\",\"FCL\",IF('T10 Details'!H647=\"Chlorine Dioxide\",\"CLO2\",IF('T10 Details'!H647=\"Ozone cell 1\",\"O3 cell 1\",IF('T10 Details'!H647=\"Ozone (any cell)\",\"O3\",IF('T10 Details'!H647=\"Chloramines\",\"CLA\"))))))","v":""},{"$f":"IF('T10 Details'!E647=\"\",\"\",IF('T10 Details'!E647=\"Free Chlorine\",\"FCL\",IF('T10 Details'!E647=\"Chlorine Dioxide\",\"CLO2\",IF('T10 Details'!E647=\"Ozone (Cell 1)\",\"O3 (Cell 1)\",IF('T10 Details'!E647=\"Ozone (Any Cell)\",\"O3\",IF('T10 Details'!E647=\"Chloramines\",\"CLA\"))))))","v":""},null,null,null,null,null,null,null,null,null,null,null,null,null,null,null,null,null,null,null,null,null,null,null,null,null,null,null,null,null,1,{"$f":"IF($BF$14=0,0,IF(COUNTIF(OFFSET($BD24,0,0,MIN($BF$14,5),1),\"<>NA\")+IF($BF$14>5,COUNTIF(OFFSET($BV24,0,0,$BF$14-5,1),\"<>NA\"),0),1,0))","v":1},{"$f":"IF($BF$14=0,0,IF(COUNTIF(OFFSET($BD24,0,0,MIN($BF$14,5),1),\"O3\")+COUNTIF(OFFSET($BD24,0,0,MIN($BF$14,5),1),\"O3 Cell 1\")+IF($BF$14>5,COUNTIF(OFFSET($BV24,0,0,$BF$14-5,1),\"O3\"),0)+IF($BF$14>5,COUNTIF(OFFSET($BV24,0,0,$BF$14-5,1),\"O3 Cell 1\"),0),1,0))","v":0},{"$f":"IF(OR($AY26=0,AND(COUNTA(D26,F26:G26)=0,COUNTIF(E26,0))),\"NA\",IF(COUNTA(D26:G26),IF(BA26,4,5),IF($BF$15=1,IF(BA26,4,IF(AZ26,5,6)),IF(BD26=\"!error\",IF(BA26,4,5),IF(BA26,\"5B\",6)))))","v":5},{"$f":"$BF$11","v":3},{"$f":"IF(AND(IF($BN$4=\"missing\",10,$BN$4)>=3,$AY26<>\"\"),IF(OR($AY26=0,AND($B26=\"NA\",COUNTA($D26,$F26:$G26)=0,COUNTIF($E26,0)),AND($B26=\"NA\",COUNTA($D26:$G26)=0,IF($BF$14=0,0,COUNTIF(OFFSET($BD24,0,0,MIN($BF$14,5),1),\"NA\")+IF($BF$14>5,COUNTIF(OFFSET($BV24,0,0,$BF$14-5,1),\"NA\"),0))=$BF$14),AND($B26=\"NA\",COUNTA($D26:$G26)=0,IF($BF$14<5,COUNTA(OFFSET($D24,$BF$14,0,MIN(5-$BF$14,$BF$15),4))-COUNTIF(OFFSET($E24,$BF$14,0,MIN(5-$BF$14,$BF$15),1),0),0)+IF($BF$14+$BF$15>5,COUNTA(OFFSET($D46,MAX($BF$14-5,0),0,MIN($BF$14+$BF$15-5,$BF$15),4))-COUNTIF(OFFSET($E46,MAX($BF$14-5,0),0,MIN($BF$14+$BF$15-5,$BF$15),1),0),0)),AND($B26=\"NA\",COUNTA($D26:$G26)=0,IF($BF$14<5,COUNTIF(OFFSET($B24,$BF$14,0,MIN(5-$BF$14,$BF$15),1),\"NA\"),0)+IF($BF$14+$BF$15>5,COUNTIF(OFFSET($B46,MAX($BF$14-5,0),0,MIN($BF$14+$BF$15-5,$BF$15),1),\"NA\"),0)<>$BF$15)),\"NA\",IF($B26=\"\",\"missing\",IF(AND($B26<>\"NA\",COUNTA($D26,$F26:$G26)+COUNTIF($E26,\"<>0\")),UPPER($B26),\"!error\"))),\"\")","v":"missing"},0,"missing","missing",{"$f":"IF(BD26=\"\",\"\",IF(AY26=0,\"NA\",IF(OR($BF$12=\"!error\",$BF$13=\"!error\",BG26=\"!error\"),\"!error\",IF(BD26=\"NA\",\"NA\",IF(AND(ISNUMBER(BG26),BG26=0),0,IF(AND(ISNUMBER($BF$12),ISNUMBER($BF$13),ISNUMBER(BG26)),$BF$13*$BF$12/BG26,IF(BG26=\"ND\",\"ND\",\"missing\")))))))","v":"missing"},"missing","missing","missing",{"$f":"IF(BD26=\"\",\"\",IF(AY26=0,\"NA\",IF(CW26=\"ND\",\"ND\",IF(OR($BN$12=\"!error\",BD26=\"!error\",AND(BD26=\"missing\",ISNUMBER(BF26)),IF(BE26=1,BF26=\"!error\",0),BI26=\"!error\",BJ26=\"!error\"),\"!error\",IF(OR(BD26=\"NA\",AND(ISNUMBER($BN$12),$BN$12=0),AND(BE26<>0,ISNUMBER(BK26),BK26=0),AND(BE26=1,ISNUMBER(BJ26),BJ26>9),AND(BE26=2,ISNUMBER(BJ26),OR(BJ26<6,BJ26>=9.5)),AND(OR(BE26=3,BE26=4),ISNUMBER(BJ26),OR(BJ26<5.5,BJ26>=9.5))),\"NA\",IF(AND(ISNUMBER($BN$12),BE26<>0,IF(BE26=1,ISNUMBER(BF26),1),ISNUMBER(BI26),ISNUMBER(BJ26)),CT_Giardia(BE26,$BN$12,BI26,BJ26,IF(BE26=1,BF26,)),IF(COUNTIF(BE26,\"<>0\")+COUNT(BF26,BG26,BI26,BJ26)=5,\"!error\",\"missing\")))))))","v":"missing"},{"$f":"IF(BD26=\"\",\"\",IF(OR(AY26=0,AND(ISNUMBER($BN$12),$BN$12=0)),\"NA\",IF(CW26=\"ND\",\"ND\",IF(OR(BK26=\"!error\",BL26=\"!error\",BN26=\"!error\"),\"!error\",IF(BD26=\"NA\",\"NA\",IF(BL26=\"NA\",0,IF(AND(BE26<>99,ISNUMBER(BK26),ISNUMBER(BL26)),BK26/BL26,IF(AND(BE26=99,BN26=0.5),BN26/$BN$12,\"missing\"))))))))","v":"missing"},{"$f":"IF(BD26=\"\",\"\",IF(AY26=0,\"NA\",IF(CW26=\"ND\",\"ND\",IF(OR(BD26=\"!error\",AND(BD26=\"missing\",ISNUMBER(BF26)),BF26=\"!error\",BH26=\"!error\",BI26=\"!error\",BJ26=\"!error\"),\"!error\",IF(BD26=\"NA\",\"NA\",IF(OR(AND(BE26<>0,ISNUMBER(BK26),BK26=0),AND(BE26=1,ISNUMBER(BJ26),BJ26>9),AND(BE26=2,ISNUMBER(BJ26),OR(BJ26<6,BJ26>=9.5)),AND(OR(BE26=3,BE26=4),ISNUMBER(BJ26),OR(BJ26<5.5,BJ26>=9.5))),0,IF(AND(ISNUMBER($BN$12),BE26<>0,ISNUMBER(BF26),ISNUMBER(BH26),ISNUMBER(BI26),ISNUMBER(BJ26)),log_Giardia(BE26,$BN$12,BI26,BJ26,BF26,BH26),IF(COUNTIF(BE26,\"<>0\")+COUNT(BF26,BG26,BI26,BJ26)=5,\"!error\",\"missing\"))))))))","v":"missing"},{"$f":"IF(BD26=\"\",\"\",IF(AY26=0,\"NA\",IF(CW26=\"ND\",\"ND\",IF(OR($BP$12=\"!error\",BD26=\"!error\",AND(BD26=\"missing\",ISNUMBER(BF26)),BI26=\"!error\",BJ26=\"!error\"),\"!error\",IF(OR(BD26=\"NA\",AND(ISNUMBER($BP$12),$BP$12=0),AND(BE26<>0,ISNUMBER(BK26),BK26=0),AND(BE26=1,ISNUMBER(BJ26),BJ26>=10.5),AND(BE26=2,ISNUMBER(BJ26),OR(BJ26<6,BJ26>=9.5)),AND(BE26=3,ISNUMBER(BJ26),OR(BJ26<6,BJ26>9)),AND(BE26=4,ISNUMBER(BJ26),OR(BJ26<6,BJ26>10))),\"NA\",IF(AND(ISNUMBER($BP$12),BE26<>0,ISNUMBER(BI26),ISNUMBER(BJ26)),CT_Virus(BE26,$BP$12,BI26,BJ26),IF(COUNTIF(BE26,\"<>0\")+COUNT(BF26,BG26,BI26,BJ26)=5,\"!error\",\"missing\")))))))","v":"missing"},{"$f":"IF(BD26=\"\",\"\",IF(OR(AY26=0,AND(ISNUMBER($BP$12),$BP$12=0)),\"NA\",IF(CW26=\"ND\",\"ND\",IF(OR(BK26=\"!error\",BO26=\"!error\",BQ26=\"!error\"),\"!error\",IF(BD26=\"NA\",\"NA\",IF(BO26=\"NA\",0,IF(AND(BE26<>99,ISNUMBER(BK26),ISNUMBER(BO26)),BK26/BO26,IF(AND(BE26=99,BQ26=1),BQ26/$BP$12,\"missing\"))))))))","v":"missing"},{"$f":"IF(BD26=\"\",\"\",IF(AY26=0,\"NA\",IF(CW26=\"ND\",\"ND\",IF(OR(BD26=\"!error\",AND(BD26=\"missing\",ISNUMBER(BF26)),BF26=\"!error\",BH26=\"!error\",BI26=\"!error\",BJ26=\"!error\"),\"!error\",IF(BD26=\"NA\",\"NA\",IF(OR(AND(BE26<>0,ISNUMBER(BK26),BK26=0),AND(BE26=1,ISNUMBER(BJ26),BJ26>=10.5),AND(BE26=2,ISNUMBER(BJ26),OR(BJ26<6,BJ26>=9.5)),AND(BE26=3,ISNUMBER(BJ26),OR(BJ26<6,BJ26>9)),AND(BE26=4,ISNUMBER(BJ26),OR(BJ26<6,BJ26>10))),0,IF(AND(ISNUMBER($BP$12),BE26<>0,ISNUMBER(BF26),ISNUMBER(BH26),ISNUMBER(BI26),ISNUMBER(BJ26)),Log_Virus(BE26,$BP$12,BI26,BJ26,BF26,BH26),IF(COUNTIF(BE26,\"<>0\")+COUNT(BF26,BG26,BI26,BJ26)=5,\"!error\",\"missing\"))))))))","v":"missing"},{"$f":"IF($BK$14=0,0,IF(COUNTIF(OFFSET($BD24,0,0,MIN($BK$14,5),1),\"<>NA\")+IF($BK$14>5,COUNTIF(OFFSET($BV24,0,0,$BK$14-5,1),\"<>NA\"),0),1,0))","v":1},{"$f":"IF($BK$14=0,0,IF(COUNTIF(OFFSET($BD24,0,0,MIN($BK$14,5),1),\"O3\")+COUNTIF(OFFSET($BD24,0,0,MIN($BK$14,5),1),\"O3 Cell 1\")+IF($BK$14>5,COUNTIF(OFFSET($BV24,0,0,$BK$14-5,1),\"O3\"),0)+IF($BK$14>5,COUNTIF(OFFSET($BV24,0,0,$BK$14-5,1),\"O3 Cell 1\"),0),1,0))","v":0},{"$f":"IF(OR($AY26=0,AND(COUNTA(D48,F48:G48)=0,COUNTIF(E48,0))),\"NA\",IF(COUNTA(D48:G48),IF(BS26,4,5),IF($BK$15=1,IF(BS26,4,IF(BR26,5,6)),IF(BV26=\"!error\",IF(BS26,4,5),IF(BS26,\"5B\",6)))))","v":6},{"$f":"$BK$11","v":8},{"$f":"IF(AND(IF($BN$4=\"missing\",10,$BN$4)>=8,$AY26<>\"\"),IF(OR($AY26=0,AND($B48=\"NA\",COUNTA($D48,$F48:$G48)=0,COUNTIF($E48,0)),AND($B48=\"NA\",COUNTA($D48:$G48)=0,IF($BK$14=0,0,COUNTIF(OFFSET($BD24,0,0,MIN($BK$14,5),1),\"NA\")+IF($BK$14>5,COUNTIF(OFFSET($BV24,0,0,$BK$14-5,1),\"NA\"),0))=$BK$14),AND($B48=\"NA\",COUNTA($D48:$G48)=0,IF($BK$14<5,COUNTA(OFFSET($D24,$BK$14,0,MIN(5-$BK$14,$BK$15),4))-COUNTIF(OFFSET($E24,$BK$14,0,MIN(5-$BK$14,$BK$15),1),0),0)+IF($BK$14+$BK$15>5,COUNTA(OFFSET($D46,MAX($BK$14-5,0),0,MIN($BK$14+$BK$15-5,$BK$15),4))-COUNTIF(OFFSET($E46,MAX($BK$14-5,0),0,MIN($BK$14+$BK$15-5,$BK$15),1),0),0)),AND($B48=\"NA\",COUNTA($D48:$G48)=0,IF($BK$14<5,COUNTIF(OFFSET($B24,$BK$14,0,MIN(5-$BK$14,$BK$15),1),\"NA\"),0)+IF($BK$14+$BK$15>5,COUNTIF(OFFSET($B46,MAX($BK$14-5,0),0,MIN($BK$14+$BK$15-5,$BK$15),1),\"NA\"),0)<>$BK$15)),\"NA\",IF($B48=\"\",\"missing\",IF(AND($B48<>\"NA\",COUNTA($D48,$F48:$G48)+COUNTIF($E48,\"<>0\")),UPPER($B48),\"!error\"))),\"\")","v":""},"",{"$f":"IF(BV26=\"\",\"\",IF(BV26=\"NA\",\"NA\",IF(ISBLANK($D48),\"missing\",IF(AND(BW26=1,ISNUMBER($D48),$D48>4),4,IF(AND(ISNUMBER($D48),$D48>=0),$D48,IF(AND(ISTEXT($D48),$D48=\"ND\"),\"ND\",\"!error\"))))))","v":""},{"$f":"IF(BV26=\"\",\"\",IF(BV26=\"NA\",\"NA\",IF(ISBLANK($E48),\"missing\",IF(OR(AND(ISBLANK($B48),COUNT(BX26,CA26:CB26)=0,ISNUMBER($E48),$E48=0),AND(ISNUMBER($E48),$E48>0),AND(ISTEXT($E48),$E48=\"ND\")),$E48,\"!error\"))))","v":""},{"$f":"IF(BV26=\"\",\"\",IF(AY26=0,\"NA\",IF(OR($BK$12=\"!error\",$BK$13=\"!error\",BY26=\"!error\"),\"!error\",IF(BV26=\"NA\",\"NA\",IF(AND(ISNUMBER(BY26),BY26=0),0,IF(AND(ISNUMBER($BK$12),ISNUMBER($BK$13),ISNUMBER(BY26)),$BK$13*$BK$12/BY26,IF(BY26=\"ND\",\"ND\",\"missing\")))))))","v":""},{"$f":"IF(BV26=\"\",\"\",IF(BV26=\"NA\",\"NA\",IF(ISBLANK($F48),\"missing\",IF(OR(ISNUMBER($F48),$F48=\"ND\"),$F48,\"!error\"))))","v":""},{"$f":"IF(BV26=\"\",\"\",IF(BV26=\"NA\",\"NA\",IF(ISBLANK($G48),\"missing\",IF(OR(AND(ISNUMBER($G48),$G48>=0,$G48<=14),$G48=\"ND\"),$G48,\"!error\"))))","v":""},"",{"$f":"IF(BV26=\"\",\"\",IF(AY26=0,\"NA\",IF(CX26=\"ND\",\"ND\",IF(OR($BN$12=\"!error\",BV26=\"!error\",AND(BV26=\"missing\",ISNUMBER(BX26)),IF(BW26=1,BX26=\"!error\",0),CA26=\"!error\",CB26=\"!error\"),\"!error\",IF(OR(BV26=\"NA\",AND(ISNUMBER($BN$12),$BN$12=0),AND(BW26<>0,ISNUMBER(CC26),CC26=0),AND(BW26=1,ISNUMBER(CB26),CB26>9),AND(BW26>1,ISNUMBER(CB26),OR(CB26<6,CB26>=9.5))),\"NA\",IF(AND(ISNUMBER($BN$12),BW26<>0,IF(BW26=1,ISNUMBER(BX26),1),ISNUMBER(CA26),ISNUMBER(CB26)),CT_Giardia(BW26,$BN$12,CA26,CB26,IF(BW26=1,BX26,)),IF(COUNTIF(BW26,\"<>0\")+COUNT(BX26,BY26,CA26,CB26)=5,\"!error\",\"missing\")))))))","v":""},{"$f":"IF(BV26=\"\",\"\",IF(OR(AY26=0,AND(ISNUMBER($BN$12),$BN$12=0)),\"NA\",IF(CX26=\"ND\",\"ND\",IF(OR(CC26=\"!error\",CD26=\"!error\",CF26=\"!error\"),\"!error\",IF(BV26=\"NA\",\"NA\",IF(CD26=\"NA\",0,IF(AND(ISNUMBER(CC26),ISNUMBER(CD26)),CC26/CD26,IF(AND(BW26=99,CF26=0.5),CF26/$BN$12,\"missing\"))))))))","v":""},{"$f":"IF(BV26=\"\",\"\",IF(AY26=0,\"NA\",IF(CX26=\"ND\",\"ND\",IF(OR(BV26=\"!error\",AND(BV26=\"missing\",ISNUMBER(BX26)),BX26=\"!error\",BZ26=\"!error\",CA26=\"!error\",CB26=\"!error\"),\"!error\",IF(BV26=\"NA\",\"NA\",IF(OR(AND(BW26<>0,ISNUMBER(CC26),CC26=0),AND(BW26=1,ISNUMBER(CB26),CB26>9),AND(BW26>1,ISNUMBER(CB26),OR(CB26<6,CB26>=9.5))),0,IF(AND(ISNUMBER($BN$12),BW26<>0,ISNUMBER(BX26),ISNUMBER(BZ26),ISNUMBER(CA26),ISNUMBER(CB26)),log_Giardia(BW26,$BN$12,CA26,CB26,BX26,BZ26),IF(COUNTIF(BW26,\"<>0\")+COUNT(BX26,BY26,CA26,CB26)=5,\"!error\",\"missing\"))))))))","v":""},{"$f":"IF(BV26=\"\",\"\",IF(AY26=0,\"NA\",IF(CX26=\"ND\",\"ND\",IF(OR($BP$12=\"!error\",BV26=\"!error\",AND(BV26=\"missing\",ISNUMBER(BX26)),CA26=\"!error\",CB26=\"!error\"),\"!error\",IF(OR(BV26=\"NA\",AND(ISNUMBER($BP$12),$BP$12=0),AND(BW26<>0,ISNUMBER(CC26),CC26=0),AND(BW26=1,ISNUMBER(CB26),OR(CB26<5.5,CB26>=10.5)),AND(OR(BW26=2,BW26=4),ISNUMBER(CB26),OR(CB26<6,CB26>=9.5)),AND(BW26=3,ISNUMBER(CB26),OR(CB26<6,CB26>9))),\"NA\",IF(AND(ISNUMBER($BP$12),BW26<>0,ISNUMBER(CA26),ISNUMBER(CB26)),CT_Virus(BW26,$BP$12,CA26,CB26),IF(COUNTIF(BW26,\"<>0\")+COUNT(BX26,BY26,CA26,CB26)=5,\"!error\",\"missing\")))))))","v":""},{"$f":"IF(BV26=\"\",\"\",IF(OR(AY26=0,AND(ISNUMBER($BP$12),$BP$12=0)),\"NA\",IF(CX26=\"ND\",\"ND\",IF(OR(CC26=\"!error\",CG26=\"!error\",CI26=\"!error\"),\"!error\",IF(BV26=\"NA\",\"NA\",IF(CG26=\"NA\",0,IF(AND(ISNUMBER(CC26),ISNUMBER(CG26)),CC26/CG26,IF(AND(BW26=99,CI26=1),CI26/$BP$12,\"missing\"))))))))","v":""},{"$f":"IF(BV26=\"\",\"\",IF(AY26=0,\"NA\",IF(CX26=\"ND\",\"ND\",IF(OR(BV26=\"!error\",AND(BV26=\"missing\",ISNUMBER(BX26)),BX26=\"!error\",BZ26=\"!error\",CA26=\"!error\",CB26=\"!error\"),\"!error\",IF(BV26=\"NA\",\"NA\",IF(OR(AND(BW26<>0,ISNUMBER(CC26),CC26=0),AND(BW26=1,ISNUMBER(CB26),OR(CB26<5.5,CB26>=10.5)),AND(OR(BW26=2,BW26=4),ISNUMBER(CB26),OR(CB26<6,CB26>=9.5)),AND(BW26=3,ISNUMBER(CB26),OR(CB26<6,CB26>9))),0,IF(AND(ISNUMBER($BP$12),BW26<>0,ISNUMBER(BX26),ISNUMBER(BZ26),ISNUMBER(CA26),ISNUMBER(CB26)),Log_Virus(BW26,$BP$12,CA26,CB26,BX26,BZ26),IF(COUNTIF(BW26,\"<>0\")+COUNT(BX26,BY26,CA26,CB26)=5,\"!error\",\"missing\"))))))))","v":""}]
["","",{"$f":"H15","v":4},null,null,null,null,{"$f":"IF(BL27=\"!error\",\"!error\",$BK27)","v":""},"","","","",null,null,{"$f":"$CU24","v":""},null,null,null,{"$f":"IF(B27=\"\",\"\",IF(B27=\"FCL\",1,IF(B27=\"CLO2\",2,IF(B27=\"O3\",3,IF(B27=\"CLA\",4,IF(B27=\"O3 cell 1\",99,0))))))","v":""},{"$f":"IF('T10 Details'!H963=\"\",\"\",IF('T10 Details'!H963=\"Free Chlorine\",\"FCL\",IF('T10 Details'!H963=\"Chlorine Dioxide\",\"CLO2\",IF('T10 Details'!H963=\"Ozone cell 1\",\"O3 cell 1\",IF('T10 Details'!H963=\"Ozone (any cell)\",\"O3\",IF('T10 Details'!H963=\"Chloramines\",\"CLA\"))))))","v":""},{"$f":"IF('T10 Details'!E963=\"\",\"\",IF('T10 Details'!E963=\"Free Chlorine\",\"FCL\",IF('T10 Details'!E963=\"Chlorine Dioxide\",\"CLO2\",IF('T10 Details'!E963=\"Ozone (Cell 1)\",\"O3 (Cell 1)\",IF('T10 Details'!E963=\"Ozone (Any Cell)\",\"O3\",IF('T10 Details'!E963=\"Chloramines\",\"CLA\"))))))","v":""},null,null,null,null,null,null,null,null,null,null,null,null,null,null,null,null,null,null,null,null,null,null,null,null,null,null,null,null,null,1,{"$f":"IF($BG$14=0,0,IF(COUNTIF(OFFSET($BD24,0,0,MIN($BG$14,5),1),\"<>NA\")+IF($BG$14>5,COUNTIF(OFFSET($BV24,0,0,$BG$14-5,1),\"<>NA\"),0),1,0))","v":1},{"$f":"IF($BG$14=0,0,IF(COUNTIF(OFFSET($BD24,0,0,MIN($BG$14,5),1),\"O3\")+COUNTIF(OFFSET($BD24,0,0,MIN($BG$14,5),1),\"O3 Cell 1\")+IF($BG$14>5,COUNTIF(OFFSET($BV24,0,0,$BG$14-5,1),\"O3\"),0)+IF($BG$14>5,COUNTIF(OFFSET($BV24,0,0,$BG$14-5,1),\"O3 Cell 1\"),0),1,0))","v":0},{"$f":"IF(OR($AY27=0,AND(COUNTA(D27,F27:G27)=0,COUNTIF(E27,0))),\"NA\",IF(COUNTA(D27:G27),IF(BA27,4,5),IF($BG$15=1,IF(BA27,4,IF(AZ27,5,6)),IF(BD27=\"!error\",IF(BA27,4,5),IF(BA27,\"5B\",6)))))","v":6},{"$f":"$BG$11","v":4},{"$f":"IF(AND(IF($BN$4=\"missing\",10,$BN$4)>=4,$AY27<>\"\"),IF(OR($AY27=0,AND($B27=\"NA\",COUNTA($D27,$F27:$G27)=0,COUNTIF($E27,0)),AND($B27=\"NA\",COUNTA($D27:$G27)=0,IF($BG$14=0,0,COUNTIF(OFFSET($BD24,0,0,MIN($BG$14,5),1),\"NA\")+IF($BG$14>5,COUNTIF(OFFSET($BV24,0,0,$BG$14-5,1),\"NA\"),0))=$BG$14),AND($B27=\"NA\",COUNTA($D27:$G27)=0,IF($BG$14<5,COUNTA(OFFSET($D24,$BG$14,0,MIN(5-$BG$14,$BG$15),4))-COUNTIF(OFFSET($E24,$BG$14,0,MIN(5-$BG$14,$BG$15),1),0),0)+IF($BG$14+$BG$15>5,COUNTA(OFFSET($D46,MAX($BG$14-5,0),0,MIN($BG$14+$BG$15-5,$BG$15),4))-COUNTIF(OFFSET($E46,MAX($BG$14-5,0),0,MIN($BG$14+$BG$15-5,$BG$15),1),0),0)),AND($B27=\"NA\",COUNTA($D27:$G27)=0,IF($BG$14<5,COUNTIF(OFFSET($B24,$BG$14,0,MIN(5-$BG$14,$BG$15),1),\"NA\"),0)+IF($BG$14+$BG$15>5,COUNTIF(OFFSET($B46,MAX($BG$14-5,0),0,MIN($BG$14+$BG$15-5,$BG$15),1),\"NA\"),0)<>$BG$15)),\"NA\",IF($B27=\"\",\"missing\",IF(AND($B27<>\"NA\",COUNTA($D27,$F27:$G27)+COUNTIF($E27,\"<>0\")),UPPER($B27),\"!error\"))),\"\")","v":""},"","","",{"$f":"IF(BD27=\"\",\"\",IF(AY27=0,\"NA\",IF(OR($BG$12=\"!error\",$BG$13=\"!error\",BG27=\"!error\"),\"!error\",IF(BD27=\"NA\",\"NA\",IF(AND(ISNUMBER(BG27),BG27=0),0,IF(AND(ISNUMBER($BG$12),ISNUMBER($BG$13),ISNUMBER(BG27)),$BG$13*$BG$12/BG27,IF(BG27=\"ND\",\"ND\",\"missing\")))))))","v":""},"","","",{"$f":"IF(BD27=\"\",\"\",IF(AY27=0,\"NA\",IF(CW27=\"ND\",\"ND\",IF(OR($BN$12=\"!error\",BD27=\"!error\",AND(BD27=\"missing\",ISNUMBER(BF27)),IF(BE27=1,BF27=\"!error\",0),BI27=\"!error\",BJ27=\"!error\"),\"!error\",IF(OR(BD27=\"NA\",AND(ISNUMBER($BN$12),$BN$12=0),AND(BE27<>0,ISNUMBER(BK27),BK27=0),AND(BE27=1,ISNUMBER(BJ27),BJ27>9),AND(BE27=2,ISNUMBER(BJ27),OR(BJ27<6,BJ27>=9.5)),AND(OR(BE27=3,BE27=4),ISNUMBER(BJ27),OR(BJ27<5.5,BJ27>=9.5))),\"NA\",IF(AND(ISNUMBER($BN$12),BE27<>0,IF(BE27=1,ISNUMBER(BF27),1),ISNUMBER(BI27),ISNUMBER(BJ27)),CT_Giardia(BE27,$BN$12,BI27,BJ27,IF(BE27=1,BF27,)),IF(COUNTIF(BE27,\"<>0\")+COUNT(BF27,BG27,BI27,BJ27)=5,\"!error\",\"missing\")))))))","v":""},{"$f":"IF(BD27=\"\",\"\",IF(OR(AY27=0,AND(ISNUMBER($BN$12),$BN$12=0)),\"NA\",IF(CW27=\"ND\",\"ND\",IF(OR(BK27=\"!error\",BL27=\"!error\",BN27=\"!error\"),\"!error\",IF(BD27=\"NA\",\"NA\",IF(BL27=\"NA\",0,IF(AND(BE27<>99,ISNUMBER(BK27),ISNUMBER(BL27)),BK27/BL27,IF(AND(BE27=99,BN27=0.5),BN27/$BN$12,\"missing\"))))))))","v":""},{"$f":"IF(BD27=\"\",\"\",IF(AY27=0,\"NA\",IF(CW27=\"ND\",\"ND\",IF(OR(BD27=\"!error\",AND(BD27=\"missing\",ISNUMBER(BF27)),BF27=\"!error\",BH27=\"!error\",BI27=\"!error\",BJ27=\"!error\"),\"!error\",IF(BD27=\"NA\",\"NA\",IF(OR(AND(BE27<>0,ISNUMBER(BK27),BK27=0),AND(BE27=1,ISNUMBER(BJ27),BJ27>9),AND(BE27=2,ISNUMBER(BJ27),OR(BJ27<6,BJ27>=9.5)),AND(OR(BE27=3,BE27=4),ISNUMBER(BJ27),OR(BJ27<5.5,BJ27>=9.5))),0,IF(AND(ISNUMBER($BN$12),BE27<>0,ISNUMBER(BF27),ISNUMBER(BH27),ISNUMBER(BI27),ISNUMBER(BJ27)),log_Giardia(BE27,$BN$12,BI27,BJ27,BF27,BH27),IF(COUNTIF(BE27,\"<>0\")+COUNT(BF27,BG27,BI27,BJ27)=5,\"!error\",\"missing\"))))))))","v":""},{"$f":"IF(BD27=\"\",\"\",IF(AY27=0,\"NA\",IF(CW27=\"ND\",\"ND\",IF(OR($BP$12=\"!error\",BD27=\"!error\",AND(BD27=\"missing\",ISNUMBER(BF27)),BI27=\"!error\",BJ27=\"!error\"),\"!error\",IF(OR(BD27=\"NA\",AND(ISNUMBER($BP$12),$BP$12=0),AND(BE27<>0,ISNUMBER(BK27),BK27=0),AND(BE27=1,ISNUMBER(BJ27),BJ27>=10.5),AND(BE27=2,ISNUMBER(BJ27),OR(BJ27<6,BJ27>=9.5)),AND(BE27=3,ISNUMBER(BJ27),OR(BJ27<6,BJ27>9)),AND(BE27=4,ISNUMBER(BJ27),OR(BJ27<6,BJ27>10))),\"NA\",IF(AND(ISNUMBER($BP$12),BE27<>0,ISNUMBER(BI27),ISNUMBER(BJ27)),CT_Virus(BE27,$BP$12,BI27,BJ27),IF(COUNTIF(BE27,\"<>0\")+COUNT(BF27,BG27,BI27,BJ27)=5,\"!error\",\"missing\")))))))","v":""},{"$f":"IF(BD27=\"\",\"\",IF(OR(AY27=0,AND(ISNUMBER($BP$12),$BP$12=0)),\"NA\",IF(CW27=\"ND\",\"ND\",IF(OR(BK27=\"!error\",BO27=\"!error\",BQ27=\"!error\"),\"!error\",IF(BD27=\"NA\",\"NA\",IF(BO27=\"NA\",0,IF(AND(BE27<>99,ISNUMBER(BK27),ISNUMBER(BO27)),BK27/BO27,IF(AND(BE27=99,BQ27=1),BQ27/$BP$12,\"missing\"))))))))","v":""},{"$f":"IF(BD27=\"\",\"\",IF(AY27=0,\"NA\",IF(CW27=\"ND\",\"ND\",IF(OR(BD27=\"!error\",AND(BD27=\"missing\",ISNUMBER(BF27)),BF27=\"!error\",BH27=\"!error\",BI27=\"!error\",BJ27=\"!error\"),\"!error\",IF(BD27=\"NA\",\"NA\",IF(OR(AND(BE27<>0,ISNUMBER(BK27),BK27=0),AND(BE27=1,ISNUMBER(BJ27),BJ27>=10.5),AND(BE27=2,ISNUMBER(BJ27),OR(BJ27<6,BJ27>=9.5)),AND(BE27=3,ISNUMBER(BJ27),OR(BJ27<6,BJ27>9)),AND(BE27=4,ISNUMBER(BJ27),OR(BJ27<6,BJ27>10))),0,IF(AND(ISNUMBER($BP$12),BE27<>0,ISNUMBER(BF27),ISNUMBER(BH27),ISNUMBER(BI27),ISNUMBER(BJ27)),Log_Virus(BE27,$BP$12,BI27,BJ27,BF27,BH27),IF(COUNTIF(BE27,\"<>0\")+COUNT(BF27,BG27,BI27,BJ27)=5,\"!error\",\"missing\"))))))))","v":""},{"$f":"IF($BL$14=0,0,IF(COUNTIF(OFFSET($BD24,0,0,MIN($BL$14,5),1),\"<>NA\")+IF($BL$14>5,COUNTIF(OFFSET($BV24,0,0,$BL$14-5,1),\"<>NA\"),0),1,0))","v":1},{"$f":"IF($BL$14=0,0,IF(COUNTIF(OFFSET($BD24,0,0,MIN($BL$14,5),1),\"O3\")+COUNTIF(OFFSET($BD24,0,0,MIN($BL$14,5),1),\"O3 Cell 1\")+IF($BL$14>5,COUNTIF(OFFSET($BV24,0,0,$BL$14-5,1),\"O3\"),0)+IF($BL$14>5,COUNTIF(OFFSET($BV24,0,0,$BL$14-5,1),\"O3 Cell 1\"),0),1,0))","v":0},{"$f":"IF(OR($AY27=0,AND(COUNTA(D49,F49:G49)=0,COUNTIF(E49,0))),\"NA\",IF(COUNTA(D49:G49),IF(BS27,4,5),IF($BL$15=1,IF(BS27,4,IF(BR27,5,6)),IF(BV27=\"!error\",IF(BS27,4,5),IF(BS27,\"5B\",6)))))","v":6},{"$f":"$BL$11","v":9},{"$f":"IF(AND(IF($BN$4=\"missing\",10,$BN$4)>=9,$AY27<>\"\"),IF(OR($AY27=0,AND($B49=\"NA\",COUNTA($D49,$F49:$G49)=0,COUNTIF($E49,0)),AND($B49=\"NA\",COUNTA($D49:$G49)=0,IF($BL$14=0,0,COUNTIF(OFFSET($BD24,0,0,MIN($BL$14,5),1),\"NA\")+IF($BL$14>5,COUNTIF(OFFSET($BV24,0,0,$BL$14-5,1),\"NA\"),0))=$BL$14),AND($B49=\"NA\",COUNTA($D49:$G49)=0,IF($BL$14<5,COUNTA(OFFSET($D24,$BL$14,0,MIN(5-$BL$14,$BL$15),4))-COUNTIF(OFFSET($E24,$BL$14,0,MIN(5-$BL$14,$BL$15),1),0),0)+IF($BL$14+$BL$15>5,COUNTA(OFFSET($D46,MAX($BL$14-5,0),0,MIN($BL$14+$BL$15-5,$BL$15),4))-COUNTIF(OFFSET($E46,MAX($BL$14-5,0),0,MIN($BL$14+$BL$15-5,$BL$15),1),0),0)),AND($B49=\"NA\",COUNTA($D49:$G49)=0,IF($BL$14<5,COUNTIF(OFFSET($B24,$BL$14,0,MIN(5-$BL$14,$BL$15),1),\"NA\"),0)+IF($BL$14+$BL$15>5,COUNTIF(OFFSET($B46,MAX($BL$14-5,0),0,MIN($BL$14+$BL$15-5,$BL$15),1),\"NA\"),0)<>$BL$15)),\"NA\",IF($B49=\"\",\"missing\",IF(AND($B49<>\"NA\",COUNTA($D49,$F49:$G49)+COUNTIF($E49,\"<>0\")),UPPER($B49),\"!error\"))),\"\")","v":""},"",{"$f":"IF(BV27=\"\",\"\",IF(BV27=\"NA\",\"NA\",IF(ISBLANK($D49),\"missing\",IF(AND(BW27=1,ISNUMBER($D49),$D49>4),4,IF(AND(ISNUMBER($D49),$D49>=0),$D49,IF(AND(ISTEXT($D49),$D49=\"ND\"),\"ND\",\"!error\"))))))","v":""},{"$f":"IF(BV27=\"\",\"\",IF(BV27=\"NA\",\"NA\",IF(ISBLANK($E49),\"missing\",IF(OR(AND(ISBLANK($B49),COUNT(BX27,CA27:CB27)=0,ISNUMBER($E49),$E49=0),AND(ISNUMBER($E49),$E49>0),AND(ISTEXT($E49),$E49=\"ND\")),$E49,\"!error\"))))","v":""},{"$f":"IF(BV27=\"\",\"\",IF(AY27=0,\"NA\",IF(OR($BL$12=\"!error\",$BL$13=\"!error\",BY27=\"!error\"),\"!error\",IF(BV27=\"NA\",\"NA\",IF(AND(ISNUMBER(BY27),BY27=0),0,IF(AND(ISNUMBER($BL$12),ISNUMBER($BL$13),ISNUMBER(BY27)),$BL$13*$BL$12/BY27,IF(BY27=\"ND\",\"ND\",\"missing\")))))))","v":""},{"$f":"IF(BV27=\"\",\"\",IF(BV27=\"NA\",\"NA\",IF(ISBLANK($F49),\"missing\",IF(OR(ISNUMBER($F49),$F49=\"ND\"),$F49,\"!error\"))))","v":""},{"$f":"IF(BV27=\"\",\"\",IF(BV27=\"NA\",\"NA\",IF(ISBLANK($G49),\"missing\",IF(OR(AND(ISNUMBER($G49),$G49>=0,$G49<=14),$G49=\"ND\"),$G49,\"!error\"))))","v":""},"",{"$f":"IF(BV27=\"\",\"\",IF(AY27=0,\"NA\",IF(CX27=\"ND\",\"ND\",IF(OR($BN$12=\"!error\",BV27=\"!error\",AND(BV27=\"missing\",ISNUMBER(BX27)),IF(BW27=1,BX27=\"!error\",0),CA27=\"!error\",CB27=\"!error\"),\"!error\",IF(OR(BV27=\"NA\",AND(ISNUMBER($BN$12),$BN$12=0),AND(BW27<>0,ISNUMBER(CC27),CC27=0),AND(BW27=1,ISNUMBER(CB27),CB27>9),AND(BW27>1,ISNUMBER(CB27),OR(CB27<6,CB27>=9.5))),\"NA\",IF(AND(ISNUMBER($BN$12),BW27<>0,IF(BW27=1,ISNUMBER(BX27),1),ISNUMBER(CA27),ISNUMBER(CB27)),CT_Giardia(BW27,$BN$12,CA27,CB27,IF(BW27=1,BX27,)),IF(COUNTIF(BW27,\"<>0\")+COUNT(BX27,BY27,CA27,CB27)=5,\"!error\",\"missing\")))))))","v":""},{"$f":"IF(BV27=\"\",\"\",IF(OR(AY27=0,AND(ISNUMBER($BN$12),$BN$12=0)),\"NA\",IF(CX27=\"ND\",\"ND\",IF(OR(CC27=\"!error\",CD27=\"!error\",CF27=\"!error\"),\"!error\",IF(BV27=\"NA\",\"NA\",IF(CD27=\"NA\",0,IF(AND(ISNUMBER(CC27),ISNUMBER(CD27)),CC27/CD27,IF(AND(BW27=99,CF27=0.5),CF27/$BN$12,\"missing\"))))))))","v":""},{"$f":"IF(BV27=\"\",\"\",IF(AY27=0,\"NA\",IF(CX27=\"ND\",\"ND\",IF(OR(BV27=\"!error\",AND(BV27=\"missing\",ISNUMBER(BX27)),BX27=\"!error\",BZ27=\"!error\",CA27=\"!error\",CB27=\"!error\"),\"!error\",IF(BV27=\"NA\",\"NA\",IF(OR(AND(BW27<>0,ISNUMBER(CC27),CC27=0),AND(BW27=1,ISNUMBER(CB27),CB27>9),AND(BW27>1,ISNUMBER(CB27),OR(CB27<6,CB27>=9.5))),0,IF(AND(ISNUMBER($BN$12),BW27<>0,ISNUMBER(BX27),ISNUMBER(BZ27),ISNUMBER(CA27),ISNUMBER(CB27)),log_Giardia(BW27,$BN$12,CA27,CB27,BX27,BZ27),IF(COUNTIF(BW27,\"<>0\")+COUNT(BX27,BY27,CA27,CB27)=5,\"!error\",\"missing\"))))))))","v":""},{"$f":"IF(BV27=\"\",\"\",IF(AY27=0,\"NA\",IF(CX27=\"ND\",\"ND\",IF(OR($BP$12=\"!error\",BV27=\"!error\",AND(BV27=\"missing\",ISNUMBER(BX27)),CA27=\"!error\",CB27=\"!error\"),\"!error\",IF(OR(BV27=\"NA\",AND(ISNUMBER($BP$12),$BP$12=0),AND(BW27<>0,ISNUMBER(CC27),CC27=0),AND(BW27=1,ISNUMBER(CB27),OR(CB27<5.5,CB27>=10.5)),AND(OR(BW27=2,BW27=4),ISNUMBER(CB27),OR(CB27<6,CB27>=9.5)),AND(BW27=3,ISNUMBER(CB27),OR(CB27<6,CB27>9))),\"NA\",IF(AND(ISNUMBER($BP$12),BW27<>0,ISNUMBER(CA27),ISNUMBER(CB27)),CT_Virus(BW27,$BP$12,CA27,CB27),IF(COUNTIF(BW27,\"<>0\")+COUNT(BX27,BY27,CA27,CB27)=5,\"!error\",\"missing\")))))))","v":""},{"$f":"IF(BV27=\"\",\"\",IF(OR(AY27=0,AND(ISNUMBER($BP$12),$BP$12=0)),\"NA\",IF(CX27=\"ND\",\"ND\",IF(OR(CC27=\"!error\",CG27=\"!error\",CI27=\"!error\"),\"!error\",IF(BV27=\"NA\",\"NA\",IF(CG27=\"NA\",0,IF(AND(ISNUMBER(CC27),ISNUMBER(CG27)),CC27/CG27,IF(AND(BW27=99,CI27=1),CI27/$BP$12,\"missing\"))))))))","v":""},{"$f":"IF(BV27=\"\",\"\",IF(AY27=0,\"NA\",IF(CX27=\"ND\",\"ND\",IF(OR(BV27=\"!error\",AND(BV27=\"missing\",ISNUMBER(BX27)),BX27=\"!error\",BZ27=\"!error\",CA27=\"!error\",CB27=\"!error\"),\"!error\",IF(BV27=\"NA\",\"NA\",IF(OR(AND(BW27<>0,ISNUMBER(CC27),CC27=0),AND(BW27=1,ISNUMBER(CB27),OR(CB27<5.5,CB27>=10.5)),AND(OR(BW27=2,BW27=4),ISNUMBER(CB27),OR(CB27<6,CB27>=9.5)),AND(BW27=3,ISNUMBER(CB27),OR(CB27<6,CB27>9))),0,IF(AND(ISNUMBER($BP$12),BW27<>0,ISNUMBER(BX27),ISNUMBER(BZ27),ISNUMBER(CA27),ISNUMBER(CB27)),Log_Virus(BW27,$BP$12,CA27,CB27,BX27,BZ27),IF(COUNTIF(BW27,\"<>0\")+COUNT(BX27,BY27,CA27,CB27)=5,\"!error\",\"missing\"))))))))","v":""}]
["","",{"$f":"I15","v":5},null,null,null,null,"","","","","",null,null,null,null,null,null,{"$f":"IF(B28=\"\",\"\",IF(B28=\"FCL\",1,IF(B28=\"CLO2\",2,IF(B28=\"O3\",3,IF(B28=\"CLA\",4,IF(B28=\"O3 cell 1\",99,0))))))","v":""},{"$f":"IF('T10 Details'!H1279=\"\",\"\",IF('T10 Details'!H1279=\"Free Chlorine\",\"FCL\",IF('T10 Details'!H1279=\"Chlorine Dioxide\",\"CLO2\",IF('T10 Details'!H1279=\"Ozone cell 1\",\"O3 cell 1\",IF('T10 Details'!H1279=\"Ozone (any cell)\",\"O3\",IF('T10 Details'!H1279=\"Chloramines\",\"CLA\"))))))","v":""},{"$f":"IF('T10 Details'!E1279=\"\",\"\",IF('T10 Details'!E1279=\"Free Chlorine\",\"FCL\",IF('T10 Details'!E1279=\"Chlorine Dioxide\",\"CLO2\",IF('T10 Details'!E1279=\"Ozone (Cell 1)\",\"O3 (Cell 1)\",IF('T10 Details'!E1279=\"Ozone (Any Cell)\",\"O3\",IF('T10 Details'!E1279=\"Chloramines\",\"CLA\"))))))","v":""},null,null,null,null,null,null,null,null,null,null,null,null,null,null,null,null,null,null,null,null,null,null,null,null,null,null,null,null,null,1,{"$f":"IF($BH$14=0,0,IF(COUNTIF(OFFSET($BD24,0,0,MIN($BH$14,5),1),\"<>NA\")+IF($BH$14>5,COUNTIF(OFFSET($BV24,0,0,$BH$14-5,1),\"<>NA\"),0),1,0))","v":1},{"$f":"IF($BH$14=0,0,IF(COUNTIF(OFFSET($BD24,0,0,MIN($BH$14,5),1),\"O3\")+COUNTIF(OFFSET($BD24,0,0,MIN($BH$14,5),1),\"O3 Cell 1\")+IF($BH$14>5,COUNTIF(OFFSET($BV24,0,0,$BH$14-5,1),\"O3\"),0)+IF($BH$14>5,COUNTIF(OFFSET($BV24,0,0,$BH$14-5,1),\"O3 Cell 1\"),0),1,0))","v":0},{"$f":"IF(OR($AY28=0,AND(COUNTA(D28,F28:G28)=0,COUNTIF(E28,0))),\"NA\",IF(COUNTA(D28:G28),IF(BA28,4,5),IF($BH$15=1,IF(BA28,4,IF(AZ28,5,6)),IF(BD28=\"!error\",IF(BA28,4,5),IF(BA28,\"5B\",6)))))","v":6},{"$f":"$BH$11","v":5},{"$f":"IF(AND(IF($BN$4=\"missing\",10,$BN$4)>=5,$AY28<>\"\"),IF(OR($AY28=0,AND($B28=\"NA\",COUNTA($D28,$F28:$G28)=0,COUNTIF($E28,0)),AND($B28=\"NA\",COUNTA($D28:$G28)=0,IF($BH$14=0,0,COUNTIF(OFFSET($BD24,0,0,MIN($BH$14,5),1),\"NA\")+IF($BH$14>5,COUNTIF(OFFSET($BV24,0,0,$BH$14-5,1),\"NA\"),0))=$BH$14),AND($B28=\"NA\",COUNTA($D28:$G28)=0,IF($BH$14<5,COUNTA(OFFSET($D24,$BH$14,0,MIN(5-$BH$14,$BH$15),4))-COUNTIF(OFFSET($E24,$BH$14,0,MIN(5-$BH$14,$BH$15),1),0),0)+IF($BH$14+$BH$15>5,COUNTA(OFFSET($D46,MAX($BH$14-5,0),0,MIN($BH$14+$BH$15-5,$BH$15),4))-COUNTIF(OFFSET($E46,MAX($BH$14-5,0),0,MIN($BH$14+$BH$15-5,$BH$15),1),0),0)),AND($B28=\"NA\",COUNTA($D28:$G28)=0,IF($BH$14<5,COUNTIF(OFFSET($B24,$BH$14,0,MIN(5-$BH$14,$BH$15),1),\"NA\"),0)+IF($BH$14+$BH$15>5,COUNTIF(OFFSET($B46,MAX($BH$14-5,0),0,MIN($BH$14+$BH$15-5,$BH$15),1),\"NA\"),0)<>$BH$15)),\"NA\",IF($B28=\"\",\"missing\",IF(AND($B28<>\"NA\",COUNTA($D28,$F28:$G28)+COUNTIF($E28,\"<>0\")),UPPER($B28),\"!error\"))),\"\")","v":""},"","","",{"$f":"IF(BD28=\"\",\"\",IF(AY28=0,\"NA\",IF(OR($BH$12=\"!error\",$BH$13=\"!error\",BG28=\"!error\"),\"!error\",IF(BD28=\"NA\",\"NA\",IF(AND(ISNUMBER(BG28),BG28=0),0,IF(AND(ISNUMBER($BH$12),ISNUMBER($BH$13),ISNUMBER(BG28)),$BH$13*$BH$12/BG28,IF(BG28=\"ND\",\"ND\",\"missing\")))))))","v":""},"","","",{"$f":"IF(BD28=\"\",\"\",IF(AY28=0,\"NA\",IF(CW28=\"ND\",\"ND\",IF(OR($BN$12=\"!error\",BD28=\"!error\",AND(BD28=\"missing\",ISNUMBER(BF28)),IF(BE28=1,BF28=\"!error\",0),BI28=\"!error\",BJ28=\"!error\"),\"!error\",IF(OR(BD28=\"NA\",AND(ISNUMBER($BN$12),$BN$12=0),AND(BE28<>0,ISNUMBER(BK28),BK28=0),AND(BE28=1,ISNUMBER(BJ28),BJ28>9),AND(BE28=2,ISNUMBER(BJ28),OR(BJ28<6,BJ28>=9.5)),AND(OR(BE28=3,BE28=4),ISNUMBER(BJ28),OR(BJ28<5.5,BJ28>=9.5))),\"NA\",IF(AND(ISNUMBER($BN$12),BE28<>0,IF(BE28=1,ISNUMBER(BF28),1),ISNUMBER(BI28),ISNUMBER(BJ28)),CT_Giardia(BE28,$BN$12,BI28,BJ28,IF(BE28=1,BF28,)),IF(COUNTIF(BE28,\"<>0\")+COUNT(BF28,BG28,BI28,BJ28)=5,\"!error\",\"missing\")))))))","v":""},{"$f":"IF(BD28=\"\",\"\",IF(OR(AY28=0,AND(ISNUMBER($BN$12),$BN$12=0)),\"NA\",IF(CW28=\"ND\",\"ND\",IF(OR(BK28=\"!error\",BL28=\"!error\",BN28=\"!error\"),\"!error\",IF(BD28=\"NA\",\"NA\",IF(BL28=\"NA\",0,IF(AND(BE28<>99,ISNUMBER(BK28),ISNUMBER(BL28)),BK28/BL28,IF(AND(BE28=99,BN28=0.5),BN28/$BN$12,\"missing\"))))))))","v":""},{"$f":"IF(BD28=\"\",\"\",IF(AY28=0,\"NA\",IF(CW28=\"ND\",\"ND\",IF(OR(BD28=\"!error\",AND(BD28=\"missing\",ISNUMBER(BF28)),BF28=\"!error\",BH28=\"!error\",BI28=\"!error\",BJ28=\"!error\"),\"!error\",IF(BD28=\"NA\",\"NA\",IF(OR(AND(BE28<>0,ISNUMBER(BK28),BK28=0),AND(BE28=1,ISNUMBER(BJ28),BJ28>9),AND(BE28=2,ISNUMBER(BJ28),OR(BJ28<6,BJ28>=9.5)),AND(OR(BE28=3,BE28=4),ISNUMBER(BJ28),OR(BJ28<5.5,BJ28>=9.5))),0,IF(AND(ISNUMBER($BN$12),BE28<>0,ISNUMBER(BF28),ISNUMBER(BH28),ISNUMBER(BI28),ISNUMBER(BJ28)),log_Giardia(BE28,$BN$12,BI28,BJ28,BF28,BH28),IF(COUNTIF(BE28,\"<>0\")+COUNT(BF28,BG28,BI28,BJ28)=5,\"!error\",\"missing\"))))))))","v":""},{"$f":"IF(BD28=\"\",\"\",IF(AY28=0,\"NA\",IF(CW28=\"ND\",\"ND\",IF(OR($BP$12=\"!error\",BD28=\"!error\",AND(BD28=\"missing\",ISNUMBER(BF28)),BI28=\"!error\",BJ28=\"!error\"),\"!error\",IF(OR(BD28=\"NA\",AND(ISNUMBER($BP$12),$BP$12=0),AND(BE28<>0,ISNUMBER(BK28),BK28=0),AND(BE28=1,ISNUMBER(BJ28),BJ28>=10.5),AND(BE28=2,ISNUMBER(BJ28),OR(BJ28<6,BJ28>=9.5)),AND(BE28=3,ISNUMBER(BJ28),OR(BJ28<6,BJ28>9)),AND(BE28=4,ISNUMBER(BJ28),OR(BJ28<6,BJ28>10))),\"NA\",IF(AND(ISNUMBER($BP$12),BE28<>0,ISNUMBER(BI28),ISNUMBER(BJ28)),CT_Virus(BE28,$BP$12,BI28,BJ28),IF(COUNTIF(BE28,\"<>0\")+COUNT(BF28,BG28,BI28,BJ28)=5,\"!error\",\"missing\")))))))","v":""},{"$f":"IF(BD28=\"\",\"\",IF(OR(AY28=0,AND(ISNUMBER($BP$12),$BP$12=0)),\"NA\",IF(CW28=\"ND\",\"ND\",IF(OR(BK28=\"!error\",BO28=\"!error\",BQ28=\"!error\"),\"!error\",IF(BD28=\"NA\",\"NA\",IF(BO28=\"NA\",0,IF(AND(BE28<>99,ISNUMBER(BK28),ISNUMBER(BO28)),BK28/BO28,IF(AND(BE28=99,BQ28=1),BQ28/$BP$12,\"missing\"))))))))","v":""},{"$f":"IF(BD28=\"\",\"\",IF(AY28=0,\"NA\",IF(CW28=\"ND\",\"ND\",IF(OR(BD28=\"!error\",AND(BD28=\"missing\",ISNUMBER(BF28)),BF28=\"!error\",BH28=\"!error\",BI28=\"!error\",BJ28=\"!error\"),\"!error\",IF(BD28=\"NA\",\"NA\",IF(OR(AND(BE28<>0,ISNUMBER(BK28),BK28=0),AND(BE28=1,ISNUMBER(BJ28),BJ28>=10.5),AND(BE28=2,ISNUMBER(BJ28),OR(BJ28<6,BJ28>=9.5)),AND(BE28=3,ISNUMBER(BJ28),OR(BJ28<6,BJ28>9)),AND(BE28=4,ISNUMBER(BJ28),OR(BJ28<6,BJ28>10))),0,IF(AND(ISNUMBER($BP$12),BE28<>0,ISNUMBER(BF28),ISNUMBER(BH28),ISNUMBER(BI28),ISNUMBER(BJ28)),Log_Virus(BE28,$BP$12,BI28,BJ28,BF28,BH28),IF(COUNTIF(BE28,\"<>0\")+COUNT(BF28,BG28,BI28,BJ28)=5,\"!error\",\"missing\"))))))))","v":""},{"$f":"IF($BM$14=0,0,IF(COUNTIF(OFFSET($BD24,0,0,MIN($BM$14,5),1),\"<>NA\")+IF($BM$14>5,COUNTIF(OFFSET($BV24,0,0,$BM$14-5,1),\"<>NA\"),0),1,0))","v":1},{"$f":"IF($BK$14=0,0,IF(COUNTIF(OFFSET($BD24,0,0,MIN($BK$14,5),1),\"O3\")+COUNTIF(OFFSET($BD24,0,0,MIN($BK$14,5),1),\"O3 Cell 1\")+IF($BK$14>5,COUNTIF(OFFSET($BV24,0,0,$BK$14-5,1),\"O3\"),0)+IF($BK$14>5,COUNTIF(OFFSET($BV24,0,0,$BK$14-5,1),\"O3 Cell 1\"),0),1,0))","v":0},{"$f":"IF(OR($AY28=0,AND(COUNTA(D50,F50:G50)=0,COUNTIF(E50,0))),\"NA\",IF(COUNTA(D50:G50),IF(BS28,4,5),IF($BM$15=1,IF(BS28,4,IF(BR28,5,6)),IF(BV28=\"!error\",IF(BS28,4,5),IF(BS28,\"5B\",6)))))","v":6},{"$f":"$BM$11","v":10},{"$f":"IF(AND(IF($BN$4=\"missing\",10,$BN$4)>=10,$AY28<>\"\"),IF(OR($AY28=0,AND($B50=\"NA\",COUNTA($D50,$F50:$G50)=0,COUNTIF($E50,0)),AND($B50=\"NA\",COUNTA($D50:$G50)=0,IF($BM$14=0,0,COUNTIF(OFFSET($BD24,0,0,MIN($BM$14,5),1),\"NA\")+IF($BM$14>5,COUNTIF(OFFSET($BV24,0,0,$BM$14-5,1),\"NA\"),0))=$BM$14),AND($B50=\"NA\",COUNTA($D50:$G50)=0,IF($BM$14<5,COUNTA(OFFSET($D24,$BM$14,0,MIN(5-$BM$14,$BM$15),4))-COUNTIF(OFFSET($E24,$BM$14,0,MIN(5-$BM$14,$BM$15),1),0),0)+IF($BM$14+$BM$15>5,COUNTA(OFFSET($D46,MAX($BM$14-5,0),0,MIN($BM$14+$BM$15-5,$BM$15),4))-COUNTIF(OFFSET($E46,MAX($BM$14-5,0),0,MIN($BM$14+$BM$15-5,$BM$15),1),0),0)),AND($B50=\"NA\",COUNTA($D50:$G50)=0,IF($BM$14<5,COUNTIF(OFFSET($B24,$BM$14,0,MIN(5-$BM$14,$BM$15),1),\"NA\"),0)+IF($BM$14+$BM$15>5,COUNTIF(OFFSET($B46,MAX($BM$14-5,0),0,MIN($BM$14+$BM$15-5,$BM$15),1),\"NA\"),0)<>$BM$15)),\"NA\",IF($B50=\"\",\"missing\",IF(AND($B50<>\"NA\",COUNTA($D50,$F50:$G50)+COUNTIF($E50,\"<>0\")),UPPER($B50),\"!error\"))),\"\")","v":""},"",{"$f":"IF(BV28=\"\",\"\",IF(BV28=\"NA\",\"NA\",IF(ISBLANK($D50),\"missing\",IF(AND(BW28=1,ISNUMBER($D50),$D50>4),4,IF(AND(ISNUMBER($D50),$D50>=0),$D50,IF(AND(ISTEXT($D50),$D50=\"ND\"),\"ND\",\"!error\"))))))","v":""},{"$f":"IF(BV28=\"\",\"\",IF(BV28=\"NA\",\"NA\",IF(ISBLANK($E50),\"missing\",IF(OR(AND(ISBLANK($B50),COUNT(BX28,CA28:CB28)=0,ISNUMBER($E50),$E50=0),AND(ISNUMBER($E50),$E50>0),AND(ISTEXT($E50),$E50=\"ND\")),$E50,\"!error\"))))","v":""},{"$f":"IF(BV28=\"\",\"\",IF(AY28=0,\"NA\",IF(OR($BM$12=\"!error\",$BM$13=\"!error\",BY28=\"!error\"),\"!error\",IF(BV28=\"NA\",\"NA\",IF(AND(ISNUMBER(BY28),BY28=0),0,IF(AND(ISNUMBER($BM$12),ISNUMBER($BM$13),ISNUMBER(BY28)),$BM$13*$BM$12/BY28,IF(BY28=\"ND\",\"ND\",\"missing\")))))))","v":""},{"$f":"IF(BV28=\"\",\"\",IF(BV28=\"NA\",\"NA\",IF(ISBLANK($F50),\"missing\",IF(OR(ISNUMBER($F50),$F50=\"ND\"),$F50,\"!error\"))))","v":""},{"$f":"IF(BV28=\"\",\"\",IF(BV28=\"NA\",\"NA\",IF(ISBLANK($G50),\"missing\",IF(OR(AND(ISNUMBER($G50),$G50>=0,$G50<=14),$G50=\"ND\"),$G50,\"!error\"))))","v":""},"",{"$f":"IF(BV28=\"\",\"\",IF(AY28=0,\"NA\",IF(CX28=\"ND\",\"ND\",IF(OR($BN$12=\"!error\",BV28=\"!error\",AND(BV28=\"missing\",ISNUMBER(BX28)),IF(BW28=1,BX28=\"!error\",0),CA28=\"!error\",CB28=\"!error\"),\"!error\",IF(OR(BV28=\"NA\",AND(ISNUMBER($BN$12),$BN$12=0),AND(BW28<>0,ISNUMBER(CC28),CC28=0),AND(BW28=1,ISNUMBER(CB28),CB28>9),AND(BW28>1,ISNUMBER(CB28),OR(CB28<6,CB28>=9.5))),\"NA\",IF(AND(ISNUMBER($BN$12),BW28<>0,IF(BW28=1,ISNUMBER(BX28),1),ISNUMBER(CA28),ISNUMBER(CB28)),CT_Giardia(BW28,$BN$12,CA28,CB28,IF(BW28=1,BX28,)),IF(COUNTIF(BW28,\"<>0\")+COUNT(BX28,BY28,CA28,CB28)=5,\"!error\",\"missing\")))))))","v":""},{"$f":"IF(BV28=\"\",\"\",IF(OR(AY28=0,AND(ISNUMBER($BN$12),$BN$12=0)),\"NA\",IF(CX28=\"ND\",\"ND\",IF(OR(CC28=\"!error\",CD28=\"!error\",CF28=\"!error\"),\"!error\",IF(BV28=\"NA\",\"NA\",IF(CD28=\"NA\",0,IF(AND(ISNUMBER(CC28),ISNUMBER(CD28)),CC28/CD28,IF(AND(BW28=99,CF28=0.5),CF28/$BN$12,\"missing\"))))))))","v":""},{"$f":"IF(BV28=\"\",\"\",IF(AY28=0,\"NA\",IF(CX28=\"ND\",\"ND\",IF(OR(BV28=\"!error\",AND(BV28=\"missing\",ISNUMBER(BX28)),BX28=\"!error\",BZ28=\"!error\",CA28=\"!error\",CB28=\"!error\"),\"!error\",IF(BV28=\"NA\",\"NA\",IF(OR(AND(BW28<>0,ISNUMBER(CC28),CC28=0),AND(BW28=1,ISNUMBER(CB28),CB28>9),AND(BW28>1,ISNUMBER(CB28),OR(CB28<6,CB28>=9.5))),0,IF(AND(ISNUMBER($BN$12),BW28<>0,ISNUMBER(BX28),ISNUMBER(BZ28),ISNUMBER(CA28),ISNUMBER(CB28)),log_Giardia(BW28,$BN$12,CA28,CB28,BX28,BZ28),IF(COUNTIF(BW28,\"<>0\")+COUNT(BX28,BY28,CA28,CB28)=5,\"!error\",\"missing\"))))))))","v":""},{"$f":"IF(BV28=\"\",\"\",IF(AY28=0,\"NA\",IF(CX28=\"ND\",\"ND\",IF(OR($BP$12=\"!error\",BV28=\"!error\",AND(BV28=\"missing\",ISNUMBER(BX28)),CA28=\"!error\",CB28=\"!error\"),\"!error\",IF(OR(BV28=\"NA\",AND(ISNUMBER($BP$12),$BP$12=0),AND(BW28<>0,ISNUMBER(CC28),CC28=0),AND(BW28=1,ISNUMBER(CB28),OR(CB28<5.5,CB28>=10.5)),AND(OR(BW28=2,BW28=4),ISNUMBER(CB28),OR(CB28<6,CB28>=9.5)),AND(BW28=3,ISNUMBER(CB28),OR(CB28<6,CB28>9))),\"NA\",IF(AND(ISNUMBER($BP$12),BW28<>0,ISNUMBER(CA28),ISNUMBER(CB28)),CT_Virus(BW28,$BP$12,CA28,CB28),IF(COUNTIF(BW28,\"<>0\")+COUNT(BX28,BY28,CA28,CB28)=5,\"!error\",\"missing\")))))))","v":""},{"$f":"IF(BV28=\"\",\"\",IF(OR(AY28=0,AND(ISNUMBER($BP$12),$BP$12=0)),\"NA\",IF(CX28=\"ND\",\"ND\",IF(OR(CC28=\"!error\",CG28=\"!error\",CI28=\"!error\"),\"!error\",IF(BV28=\"NA\",\"NA\",IF(CG28=\"NA\",0,IF(AND(ISNUMBER(CC28),ISNUMBER(CG28)),CC28/CG28,IF(AND(BW28=99,CI28=1),CI28/$BP$12,\"missing\"))))))))","v":""},{"$f":"IF(BV28=\"\",\"\",IF(AY28=0,\"NA\",IF(CX28=\"ND\",\"ND\",IF(OR(BV28=\"!error\",AND(BV28=\"missing\",ISNUMBER(BX28)),BX28=\"!error\",BZ28=\"!error\",CA28=\"!error\",CB28=\"!error\"),\"!error\",IF(BV28=\"NA\",\"NA\",IF(OR(AND(BW28<>0,ISNUMBER(CC28),CC28=0),AND(BW28=1,ISNUMBER(CB28),OR(CB28<5.5,CB28>=10.5)),AND(OR(BW28=2,BW28=4),ISNUMBER(CB28),OR(CB28<6,CB28>=9.5)),AND(BW28=3,ISNUMBER(CB28),OR(CB28<6,CB28>9))),0,IF(AND(ISNUMBER($BP$12),BW28<>0,ISNUMBER(BX28),ISNUMBER(BZ28),ISNUMBER(CA28),ISNUMBER(CB28)),Log_Virus(BW28,$BP$12,CA28,CB28,BX28,BZ28),IF(COUNTIF(BW28,\"<>0\")+COUNT(BX28,BY28,CA28,CB28)=5,\"!error\",\"missing\"))))))))","v":""}]
[null,null,null,null,null,null,null,null,null,null," Certificate No.",null,null,null,null,null,null,null,null,null,null,null,null,null,null,null,null,null,null,null,null,null,null,null,null,null,null,null,null,null,null,null,null,null,null,null,null,null,null,null,null,null,null,null,null,null,null,null,null,null,null,null,null,null,null,null,null,null,null,null,null,null,null,null,null,null,null,null,null,null,null,null,null,null,null,null,null,null," Not representative of total log inactivation for all disinfection zones."]
[null,"SUBMITTED BY:",null,null,null,null,null,null,null,null," and Grade:",null,null," Date:",null,null,null,null,null,null,null,null,null,null,null,null,null,null,null,null,null,null,null,null,null,null,null,null,null,null,null,null,null,null,null,null,null,null,null,null,null,null,null,null,null,null,null,null,null,null,null,null,null,null,null,null,null,null,null,null,null,null,null,null,null,null,null,null,null,null,null,null,null,null,null,null,null,null,null,null,{"$f":"CL24=\"\"","v":true},null,null,null,{"$f":"CP24=\"\"","v":true}]
[]
[null,{"$f":"+Description!A54","v":"TCEQ - (05-01-13)"},null,null,null,null,null,null,null,null,null,null,null,null,"CT STUDY"]
[null,null,null,null,null,null,"DISINFECTION PROCESS PARAMETERS"]
[null,"APPROVED CT STUDY PARAMETERS",null,null,null,null,null,null,null,"PERFORMANCE STANDARDS"]
[]
[null,"Parameters",null,null,"Disinfection Zones",null,null,null,null,"Log Inactivations"]
[null,null,null,null,{"$f":"BI11","v":6},{"$f":"BJ11","v":7},{"$f":"BK11","v":8},{"$f":"BL11","v":9},{"$f":"BM11","v":10},"Giardia lamblia Cysts",null,null,"Viruses"]
[null,"   Flow Rate (MGD)",null,null,{"$f":"IF('T10 Details'!$E$1907=0,\"\",'T10 Details'!$E$1907)","v":""},{"$f":"IF('T10 Details'!$E$2223=0,\"\",'T10 Details'!$E$2223)","v":""},{"$f":"IF('T10 Details'!$E$2539=0,\"\",'T10 Details'!$E$2539)","v":""},{"$f":"IF('T10 Details'!$E$2855=0,\"\",'T10 Details'!$E$2855)","v":""},{"$f":"IF('T10 Details'!$E$3171=0,\"\",'T10 Details'!$E$3171)","v":""},{"$f":"J16","v":0.5},null,null,{"$f":"M16","v":2}]
[null,"   T10 (minutes)",null,null,{"$f":"IF('T10 Details'!$E$1909=0,\"\",'T10 Details'!$E$1909)","v":""},{"$f":"IF('T10 Details'!$E$2225=0,\"\",'T10 Details'!$E$2225)","v":""},{"$f":"IF('T10 Details'!$E$2541=0,\"\",'T10 Details'!$E$2541)","v":""},{"$f":"IF('T10 Details'!$E$2857=0,\"\",'T10 Details'!$E$2857)","v":""},{"$f":"IF('T10 Details'!$E$3173=0,\"\",'T10 Details'!$E$3173)","v":""}]
[]
[null,null,null,null,null,null,null,null,"DISINFECTION PROCESS DATA"]
[null,"INDIVIDUAL DISINFECTION ZONES",null,null,null,null,null,null,null,null,null,null,"PLANT TOTAL"]
[]
[null,null,null,"C","Flow","Temp",null,null,"Giardia","Virus","Giardia","Virus","Giardia","Virus","Inact."]
[null,"Disinfectant",null,"(mg/L)","(MGD)","(oC)","pH","CTCALC","CTREQD","CTREQD","Log","Log","Log","Log","Ratio",null,null,null,"Disinfectant"]
[{"$f":"S46","v":""},"",{"$f":"E37","v":6},null,null,null,null,{"$f":"IF($CD24=\"!error\",\"!error\",$CC24)","v":""},{"$f":"$CD24","v":""},{"$f":"$CG24","v":""},{"$f":"$CF24","v":""},{"$f":"$CI24","v":""},null,null,null,null,null,null,{"$f":"IF(B46=\"\",\"\",IF(B46=\"FCL\",1,IF(B46=\"CLO2\",2,IF(B46=\"O3\",3,IF(B46=\"CLA\",4,IF(B46=\"O3 cell 1\",99,0))))))","v":""},{"$f":"IF('T10 Details'!H1595=\"\",\"\",IF('T10 Details'!H1595=\"Free Chlorine\",\"FCL\",IF('T10 Details'!H1595=\"Chlorine Dioxide\",\"CLO2\",IF('T10 Details'!H1595=\"Ozone cell 1\",\"O3 cell 1\",IF('T10 Details'!H1595=\"Ozone (any cell)\",\"O3\",IF('T10 Details'!H1595=\"Chloramines\",\"CLA\"))))))","v":""}]
["","",{"$f":"F37","v":7},null,null,null,null,{"$f":"IF($CD25=\"!error\",\"!error\",$CC25)","v":""},{"$f":"$CD25","v":""},{"$f":"$CG25","v":""},{"$f":"$CF25","v":""},{"$f":"$CI25","v":""},null,null,null,null,null,null,{"$f":"IF(B47=\"\",\"\",IF(B47=\"FCL\",1,IF(B47=\"CLO2\",2,IF(B47=\"O3\",3,IF(B47=\"CLA\",4,IF(B47=\"O3 cell 1\",99,0))))))","v":""},{"$f":"IF('T10 Details'!H1911=\"\",\"\",IF('T10 Details'!H1911=\"Free Chlorine\",\"FCL\",IF('T10 Details'!H1911=\"Chlorine Dioxide\",\"CLO2\",IF('T10 Details'!H1911=\"Ozone cell 1\",\"O3 cell 1\",IF('T10 Details'!H1911=\"Ozone (any cell)\",\"O3\",IF('T10 Details'!H1911=\"Chloramines\",\"CLA\"))))))","v":""}]
["","",{"$f":"G37","v":8},null,null,null,null,"",{"$f":"$CD26","v":""},{"$f":"$CG26","v":""},{"$f":"$CF26","v":""},{"$f":"$CI26","v":""},null,null,null,null,null,null,{"$f":"IF(B48=\"\",\"\",IF(B48=\"FCL\",1,IF(B48=\"CLO2\",2,IF(B48=\"O3\",3,IF(B48=\"CLA\",4,IF(B48=\"O3 cell 1\",99,0))))))","v":""},{"$f":"IF('T10 Details'!H2227=\"\",\"\",IF('T10 Details'!H2227=\"Free Chlorine\",\"FCL\",IF('T10 Details'!H2227=\"Chlorine Dioxide\",\"CLO2\",IF('T10 Details'!H2227=\"Ozone cell 1\",\"O3 cell 1\",IF('T10 Details'!H2227=\"Ozone (any cell)\",\"O3\",IF('T10 Details'!H2227=\"Chloramines\",\"CLA\"))))))","v":""}]
[{"$f":"S49","v":""},{"$f":"T49","v":""},{"$f":"H37","v":9},null,null,null,null,"",{"$f":"$CD27","v":""},{"$f":"$CG27","v":""},{"$f":"$CF27","v":""},{"$f":"$CI27","v":""},null,null,null,null,null,null,{"$f":"IF(B49=\"\",\"\",IF(B49=\"FCL\",1,IF(B49=\"CLO2\",2,IF(B49=\"O3\",3,IF(B49=\"CLA\",4,IF(B49=\"O3 cell 1\",99,0))))))","v":""},{"$f":"IF('T10 Details'!H2543=\"\",\"\",IF('T10 Details'!H2543=\"Free Chlorine\",\"FCL\",IF('T10 Details'!H2543=\"Chlorine Dioxide\",\"CLO2\",IF('T10 Details'!H2543=\"Ozone cell 1\",\"O3 cell 1\",IF('T10 Details'!H2543=\"Ozone (any cell)\",\"O3\",IF('T10 Details'!H2543=\"Chloramines\",\"CLA\"))))))","v":""}]
["",{"$f":"T50","v":""},{"$f":"I37","v":10},null,null,null,null,{"$f":"IF($CC28=\"!error\",\"!error\",$CC28)","v":""},{"$f":"$CD28","v":""},{"$f":"$CG28","v":""},{"$f":"$CF28","v":""},{"$f":"$CI28","v":""},null,null,null,null,null,null,{"$f":"IF(B50=\"\",\"\",IF(B50=\"FCL\",1,IF(B50=\"CLO2\",2,IF(B50=\"O3\",3,IF(B50=\"CLA\",4,IF(B50=\"O3 cell 1\",99,0))))))","v":""},{"$f":"IF('T10 Details'!H2859=\"\",\"\",IF('T10 Details'!H2859=\"Free Chlorine\",\"FCL\",IF('T10 Details'!H2859=\"Chlorine Dioxide\",\"CLO2\",IF('T10 Details'!H2859=\"Ozone cell 1\",\"O3 cell 1\",IF('T10 Details'!H2859=\"Ozone (any cell)\",\"O3\",IF('T10 Details'!H2859=\"Chloramines\",\"CLA\"))))))","v":""}]
[null,null,null,null,null,null,null,null,null,null," Certificate No."]
[null,"SUBMITTED BY:",null,null,null,null,null,null,null,null," and Grade:",null,null," Date:"]
[]
[null,{"$f":"+Description!A54","v":"TCEQ - (05-01-13)"},null,null,null,null,null,null,null,null,null,null,null,null,"CT STUDY"]