{"text_format":"1","workbook":"xlsx","n_sheets":6,"sheets":["Filter Assessment","Lists","MACRO","Filter Profile","Data","Sheet1"],"not_rendered":{"charts":2,"images":1,"macros":1,"external_links":0,"defined_names":36,"comments":1,"pivot_tables":0},"unopened":[{"sheet":"MACRO","index":2,"reason":"part_missing"},{"sheet":"Filter Profile","index":3,"reason":"not_a_worksheet"}],"bounds":{"document_bytes":16777216,"sheet_cells":100000,"rows_first":2000,"rows_last":500,"rows_between":2000,"halvings":0,"cell_chars":16384,"cell_head_chars":4096},"cells_cut":0,"cells_raw":0,"read":"whole","date_system":"1900"}

{"sheet":"Filter Assessment","index":0,"n_rows":485,"n_cols":18,"rows_kept":485,"cut":false,"hidden":false,"merged":[[21,8,21,9],[22,8,22,9],[23,8,23,9],[66,8,66,9],[41,8,41,9],[37,9,37,10],[28,9,28,10],[19,8,19,9],[28,6,28,7],[41,10,41,11],[20,8,20,9],[56,6,56,9],[33,9,33,10],[59,6,59,7],[58,8,58,9],[59,8,59,9],[61,6,61,7],[33,6,33,8],[42,8,42,9],[42,6,42,7],[38,9,38,10],[27,4,27,6],[330,3,330,8],[330,11,330,12],[179,3,179,8],[262,3,262,8],[265,3,265,8],[182,3,182,8],[254,3,254,8],[269,2,269,12],[246,11,246,12],[267,6,267,9],[235,2,235,3],[211,6,211,7],[211,9,211,10],[208,9,208,10],[197,6,197,9],[201,6,201,7],[201,9,201,10],[199,9,199,10],[200,6,200,7],[199,6,199,7],[200,9,200,10],[208,6,208,7],[213,9,213,10],[209,6,209,7],[79,3,80,11],[58,4,58,5],[58,2,58,3],[59,2,59,3],[235,6,241,12],[258,2,258,12],[254,11,254,12],[233,6,233,9],[249,11,250,12],[251,11,251,12],[229,2,229,3],[230,2,230,3],[227,6,230,12],[227,2,227,3],[228,2,228,3],[241,2,241,3],[244,6,244,9],[238,2,238,3],[239,2,239,3],[247,11,248,12],[240,2,240,3],[149,2,149,3],[18,2,18,3],[25,2,25,3],[19,4,19,5],[20,4,20,5],[24,2,24,3],[22,2,22,3],[23,2,23,3],[22,4,22,5],[21,2,21,3],[18,4,18,7],[19,2,19,3],[20,2,20,3],[25,4,25,5],[22,6,22,7],[23,6,23,7],[21,4,21,5],[19,6,19,7],[20,6,20,7],[21,6,21,7],[23,4,23,5],[28,4,28,5],[61,2,61,3],[61,4,61,5],[27,2,27,3],[211,2,211,3],[211,4,211,5],[203,4,203,5],[209,2,209,3],[207,2,207,3],[207,4,207,5],[210,2,210,3],[208,2,208,3],[208,4,208,5],[205,2,205,3],[205,4,205,5],[201,2,201,3],[201,4,201,5],[200,2,200,3],[200,4,200,5],[209,4,209,5],[192,2,192,3],[96,3,96,8],[193,2,193,3],[84,4,84,8],[209,9,209,10],[210,4,210,5],[210,6,210,7],[213,4,213,5],[213,6,213,7],[210,9,210,10],[205,9,205,10],[204,2,204,3],[204,4,204,5],[204,6,204,7],[204,9,204,10],[205,6,205,7],[207,9,207,10],[206,2,206,3],[206,4,206,5],[206,6,206,7],[206,9,206,10],[207,6,207,7],[203,9,203,10],[184,6,184,9],[186,2,186,3],[186,6,194,12],[187,2,187,3],[188,2,188,3],[189,2,189,3],[190,2,190,3],[191,2,191,3],[203,2,203,3],[202,6,202,7],[202,9,202,10],[121,8,121,9],[106,6,114,12],[122,8,122,9],[123,8,123,9],[117,6,117,9],[128,8,128,9],[130,8,130,9],[131,8,131,9],[147,6,168,12],[120,8,120,9],[0,2,0,12],[1,2,1,12],[2,2,2,12],[16,2,16,3],[15,4,15,5],[16,4,16,5],[15,6,15,7],[16,6,16,7],[11,6,11,9],[13,10,13,11],[13,4,13,6],[13,8,13,9],[15,9,15,10],[13,2,13,3],[16,9,16,10],[4,11,5,13],[6,11,7,13],[9,3,9,4],[9,8,9,9],[9,11,9,12],[4,3,5,8],[6,3,7,8],[43,10,43,11],[44,4,44,5],[41,6,41,7],[58,6,58,7],[60,6,60,7],[60,8,60,9],[29,4,29,5],[31,9,31,11],[29,6,29,7],[29,9,29,10],[31,6,31,8],[60,4,60,5],[39,6,39,7],[44,2,44,3],[43,6,43,7],[44,6,44,7],[43,8,43,9],[44,8,44,9],[41,4,41,5],[60,2,60,3],[66,2,66,3],[59,4,59,5],[63,2,63,3],[64,2,64,3],[63,4,63,5],[64,4,64,5],[63,6,63,7],[64,6,64,7],[63,8,63,9],[64,8,64,9],[61,8,61,9],[67,8,67,9],[67,6,67,7],[66,4,66,5],[67,4,67,5],[66,6,66,7],[67,2,67,3],[68,4,68,5],[68,8,68,9],[68,2,68,3],[103,4,103,5],[119,4,119,5],[121,4,121,5],[103,2,103,3],[68,6,68,7],[73,2,73,3],[70,6,76,12],[74,2,74,3],[70,2,70,3],[72,2,72,3],[75,2,75,3],[99,3,99,8],[85,4,85,8],[84,2,84,3],[85,2,85,3],[92,2,92,12],[88,2,88,12],[93,2,93,12],[85,11,85,12],[91,2,91,12],[87,2,87,12],[82,3,82,12],[76,2,76,3],[71,2,71,3],[101,6,101,9],[153,2,153,3],[114,2,114,3],[112,2,112,3],[148,2,148,3],[131,2,131,3],[132,2,132,3],[151,2,151,3],[104,4,104,5],[145,6,145,9],[107,2,107,3],[110,2,110,3],[111,2,111,3],[104,2,104,3],[108,2,108,3],[109,2,109,3],[106,2,106,4],[104,6,104,7],[103,6,103,7],[103,8,103,9],[104,8,104,9],[122,4,122,5],[129,4,129,5],[127,4,127,5],[124,2,124,3],[125,2,125,3],[127,2,127,3],[168,2,168,3],[158,2,158,3],[164,2,164,3],[132,8,132,9],[135,2,142,12],[133,8,133,9],[129,8,129,9],[131,4,131,5],[132,4,132,5],[124,4,124,5],[128,4,128,5],[128,2,128,3],[126,4,126,5],[126,8,126,9],[126,2,126,3],[216,9,216,10],[217,2,217,3],[217,4,217,5],[217,6,217,7],[217,9,217,10],[214,9,214,10],[215,2,215,3],[215,4,215,5],[215,6,215,7],[215,9,215,10],[214,2,214,3],[214,4,214,5],[123,2,123,3],[123,4,123,5],[127,8,127,9],[124,8,124,9],[125,8,125,9],[222,9,222,10],[223,4,223,5],[223,6,223,7],[223,9,223,10],[220,2,220,3],[220,4,220,5],[220,6,220,7],[220,9,220,10],[221,2,221,3],[221,4,221,5],[221,6,221,7],[221,9,221,10],[218,9,218,10],[219,2,219,3],[219,4,219,5],[219,6,219,7],[219,9,219,10],[216,2,216,3],[216,4,216,5],[222,2,222,3],[222,4,222,5],[222,6,222,7],[218,2,218,3],[218,4,218,5],[218,6,218,7],[163,2,163,3],[154,2,154,3],[214,6,214,7],[216,6,216,7],[202,2,202,3],[202,4,202,5],[194,2,194,3],[199,4,199,5],[203,6,203,7],[31,2,31,3],[32,2,32,3],[36,2,36,3],[35,4,35,5],[29,2,29,3],[35,6,35,7],[36,6,36,7],[24,4,24,5],[46,2,53,12],[37,6,37,7],[38,6,38,7],[36,4,36,5],[33,2,33,3],[39,4,39,5],[37,4,37,5],[39,2,39,3],[38,2,38,3],[38,4,38,5],[42,10,42,11],[44,10,44,11],[35,9,35,10],[36,9,36,10],[39,9,39,10],[37,2,37,3],[225,2,225,3],[225,4,225,5],[225,6,225,7],[225,9,225,10],[224,6,224,7],[224,9,224,10],[223,2,223,3],[261,11,262,13],[264,11,265,13],[257,2,257,12],[246,2,251,10],[259,2,259,12],[224,2,224,3],[224,4,224,5],[181,11,182,13],[95,11,96,13],[98,11,99,13],[178,11,179,13],[174,2,174,12],[175,2,175,12],[176,2,176,12],[167,2,167,3],[171,11,171,12],[113,2,113,3],[161,2,161,3],[162,2,162,3],[120,2,120,3],[122,2,122,3],[147,2,147,3],[130,2,130,3],[129,2,129,3],[121,2,121,3],[150,2,150,3],[155,2,155,3],[156,2,156,3],[157,2,157,3],[160,2,160,3],[171,3,171,8],[333,2,333,12],[334,2,334,12],[335,2,335,12],[337,11,338,13],[338,3,338,8],[340,11,341,13],[341,3,341,8],[343,4,343,9],[345,2,345,12],[419,5,419,9],[421,2,421,12],[482,3,482,8],[482,11,482,12],[416,11,417,13],[417,3,417,8],[406,3,406,8],[406,11,406,12],[409,2,409,12],[410,2,410,12],[411,2,411,12],[413,11,414,13],[414,3,414,8]]}
[null,null,"FILTER ASSESSMENT REPORT FOR INDIVIDUAL FILTERS"]
[null,null,"FOR PUBLIC WATER SYSTEMS THAT ARE USING SURFACE WATER SOURCES OR GROUND WATER SOURCES UNDER"]
[null,null,"THE INFLUENCE OF SURFACE WATER THAT ARE REQUIRED TO CONDUCT AN INDIVIDUAL FILTER ASSSESSMENT"]
[]
[null,null,"PUBLIC WATER","TCEQ WSC",null,null,null,null,null,null,"PLANT NAME  ","PDWS Water Treatment Plant"]
[null,null,"SYSTEM NAME:",null,null,null,null,null,null,null,"OR NUMBER:  "]
[null,null,null,1234567,null,null,null,null,null,null,"FILTER","Filter No. 5"]
[null,null,"PWS ID No.:",null,null,null,null,null,null,null,"NUMBER:  "]
[]
[null,null,"First Event: ","2015-12-24",null,null,null,"Second Event: ","2016-01-06",null,"Third Event:  ","2016-02-12"]
[]
[null,null,null,null,null,null,"DESIGN SPECIFICATIONS"]
[]
[null,null," FILTER TYPE",null,"Gravity",null,null,null,"  OPERATING MODE",null,"Constant Rate/Variable Level"]
[]
[null,null,null,null,"Diameter (ft)",null,"Length (ft)",null,"Width (ft)","Surface Area (ft2)",null,"Freeboard (ft)","Max Head Loss (ft)"]
[null,null," MEDIA BED DIMENSIONS",null,null,null,12,null,24,{"$f":"IF(AND(ISBLANK(E17),ISBLANK(G17),ISBLANK(I17)),\"\",IF(AND(E17>0,ISBLANK(G17),ISBLANK(I17)),3.1417*(E17/2)^2,IF(AND(E17=0,G17>0,I17>0),G17*I17,\"ERROR\")))","v":288},null,3.25,13]
[]
[null,null," MEDIA TYPE",null,"Multiple Media"]
[null,null," MEDIA SPECS",null,"Material",null,"Depth (inches)",null,"Min. Size (mm)",null,"Max. Size (mm)","UC","Specific Gravity"]
[null,null,"    Layer 1 Material",null,"Anthracite",null,24,null,0.9,null,1.2,1.6,"Unknown"]
[null,null,"    Layer 2 Material",null,"Sand",null,12,null,0.45,null,0.55000000000000004,1.4,"Unknown"]
[null,null,"    Layer 3 Material",null,"Garnet",null,3,null,0.2,null,0.35,1.4,"Unknown",null,null,null," "]
[null,null,"    Layer 4 Material"]
[null,null," TOTAL DEPTH  (inches)",null,{"$f":"IF(E21=\"Unknown\",\"Unknown\",IF(SUM(G21:H24)=0,\"\",SUM(G21:H24)))","v":39}]
[null,null," L/D RATIO",null,{"$f":"IF(E25=\"Unknown\",\"Unknown\",IF(ISTEXT(E25),\"\",E25^2*25.4/((I21+K21)/2*G21+(I22+K22)/2*G22+(I23+K23)/2*G23+(I24+K24)/2*G24)))","v":1206.3512880562059}]
[]
[null,null," UNDERDRAIN TYPE",null,"Type-S with gravel"]
[null,null,null,null,"No. of Grades",null,"Min. Size   (in)",null,"Max. Size   (in)","Total Depth   (in)"]
[null,null," SUPPORT GRAVEL",null,4,null,0.25,null,1.5,12]
[]
[null,null," TROUGHS",null,null,null,"   SUPPL. BACKWASH",null,null,"Air Scour (retrofit)"]
[null,null,"    Number.",null,5]
[null,null,"    Separation   (inches)",null,39,null,"   FILTER-TO-WASTE",null,null,"No"]
[]
[null,null,null,null,"Regulatory Std",null,"Design",null,"Typical","During Backwash",null,"Maximum","App'd Exception"]
[null,null," FILTER FLOW RATE  (gpm)",null,{"$f":"IF(E14=\"\",\"\",IF(E38=\"Other\",\"Unspecified\",IF(OR(J17=\"\",J17=\"ERROR\"),\"Surface Area = ?\",E38*J17)))","v":1440},null,1400,null,1111,1333,null,1833,"None"]
[null,null," LOADING RATE  (gpm/ft2)",null,{"$f":"IF(E14=\"\",\"\",IF(Lists!N3=\"Yes\",6.5,IF(Lists!N4=\"Yes\",5,IF(Lists!N5=\"Yes\",2.5,IF(Lists!N6=\"Yes\",2,\"Other\")))))","v":5},null,{"$f":"IF(E14=\"\",\"\",IF(OR(J17=\"\",J17=\"ERROR\"),\"Surface Area = ?\",IF(G37=\"\",\"Filter Flow Rate = ?\",G37/J17)))","v":4.8611111111111107},null,{"$f":"IF(E14=\"\",\"\",IF(OR(J17=\"\",J17=\"ERROR\"),\"Surface Area = ?\",IF(I37=\"\",\"Filter Flow Rate = ?\",I37/J17)))","v":3.8576388888888888},{"$f":"IF(E14=\"\",\"\",IF(OR(J17=\"\",J17=\"ERROR\"),\"Surface Area = ?\",IF(J37=\"\",\"Filter Flow Rate = ?\",J37/J17)))","v":4.6284722222222223},null,{"$f":"IF(E14=\"\",\"\",IF(OR(J17=\"\",J17=\"ERROR\"),\"Surface Area = ?\",IF(L37=\"\",\"Filter Flow Rate = ?\",L37/J17)))","v":6.364583333333333},"None"]
[null,null," BW FLOW RATE  (gpm)",null,{"$f":"IF(E14=\"\",\"\",IF(OR(J17=\"\",J17=\"ERROR\"),\"Surface Area = ?\",ROUND(J17*12.5,0)&\" - \"&ROUND(J17*21.8,0)))","v":"3600 - 6278"},null,5000,null,3800,null,null,5000]
[null,null," BW LOADING RATE  (gpm/ft2)",null,{"$f":"IF(E14=\"\",\"\",\"12.5 - 21.8\")","v":"12.5 - 21.8"},null,{"$f":"IF(E14=\"\",\"\",IF(G39=\"unknown\", \"Unknown\",IF(OR(J17=\"\",J17=\"ERROR\"),\"Surface Area = ?\",IF(G39=\"\",\"Backwash Rate = ?\",G39/J17))))","v":17.361111111111111},null,{"$f":"IF(E14=\"\",\"\",IF(OR(J17=\"\",J17=\"ERROR\"),\"Surface Area = ?\",IF(I39=\"\",\"Backwash Rate = ?\",I39/J17)))","v":13.194444444444445},null,null,{"$f":"IF(E14=\"\",\"\",IF(OR(J17=\"\",J17=\"ERROR\"),\"Surface Area = ?\",IF(L39=\"\",\"Backwash Rate = ?\",L39/J17)))","v":17.361111111111111}]
[]
[null,null,null,null,"Source",null,"Controller",null,"Meter",null,"Turbidimeter",null,"LOHG"]
[null,null," FILTER INFLUENT",null,null,null,"Fix. weir Splitter",null,"Proportional",null,"None"]
[null,null," FILTER EFFLUENT",null,null,null,"None",null,"None",null,"Hach 1720D",null,"Water Lvl Indicator"]
[null,null," BACKWASH WATER",null,"Filters & Pump",null,"Mot. Valve (Auto.)",null,"Ultrasonic",null,"None"]
[]
[null,null,"ADDITIONAL REMARKS:  There flow distribution to the filter is controlled with a fixed-weir splitter box and a valve that is completely opened when the filter is on-line and is completely closed when the filter is out of service during backwash and the subsequent idle period."]
[]
[]
[]
[]
[]
[]
[]
[]
[]
[null,null,null,null,null,null,"OPERATING PROCEDURES"]
[]
[null,null," CALIBRATION",null,"Flow Meter",null,"Backwash Meter",null,"Mech. ROFC",null,"NTU (Primary)","NTU (Secondary)"]
[null,null,"    Method",null,"Ultrasonic",null,"Ultrasonic",null,null,null,"Formazin","Comparison"]
[null,null,"    Frequency",null,"Annual",null,"Annual",null,null,null,"Quarterly","Weekly"]
[null,null,"    Date of Last",null,"2015-06-13",null,"2015-06-13",null,null,null,"2016-01-24","2016-02-14"]
[]
[null,null,"DATA CONSISTENCY",null,"Frequency and Span",null,"Date",null,"NTU Meter Display",null,"SCADA Display","Data Recorder","Grab Sample"]
[null,null,"    Test Data",null,"every 5 min, 0.00 - 5.00",null,"2016-02-19T14:35:00",null,0.27100000000000002,null,0.26900000000000002,0.26944499999999999,0.29399999999999998]
[]
[null,null," BACKWASH",null,"Turbidity  (NTU)",null,"LOH  (ft)",null,"Run Time  (hr)",null,"Run Volume  (gal)","Filtration Rate"]
[null,null,"    Criteria",null,"1.0 NTU",null,10,null,48,null,"NA","NA"]
[null,null,"    Monitoring Interval ",null,"5 min",null,"8 hrs",null,"Each Shift"]
[]
[null,null," WRITTEN SOPs",null,null,null,"ADDITIONAL REMARKS:   We are creating a Filter Inspection SOP as part of this Filter Assessment."]
[null,null,"    Plant Start-up",null,"Complete "]
[null,null,"    Filter Start-up",null,"Complete "]
[null,null,"    Plant Shutdown",null,"Partial"]
[null,null,"    Filter Shutdown",null,"Partial"]
[null,null,"    Filter Backwash",null,"Complete "]
[null,null,"    Filter Inspection",null,"None"]
[]
[]
[null,null,null,"I certify that I am familiar with the information contained in this report and that, to the best of my knowledge, the information is true, complete, and accurate."]
[]
[null,null,"Operator's"]
[null,null,"Signature:"]
[]
[null,null,"Operator's Name (printed):",null,"Más Papeleo"]
[null,null,"Certificate No. and Class:",null,"987-65-4321",null,null,null,null,null,"     Date:","2016-02-23"]
[]
[null,null,"Submit Report to TCEQ/Water Supply Division/Public Drinking Water Section(MC-155), ATTN: Monthly Reports, P.O. Box 13087, Austin, TX 78711-3087"]
[null,null,"The report is due the 10th of the following month"]
[]
[null,null,"TCEQ - 10277 (02-15-17)",null,null,null,null,null,"PAGE 1  ",null,null,null,null,"Filter Assessment Report",null,null,"FARv7ex","2017-02-15"]
[null,null,"FILTER ASSESSMENT REPORT FOR INDIVIDUAL FILTERS"]
[null,null,"FOR PUBLIC WATER SYSTEMS THAT ARE USING SURFACE WATER SOURCES OR GROUND WATER SOURCES UNDER"]
[null,null,"THE INFLUENCE OF SURFACE WATER THAT ARE REQUIRED TO CONDUCT AN INDIVIDUAL FILTER ASSSESSMENT"]
[]
[null,null,"PUBLIC WATER",null,null,null,null,null,null,null,"PLANT NAME  ",{"$f":"IF($L$5=\"\",\"\",$L$5)","v":"PDWS Water Treatment Plant"}]
[null,null,"SYSTEM NAME:",{"$f":"IF($D$5=\"\",\"\",$D$5)","v":"TCEQ WSC"},null,null,null,null,null,null,"OR NUMBER:  "]
[]
[null,null,null,null,null,null,null,null,null,null,"FILTER",{"$f":"IF($L$7=\"\",\"\",$L$7)","v":"Filter No. 5"}]
[null,null,"PWS ID No.:",{"$f":"IF($D$7=\"\",\"\",$D$7)","v":1234567},null,null,null,null,null,null,"NUMBER:  "]
[]
[null,null,null,null,null,null,"CURRENT CONDITIONS"]
[]
[null,null," DATE",null," TIME",null,"TURBIDITY (NTU)",null,"LOH (ft)",null,"FLOW RATE (gpm)","RUN TIME (hr)","RUN VOLUME (gal)"]
[null,null,"2002-02-17",null,"06:00:00",null,0.32,null,7,null,1100,18.75,"Unknown"]
[]
[null,null," PHYSICAL CONDITION",null,null,null,"ADDITIONAL REMARKS:  Some of the indicator marks on the LOHG ruler are not legible."]
[null,null,"    Walls",null,"Good"]
[null,null,"    Troughs",null,"Minor Damage"]
[null,null,"    Suppl. Backwash",null,"Fully Operational"]
[null,null,"    Flow Meter"]
[null,null,"    ROFC",null,"Fully Operational"]
[null,null,"    Flow Control Valve",null,"Fully Operational"]
[null,null,"    Turbidimeter",null,"Fully Operational"]
[null,null,"    LOHG",null,"Slight Malfunction"]
[]
[]
[null,null,null,null,null,null,"MEDIA SURFACE CONDITIONS"]
[]
[null,null,null,null,"Before BW",null,"After BW",null,null,null,"Before BW","After BW"]
{"$rows_left_out":366}
{"sheet":"Lists","index":1,"n_rows":91,"n_cols":14,"rows_kept":91,"cut":false,"hidden":true,"merged":[]}
[]
["FILTER TYPE",null,null,"OPERATING MODE",null,null,null,"YES/NO LIST",null,null,null,null,"FILTER LOADING RATE (REG)"]
["Gravity",null,null,"Constant Rate/Constant Level",null,null,null,"Yes",null,null,null,null,"Is it 6.5?",{"$f":"IF('Filter Assessment'!E14=\"\",\"\",IF(AND('Filter Assessment'!E14=A3,'Filter Assessment'!K14=D5,OR('Filter Assessment'!E19=A11,'Filter Assessment'!E19=A12,'Filter Assessment'!E19=A14)),\"Yes\",\"No\"))","v":"No"}]
["Pressure",null,null,"Constant Rate/Variable Level",null,null,null,"No",null,null,null,null,"Is it 5?",{"$f":"IF('Filter Assessment'!E14=\"\",\"\",IF(AND('Filter Assessment'!E14=A3,OR('Filter Assessment'!K14=D3,'Filter Assessment'!K14=D4),OR('Filter Assessment'!E19=A11,'Filter Assessment'!E19=A12,'Filter Assessment'!E19=A14)),\"Yes\",\"No\"))","v":"Yes"}]
["Permutit",null,null,"Declining Rate",null,null,null,null,null,null,null,null,"Is it 2.5?",{"$f":"IF('Filter Assessment'!E14=\"\",\"\",IF(AND('Filter Assessment'!E14=A3,'Filter Assessment'!K14=D5,'Filter Assessment'!E19=A13),\"Yes\",\"No\"))","v":"No"}]
["Other",null,null,"Other",null,null,null,null,null,null,null,null,"Is it 2?",{"$f":"IF('Filter Assessment'!E14=\"\",\"\",IF(OR('Filter Assessment'!E14=A4,'Filter Assessment'!E14=A5,AND('Filter Assessment'!E14=Lists!A3,'Filter Assessment'!E19=Lists!A13,OR('Filter Assessment'!K14=D3,'Filter Assessment'!K14=D4))),\"Yes\",\"No\"))","v":"No"}]
[]
[]
[]
["MEDIA TYPE",null,null,"MEDIA MATERIAL",null,null,null,null,null,null,null,null,"BACKWASH LOADING RATE (REG)"]
["Multiple Media",null,null,"Anthracite",null,null,null,null,null,null,null,null,"MAX","MIN"]
["Dual Media",null,null,"Sand",null,null,null,null,null,null,null,null,12.5,21.8]
["Rapid Sand",null,null,"Garnet"]
["Deep-bed Mono Media",null,null,"GAC"]
["Other",null,null,"Other"]
["Unknown",null,null,"Unknown"]
[]
[]
[]
["UNDERDRAIN TYPE",null,null,"SUPPLEMENTAL BW FACILITIES"]
["Perforated Pipe",null,null,"None"]
["Perforated Plate",null,null,"Surface Wash"]
["Wheeler",null,null,"Subsurface Wash"]
["Type-S with gravel",null,null,"Air Scour"]
["Leopold IMS Cap",null,null,"Air Scour (retrofit)"]
["Other",null,null,"Other"]
["Unknown"]
[]
[]
[]
["BW W ATER SOURCE",null,null,"CONTROLLER",null,null,"METER",null,"LOHG"]
["Filter Effluent",null,null,"None",null,null,"None",null,"None"]
["Filters & Pump",null,null,"Fix. weir Splitter",null,null,"Proportional",null,"Differential Gauge"]
["Dedicated BW Pump",null,null,"Var. weir Splitter",null,null,"Venturi",null,"Two Gauges"]
["Service Pumps",null,null,"Man. Telescoping",null,null,"Orifice",null,"Water Lvl Indicator"]
["Elevated BW Tank",null,null,"Man. Butterfly",null,null,"Ultrasonic",null,"Other"]
["Distribution",null,null,"Mechanical ROFC",null,null,"Propeller"]
["Other",null,null,"Mot. Valve (Auto.)",null,null,"Nunating Disk"]
[null,null,null,"Vacuum Pipe",null,null,"Paddle"]
[null,null,null,"Orifice Plate",null,null,"V-notch weir"]
[null,null,null,"Head Control Box",null,null,"Flat Weir"]
[null,null,null,"Other",null,null,"Parshall Flume"]
[null,null,null,null,null,null,"Other"]
[]
[]
[]
["FLOW METER CAL.",null,null,"TURBIDIMETER CAL.",null,null,"ROFC CAL.",null,"CALIBRATION FREQUENCY",null,null,"SOPs"]
["Unknown",null,null,"Formazin",null,null,"Unknown",null,"Less than Annual",null,null,"Complete "]
["Weirs",null,null,"Stabilzed formazin",null,null,"Ultrasonic",null,"Annual",null,null,"Partial"]
["Flume",null,null,"Polymer beads",null,null,"Time & Volume",null,"Semi-annual",null,null,"Out-of-date"]
["Ultrasonic",null,null,"Gel",null,null,"Other",null,"Quarterly",null,null,"None"]
["Time & Volume",null,null,"Comparison",null,null,null,null,"Monthly"]
["Other",null,null,"Proprietary device",null,null,null,null,"Weekly"]
[null,null,null,"Other",null,null,null,null,"Daily"]
[null,null,null,null,null,null,null,null,"More than daily"]
[]
[]
[]
["CONDITION OF FILTER",null,null,"CONDITION OF APPERTENANCES",null,null,null,"FLOC/MUDBALL DISTRIBUTION"]
["Excellent",null,null,"Fully Operational",null,null,null,"Uniform"]
["Good",null,null,"Slight Malfunction",null,null,null,"Localized"]
["Minor Damage",null,null,"Moderate Malfunct",null,null,null,"Other"]
["Moderate Damage",null,null,"Severe Malfunction"]
["Severe Damage",null,null,"Other"]
["Other"]
[]
[]
[]
[]
["TROUGH LEVELNESS",null,null,"FLOODING",null,"SUPPL. EFFECTIVENESS",null,null,"JETTING",null,"BBW DISTRIBUTION"]
["Level",null,null,"None",null,"Excellent",null,null,"Slight",null,"Even/Uniform"]
["Slighly Unlevel",null,null,"Slight",null,"Adequate",null,null,"Moderate",null,"Uneven"]
["Moder. Unlevel",null,null,"Moderate",null,"Poor",null,null,"Severe",null,"Inadequate"]
["Severely Unlevel",null,null,"Severe",null,"Ineffective",null,null,null,null,"Other"]
[null,null,null,"Complete"]
[]
[]
[]
["SITE CONDITION",null,null,"MUDBALLS",null,"SHARPNESS",null,"ENCRUSTATION",null,"UNIFORMITY"]
["Normal",null,null,"None",null,"Excellent",null,"None",null,"Good"]
["Media Mound",null,null,"Few",null,"Good",null,"Slight",null,"Marginal"]
["Media Depression",null,null,"Several",null,"Worn",null,"Moderate",null,"Poor"]
["Crack",null,null,"Many",null,null,null,"Heavy",null,"Other"]
["Retraction"]
["Floc. Accumul."]
["Gravel Mound"]
["Gravel Depression"]
["Poor Suppl. BW"]
["Jetting"]
["Poor BW Distr."]
["Other"]

{"sheet":"Data","index":4,"n_rows":2222,"n_cols":4,"rows_kept":2222,"cut":false,"hidden":false,"merged":[]}
["Time","Flow Rate","IFE NTU","Description of the Event \nor Cause of the Spike"]
["2016-02-19T12:00:00"]
[{"$f":"+A2+0.000694444444444444","v":"2016-02-19T12:01:00"}]
[{"$f":"+A3+0.000694444444444444","v":"2016-02-19T12:02:00"}]
["2016-02-19T12:03:00"]
["2016-02-19T12:04:00"]
["2016-02-19T12:05:00"]
["2016-02-19T12:06:00"]
["2016-02-19T12:07:00"]
["2016-02-19T12:08:00"]
["2016-02-19T12:09:00"]
["2016-02-19T12:10:00"]
["2016-02-19T12:11:00"]
["2016-02-19T12:12:00"]
["2016-02-19T12:13:00"]
["2016-02-19T12:14:00"]
["2016-02-19T12:15:00"]
["2016-02-19T12:16:00"]
["2016-02-19T12:17:00"]
["2016-02-19T12:18:00"]
["2016-02-19T12:19:00"]
["2016-02-19T12:20:00"]
["2016-02-19T12:21:00"]
["2016-02-19T12:22:00"]
["2016-02-19T12:23:00"]
["2016-02-19T12:24:00"]
["2016-02-19T12:25:00"]
["2016-02-19T12:26:00"]
["2016-02-19T12:27:00"]
["2016-02-19T12:28:00"]
["2016-02-19T12:29:00"]
["2016-02-19T12:30:00"]
["2016-02-19T12:31:00"]
["2016-02-19T12:32:00"]
["2016-02-19T12:33:00"]
["2016-02-19T12:34:00"]
["2016-02-19T12:35:00"]
["2016-02-19T12:36:00"]
["2016-02-19T12:37:00"]
["2016-02-19T12:38:00"]
["2016-02-19T12:39:00"]
["2016-02-19T12:40:00"]
["2016-02-19T12:41:00"]
["2016-02-19T12:42:00"]
["2016-02-19T12:43:00"]
["2016-02-19T12:44:00"]
["2016-02-19T12:45:00"]
["2016-02-19T12:46:00"]
["2016-02-19T12:47:00"]
["2016-02-19T12:48:00"]
["2016-02-19T12:49:00"]
["2016-02-19T12:50:00"]
["2016-02-19T12:51:00"]
["2016-02-19T12:52:00"]
["2016-02-19T12:53:00"]
["2016-02-19T12:54:00"]
["2016-02-19T12:55:00"]
["2016-02-19T12:56:00"]
["2016-02-19T12:57:00"]
["2016-02-19T12:58:00"]
["2016-02-19T12:59:00"]
["2016-02-19T13:00:00"]
["2016-02-19T13:01:00"]
["2016-02-19T13:02:00"]
["2016-02-19T13:03:00"]
["2016-02-19T13:04:00"]
["2016-02-19T13:05:00"]
[{"$f":"+A67+0.000694444444444444","v":"2016-02-19T13:06:00"}]
["2016-02-19T13:07:00"]
["2016-02-19T13:08:00"]
["2016-02-19T13:09:00"]
["2016-02-19T13:10:00"]
["2016-02-19T13:11:00"]
["2016-02-19T13:12:00"]
["2016-02-19T13:13:00"]
["2016-02-19T13:14:00"]
["2016-02-19T13:15:00"]
["2016-02-19T13:16:00"]
["2016-02-19T13:17:00"]
["2016-02-19T13:18:00"]
["2016-02-19T13:19:00"]
["2016-02-19T13:20:00"]
["2016-02-19T13:21:00"]
["2016-02-19T13:22:00"]
[{"$f":"+A84+0.000694444444444444","v":"2016-02-19T13:23:00"}]
["2016-02-19T13:24:00"]
["2016-02-19T13:25:00"]
["2016-02-19T13:26:00"]
["2016-02-19T13:27:00"]
[{"$f":"+A89+0.000694444444444444","v":"2016-02-19T13:28:00"},null,0.125,"RTS after backwash"]
["2016-02-19T13:29:00",null,0.128]
[{"$f":"+A91+1/1440","v":"2016-02-19T13:30:00"},null,0.13400000000000001]
["2016-02-19T13:31:00",null,0.13800000000000001]
["2016-02-19T13:32:00",null,0.151]
["2016-02-19T13:33:00",null,0.156]
["2016-02-19T13:34:00",null,0.16300000000000001]
["2016-02-19T13:35:00",null,0.158]
["2016-02-19T13:36:00",null,0.16500000000000001]
["2016-02-19T13:37:00",null,0.16900000000000001]
["2016-02-19T13:38:00",null,0.17599999999999999]
["2016-02-19T13:39:00",null,0.186]
["2016-02-19T13:40:00",null,0.183]
["2016-02-19T13:41:00",null,0.187]
["2016-02-19T13:42:00",null,0.19400000000000001]
["2016-02-19T13:43:00",null,0.193]
["2016-02-19T13:44:00",null,0.19400000000000001]
["2016-02-19T13:45:00",null,0.20300000000000001]
["2016-02-19T13:46:00",null,0.246]
["2016-02-19T13:47:00",null,0.182]
["2016-02-19T13:48:00",null,0.35899999999999999]
["2016-02-19T13:49:00",null,0.40799999999999997]
["2016-02-19T13:50:00",null,0.42199999999999999]
["2016-02-19T13:51:00",null,0.46800000000000003]
["2016-02-19T13:52:00",null,0.496]
["2016-02-19T13:53:00",null,0.51100000000000001]
["2016-02-19T13:54:00",null,0.54900000000000004]
["2016-02-19T13:55:00",null,0.57899999999999996]
["2016-02-19T13:56:00",null,0.61399999999999999]
["2016-02-19T13:57:00",null,0.58199999999999996]
["2016-02-19T13:58:00",null,0.51400000000000001]
{"$rows_left_out":2103}
{"sheet":"Sheet1","index":5,"n_rows":0,"n_cols":0,"rows_kept":0,"cut":false,"hidden":false,"merged":[]}