{"text_format":"1","workbook":"xlsx","n_sheets":6,"sheets":["Filter Assessment","Lists","MACRO","Filter Profile","Data","Sheet1"],"not_rendered":{"charts":2,"images":1,"macros":1,"external_links":0,"defined_names":36,"comments":1,"pivot_tables":0},"unopened":[{"sheet":"MACRO","index":2,"reason":"part_missing"},{"sheet":"Filter Profile","index":3,"reason":"not_a_worksheet"}],"bounds":{"document_bytes":16777216,"sheet_cells":100000,"rows_first":2000,"rows_last":500,"rows_between":2000,"halvings":0,"cell_chars":16384,"cell_head_chars":4096},"cells_cut":0,"cells_raw":0,"read":"whole","date_system":"1900"}

{"sheet":"Filter Assessment","index":0,"n_rows":485,"n_cols":18,"rows_kept":485,"cut":false,"hidden":false,"merged":[[21,8,21,9],[22,8,22,9],[23,8,23,9],[66,8,66,9],[41,8,41,9],[37,9,37,10],[28,9,28,10],[19,8,19,9],[28,6,28,7],[41,10,41,11],[20,8,20,9],[56,6,56,9],[33,9,33,10],[59,6,59,7],[58,8,58,9],[59,8,59,9],[61,6,61,7],[33,6,33,8],[42,8,42,9],[42,6,42,7],[38,9,38,10],[27,4,27,6],[330,3,330,8],[330,11,330,12],[179,3,179,8],[262,3,262,8],[265,3,265,8],[182,3,182,8],[254,3,254,8],[269,2,269,12],[246,11,246,12],[267,6,267,9],[235,2,235,3],[211,6,211,7],[211,9,211,10],[208,9,208,10],[197,6,197,9],[201,6,201,7],[201,9,201,10],[199,9,199,10],[200,6,200,7],[199,6,199,7],[200,9,200,10],[208,6,208,7],[213,9,213,10],[209,6,209,7],[79,3,80,11],[58,4,58,5],[58,2,58,3],[59,2,59,3],[235,6,241,12],[258,2,258,12],[254,11,254,12],[233,6,233,9],[249,11,250,12],[251,11,251,12],[229,2,229,3],[230,2,230,3],[227,6,230,12],[227,2,227,3],[228,2,228,3],[241,2,241,3],[244,6,244,9],[238,2,238,3],[239,2,239,3],[247,11,248,12],[240,2,240,3],[149,2,149,3],[18,2,18,3],[25,2,25,3],[19,4,19,5],[20,4,20,5],[24,2,24,3],[22,2,22,3],[23,2,23,3],[22,4,22,5],[21,2,21,3],[18,4,18,7],[19,2,19,3],[20,2,20,3],[25,4,25,5],[22,6,22,7],[23,6,23,7],[21,4,21,5],[19,6,19,7],[20,6,20,7],[21,6,21,7],[23,4,23,5],[28,4,28,5],[61,2,61,3],[61,4,61,5],[27,2,27,3],[211,2,211,3],[211,4,211,5],[203,4,203,5],[209,2,209,3],[207,2,207,3],[207,4,207,5],[210,2,210,3],[208,2,208,3],[208,4,208,5],[205,2,205,3],[205,4,205,5],[201,2,201,3],[201,4,201,5],[200,2,200,3],[200,4,200,5],[209,4,209,5],[192,2,192,3],[96,3,96,8],[193,2,193,3],[84,4,84,8],[209,9,209,10],[210,4,210,5],[210,6,210,7],[213,4,213,5],[213,6,213,7],[210,9,210,10],[205,9,205,10],[204,2,204,3],[204,4,204,5],[204,6,204,7],[204,9,204,10],[205,6,205,7],[207,9,207,10],[206,2,206,3],[206,4,206,5],[206,6,206,7],[206,9,206,10],[207,6,207,7],[203,9,203,10],[184,6,184,9],[186,2,186,3],[186,6,194,12],[187,2,187,3],[188,2,188,3],[189,2,189,3],[190,2,190,3],[191,2,191,3],[203,2,203,3],[202,6,202,7],[202,9,202,10],[121,8,121,9],[106,6,114,12],[122,8,122,9],[123,8,123,9],[117,6,117,9],[128,8,128,9],[130,8,130,9],[131,8,131,9],[147,6,168,12],[120,8,120,9],[0,2,0,12],[1,2,1,12],[2,2,2,12],[16,2,16,3],[15,4,15,5],[16,4,16,5],[15,6,15,7],[16,6,16,7],[11,6,11,9],[13,10,13,11],[13,4,13,6],[13,8,13,9],[15,9,15,10],[13,2,13,3],[16,9,16,10],[4,11,5,13],[6,11,7,13],[9,3,9,4],[9,8,9,9],[9,11,9,12],[4,3,5,8],[6,3,7,8],[43,10,43,11],[44,4,44,5],[41,6,41,7],[58,6,58,7],[60,6,60,7],[60,8,60,9],[29,4,29,5],[31,9,31,11],[29,6,29,7],[29,9,29,10],[31,6,31,8],[60,4,60,5],[39,6,39,7],[44,2,44,3],[43,6,43,7],[44,6,44,7],[43,8,43,9],[44,8,44,9],[41,4,41,5],[60,2,60,3],[66,2,66,3],[59,4,59,5],[63,2,63,3],[64,2,64,3],[63,4,63,5],[64,4,64,5],[63,6,63,7],[64,6,64,7],[63,8,63,9],[64,8,64,9],[61,8,61,9],[67,8,67,9],[67,6,67,7],[66,4,66,5],[67,4,67,5],[66,6,66,7],[67,2,67,3],[68,4,68,5],[68,8,68,9],[68,2,68,3],[103,4,103,5],[119,4,119,5],[121,4,121,5],[103,2,103,3],[68,6,68,7],[73,2,73,3],[70,6,76,12],[74,2,74,3],[70,2,70,3],[72,2,72,3],[75,2,75,3],[99,3,99,8],[85,4,85,8],[84,2,84,3],[85,2,85,3],[92,2,92,12],[88,2,88,12],[93,2,93,12],[85,11,85,12],[91,2,91,12],[87,2,87,12],[82,3,82,12],[76,2,76,3],[71,2,71,3],[101,6,101,9],[153,2,153,3],[114,2,114,3],[112,2,112,3],[148,2,148,3],[131,2,131,3],[132,2,132,3],[151,2,151,3],[104,4,104,5],[145,6,145,9],[107,2,107,3],[110,2,110,3],[111,2,111,3],[104,2,104,3],[108,2,108,3],[109,2,109,3],[106,2,106,4],[104,6,104,7],[103,6,103,7],[103,8,103,9],[104,8,104,9],[122,4,122,5],[129,4,129,5],[127,4,127,5],[124,2,124,3],[125,2,125,3],[127,2,127,3],[168,2,168,3],[158,2,158,3],[164,2,164,3],[132,8,132,9],[135,2,142,12],[133,8,133,9],[129,8,129,9],[131,4,131,5],[132,4,132,5],[124,4,124,5],[128,4,128,5],[128,2,128,3],[126,4,126,5],[126,8,126,9],[126,2,126,3],[216,9,216,10],[217,2,217,3],[217,4,217,5],[217,6,217,7],[217,9,217,10],[214,9,214,10],[215,2,215,3],[215,4,215,5],[215,6,215,7],[215,9,215,10],[214,2,214,3],[214,4,214,5],[123,2,123,3],[123,4,123,5],[127,8,127,9],[124,8,124,9],[125,8,125,9],[222,9,222,10],[223,4,223,5],[223,6,223,7],[223,9,223,10],[220,2,220,3],[220,4,220,5],[220,6,220,7],[220,9,220,10],[221,2,221,3],[221,4,221,5],[221,6,221,7],[221,9,221,10],[218,9,218,10],[219,2,219,3],[219,4,219,5],[219,6,219,7],[219,9,219,10],[216,2,216,3],[216,4,216,5],[222,2,222,3],[222,4,222,5],[222,6,222,7],[218,2,218,3],[218,4,218,5],[218,6,218,7],[163,2,163,3],[154,2,154,3],[214,6,214,7],[216,6,216,7],[202,2,202,3],[202,4,202,5],[194,2,194,3],[199,4,199,5],[203,6,203,7],[31,2,31,3],[32,2,32,3],[36,2,36,3],[35,4,35,5],[29,2,29,3],[35,6,35,7],[36,6,36,7],[24,4,24,5],[46,2,53,12],[37,6,37,7],[38,6,38,7],[36,4,36,5],[33,2,33,3],[39,4,39,5],[37,4,37,5],[39,2,39,3],[38,2,38,3],[38,4,38,5],[42,10,42,11],[44,10,44,11],[35,9,35,10],[36,9,36,10],[39,9,39,10],[37,2,37,3],[225,2,225,3],[225,4,225,5],[225,6,225,7],[225,9,225,10],[224,6,224,7],[224,9,224,10],[223,2,223,3],[261,11,262,13],[264,11,265,13],[257,2,257,12],[246,2,251,10],[259,2,259,12],[224,2,224,3],[224,4,224,5],[181,11,182,13],[95,11,96,13],[98,11,99,13],[178,11,179,13],[174,2,174,12],[175,2,175,12],[176,2,176,12],[167,2,167,3],[171,11,171,12],[113,2,113,3],[161,2,161,3],[162,2,162,3],[120,2,120,3],[122,2,122,3],[147,2,147,3],[130,2,130,3],[129,2,129,3],[121,2,121,3],[150,2,150,3],[155,2,155,3],[156,2,156,3],[157,2,157,3],[160,2,160,3],[171,3,171,8],[333,2,333,12],[334,2,334,12],[335,2,335,12],[337,11,338,13],[338,3,338,8],[340,11,341,13],[341,3,341,8],[343,4,343,9],[345,2,345,12],[419,5,419,9],[421,2,421,12],[482,3,482,8],[482,11,482,12],[416,11,417,13],[417,3,417,8],[406,3,406,8],[406,11,406,12],[409,2,409,12],[410,2,410,12],[411,2,411,12],[413,11,414,13],[414,3,414,8]]}
[null,null,"FILTER ASSESSMENT REPORT FOR INDIVIDUAL FILTERS"]
[null,null,"FOR PUBLIC WATER SYSTEMS THAT ARE USING SURFACE WATER SOURCES OR GROUND WATER SOURCES UNDER"]
[null,null,"THE INFLUENCE OF SURFACE WATER THAT ARE REQUIRED TO CONDUCT AN INDIVIDUAL FILTER ASSSESSMENT"]
[]
[null,null,"PUBLIC WATER","TCEQ WSC",null,null,null,null,null,null,"PLANT NAME  ","PDWS Water Treatment Plant"]
[null,null,"SYSTEM NAME:",null,null,null,null,null,null,null,"OR NUMBER:  "]
[null,null,null,1234567,null,null,null,null,null,null,"FILTER","Filter No. 5"]
[null,null,"PWS ID No.:",null,null,null,null,null,null,null,"NUMBER:  "]
[]
[null,null,"First Event: ","2015-12-24",null,null,null,"Second Event: ","2016-01-06",null,"Third Event:  ","2016-02-12"]
[]
[null,null,null,null,null,null,"DESIGN SPECIFICATIONS"]
[]
[null,null," FILTER TYPE",null,"Gravity",null,null,null,"  OPERATING MODE",null,"Constant Rate/Variable Level"]
[]
[null,null,null,null,"Diameter (ft)",null,"Length (ft)",null,"Width (ft)","Surface Area (ft2)",null,"Freeboard (ft)","Max Head Loss (ft)"]
[null,null," MEDIA BED DIMENSIONS",null,null,null,12,null,24,{"$f":"IF(AND(ISBLANK(E17),ISBLANK(G17),ISBLANK(I17)),\"\",IF(AND(E17>0,ISBLANK(G17),ISBLANK(I17)),3.1417*(E17/2)^2,IF(AND(E17=0,G17>0,I17>0),G17*I17,\"ERROR\")))","v":288},null,3.25,13]
[]
[null,null," MEDIA TYPE",null,"Multiple Media"]
[null,null," MEDIA SPECS",null,"Material",null,"Depth (inches)",null,"Min. Size (mm)",null,"Max. Size (mm)","UC","Specific Gravity"]
[null,null,"    Layer 1 Material",null,"Anthracite",null,24,null,0.9,null,1.2,1.6,"Unknown"]
[null,null,"    Layer 2 Material",null,"Sand",null,12,null,0.45,null,0.55000000000000004,1.4,"Unknown"]
[null,null,"    Layer 3 Material",null,"Garnet",null,3,null,0.2,null,0.35,1.4,"Unknown",null,null,null," "]
[null,null,"    Layer 4 Material"]
[null,null," TOTAL DEPTH  (inches)",null,{"$f":"IF(E21=\"Unknown\",\"Unknown\",IF(SUM(G21:H24)=0,\"\",SUM(G21:H24)))","v":39}]
[null,null," L/D RATIO",null,{"$f":"IF(E25=\"Unknown\",\"Unknown\",IF(ISTEXT(E25),\"\",E25^2*25.4/((I21+K21)/2*G21+(I22+K22)/2*G22+(I23+K23)/2*G23+(I24+K24)/2*G24)))","v":1206.3512880562059}]
[]
[null,null," UNDERDRAIN TYPE",null,"Type-S with gravel"]
[null,null,null,null,"No. of Grades",null,"Min. Size   (in)",null,"Max. Size   (in)","Total Depth   (in)"]
[null,null," SUPPORT GRAVEL",null,4,null,0.25,null,1.5,12]
[]
[null,null," TROUGHS",null,null,null,"   SUPPL. BACKWASH",null,null,"Air Scour (retrofit)"]
[null,null,"    Number.",null,5]
[null,null,"    Separation   (inches)",null,39,null,"   FILTER-TO-WASTE",null,null,"No"]
[]
[null,null,null,null,"Regulatory Std",null,"Design",null,"Typical","During Backwash",null,"Maximum","App'd Exception"]
[null,null," FILTER FLOW RATE  (gpm)",null,{"$f":"IF(E14=\"\",\"\",IF(E38=\"Other\",\"Unspecified\",IF(OR(J17=\"\",J17=\"ERROR\"),\"Surface Area = ?\",E38*J17)))","v":1440},null,1400,null,1111,1333,null,1833,"None"]
[null,null," LOADING RATE  (gpm/ft2)",null,{"$f":"IF(E14=\"\",\"\",IF(Lists!N3=\"Yes\",6.5,IF(Lists!N4=\"Yes\",5,IF(Lists!N5=\"Yes\",2.5,IF(Lists!N6=\"Yes\",2,\"Other\")))))","v":5},null,{"$f":"IF(E14=\"\",\"\",IF(OR(J17=\"\",J17=\"ERROR\"),\"Surface Area = ?\",IF(G37=\"\",\"Filter Flow Rate = ?\",G37/J17)))","v":4.8611111111111107},null,{"$f":"IF(E14=\"\",\"\",IF(OR(J17=\"\",J17=\"ERROR\"),\"Surface Area = ?\",IF(I37=\"\",\"Filter Flow Rate = ?\",I37/J17)))","v":3.8576388888888888},{"$f":"IF(E14=\"\",\"\",IF(OR(J17=\"\",J17=\"ERROR\"),\"Surface Area = ?\",IF(J37=\"\",\"Filter Flow Rate = ?\",J37/J17)))","v":4.6284722222222223},null,{"$f":"IF(E14=\"\",\"\",IF(OR(J17=\"\",J17=\"ERROR\"),\"Surface Area = ?\",IF(L37=\"\",\"Filter Flow Rate = ?\",L37/J17)))","v":6.364583333333333},"None"]
[null,null," BW FLOW RATE  (gpm)",null,{"$f":"IF(E14=\"\",\"\",IF(OR(J17=\"\",J17=\"ERROR\"),\"Surface Area = ?\",ROUND(J17*12.5,0)&\" - \"&ROUND(J17*21.8,0)))","v":"3600 - 6278"},null,5000,null,3800,null,null,5000]
[null,null," BW LOADING RATE  (gpm/ft2)",null,{"$f":"IF(E14=\"\",\"\",\"12.5 - 21.8\")","v":"12.5 - 21.8"},null,{"$f":"IF(E14=\"\",\"\",IF(G39=\"unknown\", \"Unknown\",IF(OR(J17=\"\",J17=\"ERROR\"),\"Surface Area = ?\",IF(G39=\"\",\"Backwash Rate = ?\",G39/J17))))","v":17.361111111111111},null,{"$f":"IF(E14=\"\",\"\",IF(OR(J17=\"\",J17=\"ERROR\"),\"Surface Area = ?\",IF(I39=\"\",\"Backwash Rate = ?\",I39/J17)))","v":13.194444444444445},null,null,{"$f":"IF(E14=\"\",\"\",IF(OR(J17=\"\",J17=\"ERROR\"),\"Surface Area = ?\",IF(L39=\"\",\"Backwash Rate = ?\",L39/J17)))","v":17.361111111111111}]
[]
[null,null,null,null,"Source",null,"Controller",null,"Meter",null,"Turbidimeter",null,"LOHG"]
[null,null," FILTER INFLUENT",null,null,null,"Fix. weir Splitter",null,"Proportional",null,"None"]
[null,null," FILTER EFFLUENT",null,null,null,"None",null,"None",null,"Hach 1720D",null,"Water Lvl Indicator"]
[null,null," BACKWASH WATER",null,"Filters & Pump",null,"Mot. Valve (Auto.)",null,"Ultrasonic",null,"None"]
[]
[null,null,"ADDITIONAL REMARKS:  There flow distribution to the filter is controlled with a fixed-weir splitter box and a valve that is completely opened when the filter is on-line and is completely closed when the filter is out of service during backwash and the subsequent idle period."]
[]
[]
[]
[]
[]
[]
[]
[]
[]
[null,null,null,null,null,null,"OPERATING PROCEDURES"]
[]
[null,null," CALIBRATION",null,"Flow Meter",null,"Backwash Meter",null,"Mech. ROFC",null,"NTU (Primary)","NTU (Secondary)"]
[null,null,"    Method",null,"Ultrasonic",null,"Ultrasonic",null,null,null,"Formazin","Comparison"]
[null,null,"    Frequency",null,"Annual",null,"Annual",null,null,null,"Quarterly","Weekly"]
[null,null,"    Date of Last",null,"2015-06-13",null,"2015-06-13",null,null,null,"2016-01-24","2016-02-14"]
[]
[null,null,"DATA CONSISTENCY",null,"Frequency and Span",null,"Date",null,"NTU Meter Display",null,"SCADA Display","Data Recorder","Grab Sample"]
[null,null,"    Test Data",null,"every 5 min, 0.00 - 5.00",null,"2016-02-19T14:35:00",null,0.27100000000000002,null,0.26900000000000002,0.26944499999999999,0.29399999999999998]
[]
[null,null," BACKWASH",null,"Turbidity  (NTU)",null,"LOH  (ft)",null,"Run Time  (hr)",null,"Run Volume  (gal)","Filtration Rate"]
[null,null,"    Criteria",null,"1.0 NTU",null,10,null,48,null,"NA","NA"]
[null,null,"    Monitoring Interval ",null,"5 min",null,"8 hrs",null,"Each Shift"]
[]
[null,null," WRITTEN SOPs",null,null,null,"ADDITIONAL REMARKS:   We are creating a Filter Inspection SOP as part of this Filter Assessment."]
[null,null,"    Plant Start-up",null,"Complete "]
[null,null,"    Filter Start-up",null,"Complete "]
[null,null,"    Plant Shutdown",null,"Partial"]
[null,null,"    Filter Shutdown",null,"Partial"]
[null,null,"    Filter Backwash",null,"Complete "]
[null,null,"    Filter Inspection",null,"None"]
[]
[]
[null,null,null,"I certify that I am familiar with the information contained in this report and that, to the best of my knowledge, the information is true, complete, and accurate."]
[]
[null,null,"Operator's"]
[null,null,"Signature:"]
[]
[null,null,"Operator's Name (printed):",null,"Más Papeleo"]
[null,null,"Certificate No. and Class:",null,"987-65-4321",null,null,null,null,null,"     Date:","2016-02-23"]
[]
[null,null,"Submit Report to TCEQ/Water Supply Division/Public Drinking Water Section(MC-155), ATTN: Monthly Reports, P.O. Box 13087, Austin, TX 78711-3087"]
[null,null,"The report is due the 10th of the following month"]
[]
[null,null,"TCEQ - 10277 (02-15-17)",null,null,null,null,null,"PAGE 1  ",null,null,null,null,"Filter Assessment Report",null,null,"FARv7ex","2017-02-15"]
[null,null,"FILTER ASSESSMENT REPORT FOR INDIVIDUAL FILTERS"]
[null,null,"FOR PUBLIC WATER SYSTEMS THAT ARE USING SURFACE WATER SOURCES OR GROUND WATER SOURCES UNDER"]
[null,null,"THE INFLUENCE OF SURFACE WATER THAT ARE REQUIRED TO CONDUCT AN INDIVIDUAL FILTER ASSSESSMENT"]
[]
[null,null,"PUBLIC WATER",null,null,null,null,null,null,null,"PLANT NAME  ",{"$f":"IF($L$5=\"\",\"\",$L$5)","v":"PDWS Water Treatment Plant"}]
[null,null,"SYSTEM NAME:",{"$f":"IF($D$5=\"\",\"\",$D$5)","v":"TCEQ WSC"},null,null,null,null,null,null,"OR NUMBER:  "]
[]
[null,null,null,null,null,null,null,null,null,null,"FILTER",{"$f":"IF($L$7=\"\",\"\",$L$7)","v":"Filter No. 5"}]
[null,null,"PWS ID No.:",{"$f":"IF($D$7=\"\",\"\",$D$7)","v":1234567},null,null,null,null,null,null,"NUMBER:  "]
[]
[null,null,null,null,null,null,"CURRENT CONDITIONS"]
[]
[null,null," DATE",null," TIME",null,"TURBIDITY (NTU)",null,"LOH (ft)",null,"FLOW RATE (gpm)","RUN TIME (hr)","RUN VOLUME (gal)"]
[null,null,"2002-02-17",null,"06:00:00",null,0.32,null,7,null,1100,18.75,"Unknown"]
[]
[null,null," PHYSICAL CONDITION",null,null,null,"ADDITIONAL REMARKS:  Some of the indicator marks on the LOHG ruler are not legible."]
[null,null,"    Walls",null,"Good"]
[null,null,"    Troughs",null,"Minor Damage"]
[null,null,"    Suppl. Backwash",null,"Fully Operational"]
[null,null,"    Flow Meter"]
[null,null,"    ROFC",null,"Fully Operational"]
[null,null,"    Flow Control Valve",null,"Fully Operational"]
[null,null,"    Turbidimeter",null,"Fully Operational"]
[null,null,"    LOHG",null,"Slight Malfunction"]
[]
[]
[null,null,null,null,null,null,"MEDIA SURFACE CONDITIONS"]
[]
[null,null,null,null,"Before BW",null,"After BW",null,null,null,"Before BW","After BW"]
[null,null," MOUNDS",null,null,null,null,null,"RETRACTION"]
[null,null,"    Number",null,3,null,1,null,"    Number",null,1,0]
[null,null,"    Length  (inches)",null,"6 - 12",null,12,null,"    Length  (inches)",null,"18"]
[null,null,"    Width  (inches)",null,"6 - 9",null,12,null,"    Width  (inches)",null,1]
[null,null,"    Height  (inches)",null,"1 - 2.5",null,"1.0",null,"    Depth  (inches)",null,"1.5"]
[null,null," DEPRESSIONS",null,null,null,null,null,"CRACKS"]
[null,null,"    Number",null,6,null,0,null,"    Number",null,6,0]
[null,null,"    Length  (inches)",null,"18 - 36",null,null,null,"    Length  (inches)",null,"6 - 15"]
[null,null,"    Width  (inches)",null,"5 - 6",null,null,null,"    Width  (inches)",null,"0 - 0.5"]
[null,null,"    Depth  (inches)",null,"1.5 -3.75",null,null,null,"    Depth  (inches)",null,"0 - 0.5"]
[null,null," ACCUMULATED FLOC",null,null,null,null,null," MUDBALLS"]
[null,null,"    Thickness  (inches)",null,"0 - 0.25",null,"Minimal",null,"    No.  per ft2",null,">10",0]
[null,null,"    Distribution",null,"Uniform",null,"Uniform",null,"    Size  (inches)",null,"0.25 - 0.75"]
[null,null,null,null,null,null,null,null,"    Distribution",null,"Localized"]
[]
[null,null,"ADDITIONAL REMARKS:  The largest depressions are located adjacent to the backwash troughs.  With the exception of one slight mound in the southwest corner of the filter, all of the anomalies were eliminated by the backwash cycle.B269"]
[]
[]
[]
[]
[]
[]
[]
[]
[]
[null,null,null,null,null,null,"BACKWASH CONDITIONS"]
[]
[null,null," BW FLOW RATE   (gpm)",null,2800,null,"ADDITIONAL REMARKS:   In one area of the filter, a severe jet was observed but we classified it as moderate because it did not seem to affect the backwash effectiveness in other parts of the filter.  "]
[null,null," RISE RATE  (inches/minute)",null,{"$f":"IF(E148=\"\",\"\",IF(OR(J17=\"\",J17=\"ERROR\"),\"Surface area = ?\",(E148/7.48)/J17*12))","v":15.597147950089127}]
[null,null," LOADING RATE  (gpm/ft2)",null,{"$f":"IF(E148=\"\",\"\",IF(OR(J17=\"\",J17=\"ERROR\"),\"Surface Area = ?\", E148/J17))","v":9.7222222222222214}]
[null,null," DURATION   (minutes)",null,12]
[null,null," TOTAL VOLUME   (gallons)",null,39200]
[]
[null,null," TROUGHS"]
[null,null,"    Levelness",null,"Slighly Unlevel"]
[null,null,"    Flooding",null,"None"]
[null,null," SUPPL. BACKWASH"]
[null,null,"    Duration   (minutes)",null,5]
[null,null,"    Effectiveness",null,"Adequate"]
[]
[null,null," JETTING"]
[null,null,"    No. of Sites",null,2]
[null,null,"    Severity",null,"Moderate"]
[null,null," BW WATER DISTRIBUTION",null,"Even/Uniform"]
[null,null," SPENT BWW TURBIDITY",null,2.98]
[]
[null,null," EXPANSION  (inches)",null,12]
[null,null," EXPANSION  (percent)",null,{"$f":"IF(E167=\"\",\"\",IF(E191=\"\",\"Avg. Depth = ?\",E167/E191*100))","v":35.294117647058826}]
[null,null," YIELD   (percent)",null,{"$f":"IF(E152=\"\",\"\",IF(M105=\"\",\"Run Volume = ?\",IF(M105=\"Unknown\", \"Unknown\",(1-E152/M105))))","v":"Unknown"}]
[]
[]
[null,null,"Submitted by: ",null,null,null,null,null,null,null,"     Date:",{"$f":"IF($L$86=\"\",\"\",$L$86)","v":"2016-02-23"}]
[]
[null,null,{"$f":"$C$91","v":"TCEQ - 10277 (02-15-17)"},null,null,null,null,null,"PAGE 2   ",null,null,null,null,"Filter Assessment Report"]
[null,null,"FILTER ASSESSMENT REPORT FOR INDIVIDUAL FILTERS"]
[null,null,"FOR PUBLIC WATER SYSTEMS THAT ARE USING SURFACE WATER SOURCES OR GROUND WATER SOURCES UNDER"]
[null,null,"THE INFLUENCE OF SURFACE WATER THAT ARE REQUIRED TO CONDUCT AN INDIVIDUAL FILTER ASSSESSMENT"]
[]
[null,null,"PUBLIC WATER",null,null,null,null,null,null,null,"PLANT NAME  ",{"$f":"IF($L$5=\"\",\"\",$L$5)","v":"PDWS Water Treatment Plant"}]
[null,null,"SYSTEM NAME:",{"$f":"IF($D$5=\"\",\"\",$D$5)","v":"TCEQ WSC"},null,null,null,null,null,null,"OR NUMBER:  "]
[]
[null,null,null,null,null,null,null,null,null,null,"FILTER",{"$f":"IF($L$7=\"\",\"\",$L$7)","v":"Filter No. 5"}]
[null,null,"PWS ID No.:",{"$f":"IF($D$7=\"\",\"\",$D$7)","v":1234567},null,null,null,null,null,null,"NUMBER:  "]
[]
[null,null,null,null,null,null,"FILTER PROBE"]
[]
[null,null," NUMBER OF SITES",null,121,null,"ADDITIONAL REMARKS:  One relatively large gravel mound was detected in the northeast corner of the filter."]
[null,null," MEDIA"]
[null,null,"    Max. Thickness   (inches)",null,37]
[null,null,"    Min. Thickness   (inches)",null,26]
[null,null,"    Typ. Thickness   (inches)",null,34]
[null,null,"SUPPORT MATERIAL"]
[null,null,"    Max. Elevation",null,70]
[null,null,"    Min. Elevation",null,77]
[null,null,"    Typ. Elevation",null,75]
[]
[]
[null,null,null,null,null,null,"FILTER EXCAVATION"]
[]
[null,null,null,null,"REFERENCE",null,"SITE 2",null,"SITE 3","SITE 4",null,"SITE 5","SITE 6"]
[null,null,"SITE CHARACTERISTIC",null,"Normal",null,"Normal",null,"Normal","Media Mound",null,"Gravel Mound","Crack"]
[null,null," LAYER 1   (Top Layer)",null,18,null,19,null,18,21,null,14,18]
[null,null," INTERFACE 1",null,2.5,null,2,null,2,1.5,null,1.25,2.5]
[null,null," LAYER 2",null,11,null,12,null,11,11,null,10,12]
[null,null," INTERFACE 2",null,0.75,null,0.5,null,0.75,0.5,null,0.5]
[null,null," LAYER 3",null,4,null,4,null,3.75,3,null,0]
[null,null," INTERFACE 3"]
[null,null," LAYER 4"]
[null,null," MUDBALLS",null,"Few",null,"None",null,"None","Few",null,"None","Few"]
[null,null,"    Max. Size   (inches)",null,0.75,null,null,null,null,0.5,null,null,0.5]
[null,null,"    Min. Size   (inches)",null,0.25,null,null,null,null,0.125,null,null,0.25]
[null,null,"    Max. Depth   (inches)",null,4,null,null,null,null,5,null,null,3]
[]
[null,null,null,null,"SITE 7",null,"SITE 8",null,"SITE 9","SITE 10",null,"SITE 11","SITE 12"]
[null,null,"SITE CHARACTERISTIC",null,"Retraction",null,"Jetting"]
[null,null," LAYER 1   (Top Layer)",null,18,null,18]
[null,null," INTERFACE 1",null,2,null,4.75]
[null,null," LAYER 2",null,12,null,8]
[null,null," INTERFACE 2",null,1,null,2.5]
[null,null," LAYER 3",null,3,null,2]
[null,null," INTERFACE 3"]
[null,null," LAYER 4"]
[null,null," MUDBALLS",null,"Several",null,"None"]
[null,null,"    Max. Size   (inches)",null,0.75]
[null,null,"    Min. Size   (inches)",null,0.25]
[null,null,"    Max. Depth   (inches)",null,7]
[]
[null,null," MEDIA CONDITION",null,null,null,"ADDITIONAL REMARKS:  The sand and garnet seemed in very good shape.  The anthracite seemed slightly worn and encrusted.  The anthracite grains did not seem very uniform in shape or size."]
[null,null,"    Sharpness",null,"Good"]
[null,null,"    Encrustation",null,"Slight"]
[null,null,"    Uniformity",null,"Marginal"]
[]
[]
[null,null,null,null,null,null,"ADDITIONAL STUDIES"]
[]
[null,null," FILTER PROFILE ATTACHED?",null,"Yes",null,"ADDITIONAL REMARKS:  Several of the mudballs were placed in a chlorine solution (200 ppm, pH=4.5) for 12 hours and the mudballs dissolved.    A representative sample of filter media was dried in an oven, weighed, and then placed in the acidified chlorine solution.  After 12 hours, the media was removed, rinsed several times, dried and reweighed.  The media lost 12% of its mass.  The chlorine solution had a brownish tint so we neutralized the chlorine with thiosulfate and ran iron and manganese tests on the material.  The manganese result was 0.55 mg/L and the iron result was 0.2 mg/L."]
[null,null,"Note: A Filter Profile must be attached to this report."]
[]
[null,null," PERCENT MUDBALLS"]
[null,null,"    Media Volume  (ml)",null,1680]
[null,null,"    Mudball Volume  (ml)",null,14]
[null,null,"    % Mudballs",null,{"$f":"IF(AND(ISBLANK(E240),ISBLANK(E241)),\"\",IF(AND(E240<>0,ISBLANK(E241)),\"Mudball Vol. = ?\",IF(AND(ISBLANK(E240),E241<>0),\"Media Vol. = ?\",E241/(E240+E241))))","v":8.2644628099173556E-3}]
[]
[]
[null,null,null,null,null,null,"CONCLUSIONS"]
[]
[null,null,"CONCLUSIONS:  We have lost 5-6 inches of our anthracite and the anthracite that remains seems to no longer meet manufacturer's specifications.  There is also a large gravel mound in one area of the filter.  The presence of the severe backwash jet and the degree that the media layers were intermixed suggests that there is some underdrain damage in that part of the filter.  The filter profile that was run on February 19th suggests that the performance of Filter No. 5 is adversely affected by sudden flow rate changes.  ",null,null,null,null,null,null,null,null,"CORRECTIVE ACTION PLAN ATTACHED?"]
[null,null,null,null,null,null,null,null,null,null,null,"Yes"]
[]
[null,null,null,null,null,null,null,null,null,null,null,"WOULD YOU LIKE SOME TECHNICAL ASSISTANCE FROM THE TCEQ?"]
[]
[null,null,null,null,null,null,null,null,null,null,null,"No"]
[null,null,null,null,null,null,"\\"]
[]
[null,null,"Submitted by: ",null,null,null,null,null,null,null,"     Date:",{"$f":"IF($L$86=\"\",\"\",$L$86)","v":"2016-02-23"}]
[]
[null,null,{"$f":"$C$91","v":"TCEQ - 10277 (02-15-17)"},null,null,null,null,null,"PAGE 3   ",null,null,null,null,"Filter Assessment Report"]
[null,null,"FILTER ASSESSMENT REPORT FOR INDIVIDUAL FILTERS"]
[null,null,"FOR PUBLIC WATER SYSTEMS THAT ARE USING SURFACE WATER SOURCES OR GROUND WATER SOURCES UNDER"]
[null,null,"THE INFLUENCE OF SURFACE WATER THAT ARE REQUIRED TO CONDUCT AN INDIVIDUAL FILTER ASSSESSMENT"]
[]
[null,null,"PUBLIC WATER",null,null,null,null,null,null,null,"PLANT NAME  ",{"$f":"IF($L$5=\"\",\"\",$L$5)","v":"PDWS Water Treatment Plant"}]
[null,null,"SYSTEM NAME:",{"$f":"IF($D$5=\"\",\"\",$D$5)","v":"TCEQ WSC"},null,null,null,null,null,null,"OR NUMBER:  "]
[]
[null,null,null,null,null,null,null,null,null,null,"FILTER",{"$f":"IF($L$7=\"\",\"\",$L$7)","v":"Filter No. 5"}]
[null,null,"PWS ID No.:",{"$f":"IF($D$7=\"\",\"\",$D$7)","v":1234567},null,null,null,null,null,null,"NUMBER:  "]
[]
[null,null,null,null,null,null,"FILTER SCHEMATIC"]
[]
[null,null,"PREPARE A SIMPLE FILTER SCHEMATIC SHOWING THE LOCATION OF BACKWASH WATER TROUGHS, OBSERVED ANOMOLIES, AND EXCAVATION SITES."]
[]
[]
[]
[]
[]
[null,null,"            Excavation Site no."]
[]
[]
[]
[]
[null,null,"         Post-backwash filter mound"]
[]
[]
[]
[]
[null,null,"        Severe backwash jet "]
[null,null,"                or Large Gravel Mound"]
[]
[]
[]
[]
[]
[null,null,"      Pre-backwash media crack"]
[]
[]
[]
[]
[]
[]
[]
[]
[null,null,"     Pre-backwash media retraction"]
[]
[]
[]
[]
[]
[null,null,"   Pre-backwash media depression"]
[]
[]
[]
[]
[]
[null,null,"         Pre-backwash media mound"]
[]
[]
[]
[]
[]
[]
[]
[]
[]
[]
[]
[]
[]
[]
[]
[]
[null,null,"Submitted by: ",null,null,null,null,null,null,null,"     Date:",{"$f":"IF($L$86=\"\",\"\",$L$86)","v":"2016-02-23"}]
[]
[null,null,{"$f":"$C$91","v":"TCEQ - 10277 (02-15-17)"},null,null,null,null,null,"PAGE 4   ",null,null,null,null,"Filter Assessment Report"]
[null,null,"FILTER ASSESSMENT REPORT FOR INDIVIDUAL FILTERS"]
[null,null,"FOR PUBLIC WATER SYSTEMS THAT ARE USING SURFACE WATER SOURCES OR GROUND WATER SOURCES UNDER"]
[null,null,"THE INFLUENCE OF SURFACE WATER THAT ARE REQUIRED TO CONDUCT AN INDIVIDUAL FILTER ASSSESSMENT"]
[]
[null,null,"PUBLIC WATER",null,null,null,null,null,null,null,"PLANT NAME  ",{"$f":"IF($L$5=\"\",\"\",$L$5)","v":"PDWS Water Treatment Plant"}]
[null,null,"SYSTEM NAME:",{"$f":"IF($D$5=\"\",\"\",$D$5)","v":"TCEQ WSC"},null,null,null,null,null,null,"OR NUMBER:  "]
[]
[null,null,null,null,null,null,null,null,null,null,"FILTER",{"$f":"IF($L$7=\"\",\"\",$L$7)","v":"Filter No. 5"}]
[null,null,"PWS ID No.:",{"$f":"IF($D$7=\"\",\"\",$D$7)","v":1234567},null,null,null,null,null,null,"NUMBER:  "]
[]
[null,null,null,null,"NARRATIVE DESCRIPTION OF FILTER PROFILE"]
[]
[null,null,"DESCRIBE THE FILTER PROFILE, INCLUDING THE CAUSE OF ANY TURBIDITY SPIKES GREATER THAN 0.1 NTU AND ANY INTERRUPTION IN THE DATA"]
[]
[]
[null,null,"See Attached Excel Graph"]
[]
[]
[]
[]
[]
[]
[]
[]
[]
[]
[]
[]
[]
[]
[]
[]
[]
[]
[]
[]
[]
[]
[]
[]
[]
[]
[]
[]
[]
[]
[]
[]
[]
[]
[]
[]
[]
[]
[]
[]
[]
[]
[]
[]
[]
[]
[]
[]
[]
[]
[]
[]
[]
[]
[]
[]
[]
[null,null,"Submitted by: ",null,null,null,null,null,null,null,"     Date:",{"$f":"IF($L$86=\"\",\"\",$L$86)","v":"2016-02-23"}]
[]
[null,null,{"$f":"$C$91","v":"TCEQ - 10277 (02-15-17)"},null,null,null,null,null,"PAGE 5   ",null,null,null,null,"Filter Assessment Report"]
[null,null,"FILTER ASSESSMENT REPORT FOR INDIVIDUAL FILTERS"]
[null,null,"FOR PUBLIC WATER SYSTEMS THAT ARE USING SURFACE WATER SOURCES OR GROUND WATER SOURCES UNDER"]
[null,null,"THE INFLUENCE OF SURFACE WATER THAT ARE REQUIRED TO CONDUCT AN INDIVIDUAL FILTER ASSSESSMENT"]
[]
[null,null,"PUBLIC WATER",null,null,null,null,null,null,null,"PLANT NAME  ",{"$f":"IF($L$5=\"\",\"\",$L$5)","v":"PDWS Water Treatment Plant"}]
[null,null,"SYSTEM NAME:",{"$f":"IF($D$5=\"\",\"\",$D$5)","v":"TCEQ WSC"},null,null,null,null,null,null,"OR NUMBER:  "]
[]
[null,null,null,null,null,null,null,null,null,null,"FILTER",{"$f":"IF($L$7=\"\",\"\",$L$7)","v":"Filter No. 5"}]
[null,null,"PWS ID No.:",{"$f":"IF($D$7=\"\",\"\",$D$7)","v":1234567},null,null,null,null,null,null,"NUMBER:  "]
[]
[null,null,null,null,null,"CORRECTIVE ACTION PLAN (OPTIONAL)"]
[]
[null,null,"DESCRIBE THE CORRECTIVE ACTIONS THE SYSTEM WILL TAKE, INCLUDING THE PROPOSED COMPLETION DATA FOR EACH CORRECTIVE ACTION"]
[]
[null,null,"Proposed Completion Date",null,"Proposed Action"]
[null,null,"2016-05-01",null,"Order replacement media for Filter No. 5"]
[null,null,"2016-07-12",null,"Remove media from Filter No. 5 and inspect support gravel layer and underdrain system for evidence of damage"]
[null,null,"2016-07-15",null,"Install new media, backwash, and superchlorinate the filter"]
[null,null,"2016-07-18",null,"Submit coliform samples to the lab"]
[null,null,"2016-07-22",null,"Return the Filter No. 5 to service"]
[]
[null,null,"Note:  This action plan is subject to delays if the filter underdrain is damaged.  In this case, we plan on having our engineering firm evaluate potential"]
[null,null,"corrective actions."]
[]
[]
[]
[]
[]
[]
[]
[]
[]
[]
[]
[]
[]
[]
[]
[]
[]
[]
[]
[]
[]
[]
[]
[]
[]
[]
[]
[]
[]
[]
[]
[]
[]
[]
[]
[]
[]
[]
[]
[]
[]
[]
[]
[]
[]
[]
[]
[]
[]
[]
[null,null,"Submitted by: ",null,null,null,null,null,null,null,"     Date:",{"$f":"IF($L$86=\"\",\"\",$L$86)","v":"2016-02-23"}]
[]
[null,null,{"$f":"$C$91","v":"TCEQ - 10277 (02-15-17)"},null,null,null,null,null,"PAGE 6   ",null,null,null,null,"Filter Assessment Report"]

{"sheet":"Lists","index":1,"n_rows":91,"n_cols":14,"rows_kept":91,"cut":false,"hidden":true,"merged":[]}
[]
["FILTER TYPE",null,null,"OPERATING MODE",null,null,null,"YES/NO LIST",null,null,null,null,"FILTER LOADING RATE (REG)"]
["Gravity",null,null,"Constant Rate/Constant Level",null,null,null,"Yes",null,null,null,null,"Is it 6.5?",{"$f":"IF('Filter Assessment'!E14=\"\",\"\",IF(AND('Filter Assessment'!E14=A3,'Filter Assessment'!K14=D5,OR('Filter Assessment'!E19=A11,'Filter Assessment'!E19=A12,'Filter Assessment'!E19=A14)),\"Yes\",\"No\"))","v":"No"}]
["Pressure",null,null,"Constant Rate/Variable Level",null,null,null,"No",null,null,null,null,"Is it 5?",{"$f":"IF('Filter Assessment'!E14=\"\",\"\",IF(AND('Filter Assessment'!E14=A3,OR('Filter Assessment'!K14=D3,'Filter Assessment'!K14=D4),OR('Filter Assessment'!E19=A11,'Filter Assessment'!E19=A12,'Filter Assessment'!E19=A14)),\"Yes\",\"No\"))","v":"Yes"}]
["Permutit",null,null,"Declining Rate",null,null,null,null,null,null,null,null,"Is it 2.5?",{"$f":"IF('Filter Assessment'!E14=\"\",\"\",IF(AND('Filter Assessment'!E14=A3,'Filter Assessment'!K14=D5,'Filter Assessment'!E19=A13),\"Yes\",\"No\"))","v":"No"}]
["Other",null,null,"Other",null,null,null,null,null,null,null,null,"Is it 2?",{"$f":"IF('Filter Assessment'!E14=\"\",\"\",IF(OR('Filter Assessment'!E14=A4,'Filter Assessment'!E14=A5,AND('Filter Assessment'!E14=Lists!A3,'Filter Assessment'!E19=Lists!A13,OR('Filter Assessment'!K14=D3,'Filter Assessment'!K14=D4))),\"Yes\",\"No\"))","v":"No"}]
[]
[]
[]
["MEDIA TYPE",null,null,"MEDIA MATERIAL",null,null,null,null,null,null,null,null,"BACKWASH LOADING RATE (REG)"]
["Multiple Media",null,null,"Anthracite",null,null,null,null,null,null,null,null,"MAX","MIN"]
["Dual Media",null,null,"Sand",null,null,null,null,null,null,null,null,12.5,21.8]
["Rapid Sand",null,null,"Garnet"]
["Deep-bed Mono Media",null,null,"GAC"]
["Other",null,null,"Other"]
["Unknown",null,null,"Unknown"]
[]
[]
[]
["UNDERDRAIN TYPE",null,null,"SUPPLEMENTAL BW FACILITIES"]
["Perforated Pipe",null,null,"None"]
["Perforated Plate",null,null,"Surface Wash"]
["Wheeler",null,null,"Subsurface Wash"]
["Type-S with gravel",null,null,"Air Scour"]
["Leopold IMS Cap",null,null,"Air Scour (retrofit)"]
["Other",null,null,"Other"]
["Unknown"]
[]
[]
[]
["BW W ATER SOURCE",null,null,"CONTROLLER",null,null,"METER",null,"LOHG"]
["Filter Effluent",null,null,"None",null,null,"None",null,"None"]
["Filters & Pump",null,null,"Fix. weir Splitter",null,null,"Proportional",null,"Differential Gauge"]
["Dedicated BW Pump",null,null,"Var. weir Splitter",null,null,"Venturi",null,"Two Gauges"]
["Service Pumps",null,null,"Man. Telescoping",null,null,"Orifice",null,"Water Lvl Indicator"]
["Elevated BW Tank",null,null,"Man. Butterfly",null,null,"Ultrasonic",null,"Other"]
["Distribution",null,null,"Mechanical ROFC",null,null,"Propeller"]
["Other",null,null,"Mot. Valve (Auto.)",null,null,"Nunating Disk"]
[null,null,null,"Vacuum Pipe",null,null,"Paddle"]
[null,null,null,"Orifice Plate",null,null,"V-notch weir"]
[null,null,null,"Head Control Box",null,null,"Flat Weir"]
[null,null,null,"Other",null,null,"Parshall Flume"]
[null,null,null,null,null,null,"Other"]
[]
[]
[]
["FLOW METER CAL.",null,null,"TURBIDIMETER CAL.",null,null,"ROFC CAL.",null,"CALIBRATION FREQUENCY",null,null,"SOPs"]
["Unknown",null,null,"Formazin",null,null,"Unknown",null,"Less than Annual",null,null,"Complete "]
["Weirs",null,null,"Stabilzed formazin",null,null,"Ultrasonic",null,"Annual",null,null,"Partial"]
["Flume",null,null,"Polymer beads",null,null,"Time & Volume",null,"Semi-annual",null,null,"Out-of-date"]
["Ultrasonic",null,null,"Gel",null,null,"Other",null,"Quarterly",null,null,"None"]
["Time & Volume",null,null,"Comparison",null,null,null,null,"Monthly"]
["Other",null,null,"Proprietary device",null,null,null,null,"Weekly"]
[null,null,null,"Other",null,null,null,null,"Daily"]
[null,null,null,null,null,null,null,null,"More than daily"]
[]
[]
[]
["CONDITION OF FILTER",null,null,"CONDITION OF APPERTENANCES",null,null,null,"FLOC/MUDBALL DISTRIBUTION"]
["Excellent",null,null,"Fully Operational",null,null,null,"Uniform"]
["Good",null,null,"Slight Malfunction",null,null,null,"Localized"]
["Minor Damage",null,null,"Moderate Malfunct",null,null,null,"Other"]
["Moderate Damage",null,null,"Severe Malfunction"]
["Severe Damage",null,null,"Other"]
["Other"]
[]
[]
[]
[]
["TROUGH LEVELNESS",null,null,"FLOODING",null,"SUPPL. EFFECTIVENESS",null,null,"JETTING",null,"BBW DISTRIBUTION"]
["Level",null,null,"None",null,"Excellent",null,null,"Slight",null,"Even/Uniform"]
["Slighly Unlevel",null,null,"Slight",null,"Adequate",null,null,"Moderate",null,"Uneven"]
["Moder. Unlevel",null,null,"Moderate",null,"Poor",null,null,"Severe",null,"Inadequate"]
["Severely Unlevel",null,null,"Severe",null,"Ineffective",null,null,null,null,"Other"]
[null,null,null,"Complete"]
[]
[]
[]
["SITE CONDITION",null,null,"MUDBALLS",null,"SHARPNESS",null,"ENCRUSTATION",null,"UNIFORMITY"]
["Normal",null,null,"None",null,"Excellent",null,"None",null,"Good"]
["Media Mound",null,null,"Few",null,"Good",null,"Slight",null,"Marginal"]
["Media Depression",null,null,"Several",null,"Worn",null,"Moderate",null,"Poor"]
["Crack",null,null,"Many",null,null,null,"Heavy",null,"Other"]
["Retraction"]
["Floc. Accumul."]
["Gravel Mound"]
["Gravel Depression"]
["Poor Suppl. BW"]
["Jetting"]
["Poor BW Distr."]
["Other"]

{"sheet":"Data","index":4,"n_rows":2222,"n_cols":4,"rows_kept":2222,"cut":false,"hidden":false,"merged":[]}
["Time","Flow Rate","IFE NTU","Description of the Event \nor Cause of the Spike"]
["2016-02-19T12:00:00"]
[{"$f":"+A2+0.000694444444444444","v":"2016-02-19T12:01:00"}]
[{"$f":"+A3+0.000694444444444444","v":"2016-02-19T12:02:00"}]
["2016-02-19T12:03:00"]
["2016-02-19T12:04:00"]
["2016-02-19T12:05:00"]
["2016-02-19T12:06:00"]
["2016-02-19T12:07:00"]
["2016-02-19T12:08:00"]
["2016-02-19T12:09:00"]
["2016-02-19T12:10:00"]
["2016-02-19T12:11:00"]
["2016-02-19T12:12:00"]
["2016-02-19T12:13:00"]
["2016-02-19T12:14:00"]
["2016-02-19T12:15:00"]
["2016-02-19T12:16:00"]
["2016-02-19T12:17:00"]
["2016-02-19T12:18:00"]
["2016-02-19T12:19:00"]
["2016-02-19T12:20:00"]
["2016-02-19T12:21:00"]
["2016-02-19T12:22:00"]
["2016-02-19T12:23:00"]
["2016-02-19T12:24:00"]
["2016-02-19T12:25:00"]
["2016-02-19T12:26:00"]
["2016-02-19T12:27:00"]
["2016-02-19T12:28:00"]
["2016-02-19T12:29:00"]
["2016-02-19T12:30:00"]
["2016-02-19T12:31:00"]
["2016-02-19T12:32:00"]
["2016-02-19T12:33:00"]
["2016-02-19T12:34:00"]
["2016-02-19T12:35:00"]
["2016-02-19T12:36:00"]
["2016-02-19T12:37:00"]
["2016-02-19T12:38:00"]
["2016-02-19T12:39:00"]
["2016-02-19T12:40:00"]
["2016-02-19T12:41:00"]
["2016-02-19T12:42:00"]
["2016-02-19T12:43:00"]
["2016-02-19T12:44:00"]
["2016-02-19T12:45:00"]
["2016-02-19T12:46:00"]
["2016-02-19T12:47:00"]
["2016-02-19T12:48:00"]
["2016-02-19T12:49:00"]
["2016-02-19T12:50:00"]
["2016-02-19T12:51:00"]
["2016-02-19T12:52:00"]
["2016-02-19T12:53:00"]
["2016-02-19T12:54:00"]
["2016-02-19T12:55:00"]
["2016-02-19T12:56:00"]
["2016-02-19T12:57:00"]
["2016-02-19T12:58:00"]
["2016-02-19T12:59:00"]
["2016-02-19T13:00:00"]
["2016-02-19T13:01:00"]
["2016-02-19T13:02:00"]
["2016-02-19T13:03:00"]
["2016-02-19T13:04:00"]
["2016-02-19T13:05:00"]
[{"$f":"+A67+0.000694444444444444","v":"2016-02-19T13:06:00"}]
["2016-02-19T13:07:00"]
["2016-02-19T13:08:00"]
["2016-02-19T13:09:00"]
["2016-02-19T13:10:00"]
["2016-02-19T13:11:00"]
["2016-02-19T13:12:00"]
["2016-02-19T13:13:00"]
["2016-02-19T13:14:00"]
["2016-02-19T13:15:00"]
["2016-02-19T13:16:00"]
["2016-02-19T13:17:00"]
["2016-02-19T13:18:00"]
["2016-02-19T13:19:00"]
["2016-02-19T13:20:00"]
["2016-02-19T13:21:00"]
["2016-02-19T13:22:00"]
[{"$f":"+A84+0.000694444444444444","v":"2016-02-19T13:23:00"}]
["2016-02-19T13:24:00"]
["2016-02-19T13:25:00"]
["2016-02-19T13:26:00"]
["2016-02-19T13:27:00"]
[{"$f":"+A89+0.000694444444444444","v":"2016-02-19T13:28:00"},null,0.125,"RTS after backwash"]
["2016-02-19T13:29:00",null,0.128]
[{"$f":"+A91+1/1440","v":"2016-02-19T13:30:00"},null,0.13400000000000001]
["2016-02-19T13:31:00",null,0.13800000000000001]
["2016-02-19T13:32:00",null,0.151]
["2016-02-19T13:33:00",null,0.156]
["2016-02-19T13:34:00",null,0.16300000000000001]
["2016-02-19T13:35:00",null,0.158]
["2016-02-19T13:36:00",null,0.16500000000000001]
["2016-02-19T13:37:00",null,0.16900000000000001]
["2016-02-19T13:38:00",null,0.17599999999999999]
["2016-02-19T13:39:00",null,0.186]
["2016-02-19T13:40:00",null,0.183]
["2016-02-19T13:41:00",null,0.187]
["2016-02-19T13:42:00",null,0.19400000000000001]
["2016-02-19T13:43:00",null,0.193]
["2016-02-19T13:44:00",null,0.19400000000000001]
["2016-02-19T13:45:00",null,0.20300000000000001]
["2016-02-19T13:46:00",null,0.246]
["2016-02-19T13:47:00",null,0.182]
["2016-02-19T13:48:00",null,0.35899999999999999]
["2016-02-19T13:49:00",null,0.40799999999999997]
["2016-02-19T13:50:00",null,0.42199999999999999]
["2016-02-19T13:51:00",null,0.46800000000000003]
["2016-02-19T13:52:00",null,0.496]
["2016-02-19T13:53:00",null,0.51100000000000001]
["2016-02-19T13:54:00",null,0.54900000000000004]
["2016-02-19T13:55:00",null,0.57899999999999996]
["2016-02-19T13:56:00",null,0.61399999999999999]
["2016-02-19T13:57:00",null,0.58199999999999996]
["2016-02-19T13:58:00",null,0.51400000000000001]
["2016-02-19T13:59:00",null,0.47799999999999998]
["2016-02-19T14:00:00",null,0.443]
["2016-02-19T14:01:00",null,0.42699999999999999]
["2016-02-19T14:02:00",null,0.40300000000000002]
["2016-02-19T14:03:00",null,0.39800000000000002]
["2016-02-19T14:04:00",null,0.39500000000000002]
["2016-02-19T14:05:00",null,0.39200000000000002]
["2016-02-19T14:06:00",null,0.39]
["2016-02-19T14:07:00",null,0.38700000000000001]
["2016-02-19T14:08:00",null,0.373]
["2016-02-19T14:09:00",null,0.38200000000000001]
["2016-02-19T14:10:00",null,0.34300000000000003]
["2016-02-19T14:11:00",null,0.35299999999999998]
["2016-02-19T14:12:00",null,0.35199999999999998]
["2016-02-19T14:13:00",null,0.34699999999999998]
["2016-02-19T14:14:00",null,0.34300000000000003]
["2016-02-19T14:15:00",null,0.34599999999999997]
["2016-02-19T14:16:00",null,0.34599999999999997]
["2016-02-19T14:17:00",null,0.34599999999999997]
["2016-02-19T14:18:00",null,0.34799999999999998]
["2016-02-19T14:19:00",null,0.34599999999999997]
["2016-02-19T14:20:00",null,0.34399999999999997]
["2016-02-19T14:21:00",null,0.34300000000000003]
["2016-02-19T14:22:00",null,0.34100000000000003]
["2016-02-19T14:23:00",null,0.34100000000000003]
["2016-02-19T14:24:00",null,0.34]
["2016-02-19T14:25:00",null,0.33900000000000002]
["2016-02-19T14:26:00",null,0.33800000000000002]
["2016-02-19T14:27:00",null,0.33800000000000002]
["2016-02-19T14:28:00",null,0.33700000000000002]
["2016-02-19T14:29:00",null,0.33600000000000002]
["2016-02-19T14:30:00",null,0.33500000000000002]
["2016-02-19T14:31:00",null,0.33500000000000002]
["2016-02-19T14:32:00",null,0.33500000000000002]
["2016-02-19T14:33:00",null,0.33700000000000002]
[{"$f":"+A155+1/1440","v":"2016-02-19T14:34:00"},null,0.33400000000000002]
["2016-02-19T14:35:00",null,0.33500000000000002]
["2016-02-19T14:36:00",null,0.33200000000000002]
["2016-02-19T14:37:00",null,0.33100000000000002]
["2016-02-19T14:38:00",null,0.33]
["2016-02-19T14:39:00",null,0.33]
["2016-02-19T14:40:00",null,0.32900000000000001]
["2016-02-19T14:41:00",null,0.32800000000000001]
["2016-02-19T14:42:00",null,0.32800000000000001]
["2016-02-19T14:43:00",null,0.32700000000000001]
["2016-02-19T14:44:00",null,0.32700000000000001]
["2016-02-19T14:45:00",null,0.32800000000000001]
["2016-02-19T14:46:00",null,0.32600000000000001]
["2016-02-19T14:47:00",null,0.32500000000000001]
["2016-02-19T14:48:00",null,0.32400000000000001]
["2016-02-19T14:49:00",null,0.32600000000000001]
["2016-02-19T14:50:00",null,0.32200000000000001]
["2016-02-19T14:51:00",null,0.32200000000000001]
["2016-02-19T14:52:00",null,0.318]
["2016-02-19T14:53:00",null,0.31900000000000001]
["2016-02-19T14:54:00",null,0.317]
["2016-02-19T14:55:00",null,0.317]
["2016-02-19T14:56:00",null,0.316]
["2016-02-19T14:57:00",null,0.316]
["2016-02-19T14:58:00",null,0.315]
["2016-02-19T14:59:00",null,0.315]
["2016-02-19T15:00:00",null,0.314]
["2016-02-19T15:01:00",null,0.313]
["2016-02-19T15:02:00",null,0.314]
["2016-02-19T15:03:00",null,0.313]
["2016-02-19T15:04:00",null,0.313]
["2016-02-19T15:05:00",null,0.312]
["2016-02-19T15:06:00",null,0.311]
["2016-02-19T15:07:00",null,0.314]
["2016-02-19T15:08:00",null,0.313]
["2016-02-19T15:09:00",null,0.314]
["2016-02-19T15:10:00",null,0.313]
["2016-02-19T15:11:00",null,0.313]
["2016-02-19T15:12:00",null,0.314]
["2016-02-19T15:13:00",null,0.313]
["2016-02-19T15:14:00",null,0.312]
["2016-02-19T15:15:00",null,0.313]
["2016-02-19T15:16:00",null,0.31]
["2016-02-19T15:17:00",null,0.309]
["2016-02-19T15:18:00",null,0.31]
["2016-02-19T15:19:00",null,0.309]
["2016-02-19T15:20:00",null,0.308]
["2016-02-19T15:21:00",null,0.307]
["2016-02-19T15:22:00",null,0.307]
["2016-02-19T15:23:00",null,0.308]
["2016-02-19T15:24:00",null,0.30599999999999999]
["2016-02-19T15:25:00",null,0.30399999999999999]
["2016-02-19T15:26:00",null,0.30499999999999999]
["2016-02-19T15:27:00",null,0.30599999999999999]
["2016-02-19T15:28:00",null,0.30399999999999999]
["2016-02-19T15:29:00",null,0.30299999999999999]
["2016-02-19T15:30:00",null,0.30399999999999999]
["2016-02-19T15:31:00",null,0.30199999999999999]
["2016-02-19T15:32:00",null,0.30299999999999999]
["2016-02-19T15:33:00",null,0.30199999999999999]
["2016-02-19T15:34:00",null,0.30099999999999999]
["2016-02-19T15:35:00",null,0.3]
["2016-02-19T15:36:00",null,0.3]
["2016-02-19T15:37:00",null,0.30099999999999999]
[{"$f":"+A219+1/1440","v":"2016-02-19T15:38:00"},null,0.30099999999999999]
["2016-02-19T15:39:00",null,0.3]
["2016-02-19T15:40:00",null,0.29899999999999999]
["2016-02-19T15:41:00",null,0.28499999999999998]
["2016-02-19T15:42:00",null,0.29899999999999999]
["2016-02-19T15:43:00",null,0.3]
["2016-02-19T15:44:00",null,0.29699999999999999]
["2016-02-19T15:45:00",null,0.29799999999999999]
["2016-02-19T15:46:00",null,0.29699999999999999]
["2016-02-19T15:47:00",null,0.29599999999999999]
["2016-02-19T15:48:00",null,0.29499999999999998]
["2016-02-19T15:49:00",null,0.29299999999999998]
["2016-02-19T15:50:00",null,0.29399999999999998]
["2016-02-19T15:51:00",null,0.29299999999999998]
["2016-02-19T15:52:00",null,0.29099999999999998]
["2016-02-19T15:53:00",null,0.28899999999999998]
["2016-02-19T15:54:00",null,0.28899999999999998]
["2016-02-19T15:55:00",null,0.28699999999999998]
["2016-02-19T15:56:00",null,0.28699999999999998]
["2016-02-19T15:57:00",null,0.28599999999999998]
["2016-02-19T15:58:00",null,0.28599999999999998]
["2016-02-19T15:59:00",null,0.28499999999999998]
["2016-02-19T16:00:00",null,0.28499999999999998]
["2016-02-19T16:01:00",null,0.28599999999999998]
["2016-02-19T16:02:00",null,0.28499999999999998]
["2016-02-19T16:03:00",null,0.28399999999999997]
["2016-02-19T16:04:00",null,0.28399999999999997]
["2016-02-19T16:05:00",null,0.28499999999999998]
["2016-02-19T16:06:00",null,0.28399999999999997]
["2016-02-19T16:07:00",null,0.28299999999999997]
["2016-02-19T16:08:00",null,0.28299999999999997]
["2016-02-19T16:09:00",null,0.28199999999999997]
["2016-02-19T16:10:00",null,0.28199999999999997]
["2016-02-19T16:11:00",null,0.28100000000000003]
["2016-02-19T16:12:00",null,0.28100000000000003]
["2016-02-19T16:13:00",null,0.28100000000000003]
["2016-02-19T16:14:00",null,0.28000000000000003]
["2016-02-19T16:15:00",null,0.27900000000000003]
["2016-02-19T16:16:00",null,0.27800000000000002]
["2016-02-19T16:17:00",null,0.27900000000000003]
["2016-02-19T16:18:00",null,0.27700000000000002]
["2016-02-19T16:19:00",null,0.27700000000000002]
["2016-02-19T16:20:00",null,0.27700000000000002]
["2016-02-19T16:21:00",null,0.27600000000000002]
["2016-02-19T16:22:00",null,0.27700000000000002]
["2016-02-19T16:23:00",null,0.27800000000000002]
["2016-02-19T16:24:00",null,0.27700000000000002]
["2016-02-19T16:25:00",null,0.27600000000000002]
["2016-02-19T16:26:00",null,0.27600000000000002]
["2016-02-19T16:27:00",null,0.27600000000000002]
["2016-02-19T16:28:00",null,0.27500000000000002]
["2016-02-19T16:29:00",null,0.27600000000000002]
["2016-02-19T16:30:00",null,0.27500000000000002]
["2016-02-19T16:31:00",null,0.27500000000000002]
["2016-02-19T16:32:00",null,0.27400000000000002]
["2016-02-19T16:33:00",null,0.27500000000000002]
["2016-02-19T16:34:00",null,0.27400000000000002]
["2016-02-19T16:35:00",null,0.27400000000000002]
["2016-02-19T16:36:00",null,0.27300000000000002]
["2016-02-19T16:37:00",null,0.27400000000000002]
["2016-02-19T16:38:00",null,0.27300000000000002]
["2016-02-19T16:39:00",null,0.27300000000000002]
["2016-02-19T16:40:00",null,0.27200000000000002]
["2016-02-19T16:41:00",null,0.27300000000000002]
[{"$f":"+A283+1/1440","v":"2016-02-19T16:42:00"},null,0.27200000000000002]
["2016-02-19T16:43:00",null,0.27100000000000002]
["2016-02-19T16:44:00",null,0.27]
["2016-02-19T16:45:00",null,0.27]
["2016-02-19T16:46:00",null,0.27]
["2016-02-19T16:47:00",null,0.26900000000000002]
["2016-02-19T16:48:00",null,0.26900000000000002]
["2016-02-19T16:49:00",null,0.26900000000000002]
["2016-02-19T16:50:00",null,0.26800000000000002]
["2016-02-19T16:51:00",null,0.26800000000000002]
["2016-02-19T16:52:00",null,0.26800000000000002]
["2016-02-19T16:53:00",null,0.26700000000000002]
["2016-02-19T16:54:00",null,0.26800000000000002]
["2016-02-19T16:55:00",null,0.26700000000000002]
["2016-02-19T16:56:00",null,0.26700000000000002]
["2016-02-19T16:57:00",null,0.26600000000000001]
["2016-02-19T16:58:00",null,0.26500000000000001]
["2016-02-19T16:59:00",null,0.26600000000000001]
["2016-02-19T17:00:00",null,0.26500000000000001]
["2016-02-19T17:01:00",null,0.26500000000000001]
["2016-02-19T17:02:00",null,0.26400000000000001]
["2016-02-19T17:03:00",null,0.26500000000000001]
["2016-02-19T17:04:00",null,0.26400000000000001]
["2016-02-19T17:05:00",null,0.26400000000000001]
["2016-02-19T17:06:00",null,0.26300000000000001]
["2016-02-19T17:07:00",null,0.26500000000000001]
["2016-02-19T17:08:00",null,0.26300000000000001]
["2016-02-19T17:09:00",null,0.26300000000000001]
["2016-02-19T17:10:00",null,0.26200000000000001]
["2016-02-19T17:11:00",null,0.26300000000000001]
["2016-02-19T17:12:00",null,0.26200000000000001]
["2016-02-19T17:13:00",null,0.26300000000000001]
["2016-02-19T17:14:00",null,0.26300000000000001]
["2016-02-19T17:15:00",null,0.26200000000000001]
["2016-02-19T17:16:00",null,0.26200000000000001]
["2016-02-19T17:17:00",null,0.26300000000000001]
["2016-02-19T17:18:00",null,0.26100000000000001]
["2016-02-19T17:19:00",null,0.26100000000000001]
["2016-02-19T17:20:00",null,0.26200000000000001]
["2016-02-19T17:21:00",null,0.26100000000000001]
["2016-02-19T17:22:00",null,0.26100000000000001]
["2016-02-19T17:23:00",null,0.26100000000000001]
["2016-02-19T17:24:00",null,0.26100000000000001]
["2016-02-19T17:25:00",null,0.26]
["2016-02-19T17:26:00",null,0.26100000000000001]
["2016-02-19T17:27:00",null,0.26200000000000001]
["2016-02-19T17:28:00",null,0.26300000000000001]
["2016-02-19T17:29:00",null,0.26100000000000001]
["2016-02-19T17:30:00",null,0.26200000000000001,"4 hr"]
["2016-02-19T17:31:00",null,0.25800000000000001]
["2016-02-19T17:32:00",null,0.25700000000000001]
["2016-02-19T17:33:00",null,0.25600000000000001]
["2016-02-19T17:34:00",null,0.25600000000000001]
["2016-02-19T17:35:00",null,0.254]
["2016-02-19T17:36:00",null,0.253]
["2016-02-19T17:37:00",null,0.254]
["2016-02-19T17:38:00",null,0.253]
["2016-02-19T17:39:00",null,0.253]
["2016-02-19T17:40:00",null,0.252]
["2016-02-19T17:41:00",null,0.252]
["2016-02-19T17:42:00",null,0.251]
["2016-02-19T17:43:00",null,0.251]
["2016-02-19T17:44:00",null,0.25]
["2016-02-19T17:45:00",null,0.249]
[{"$f":"+A347+1/1440","v":"2016-02-19T17:46:00"},null,0.246]
["2016-02-19T17:47:00",null,0.247]
["2016-02-19T17:48:00",null,0.245]
["2016-02-19T17:49:00",null,0.24299999999999999]
["2016-02-19T17:50:00",null,0.24199999999999999]
["2016-02-19T17:51:00",null,0.24199999999999999]
["2016-02-19T17:52:00",null,0.24099999999999999]
["2016-02-19T17:53:00",null,0.24]
["2016-02-19T17:54:00",null,0.24]
["2016-02-19T17:55:00",null,0.23899999999999999]
["2016-02-19T17:56:00",null,0.23699999999999999]
["2016-02-19T17:57:00",null,0.24099999999999999]
["2016-02-19T17:58:00",null,0.247]
["2016-02-19T17:59:00",null,0.252,"Q Increase"]
["2016-02-19T18:00:00",null,0.25800000000000001]
["2016-02-19T18:01:00",null,0.26800000000000002]
["2016-02-19T18:02:00",null,0.28899999999999998]
["2016-02-19T18:03:00",null,0.313]
["2016-02-19T18:04:00",null,0.32500000000000001]
["2016-02-19T18:05:00",null,0.33600000000000002]
["2016-02-19T18:06:00",null,0.33400000000000002]
["2016-02-19T18:07:00",null,0.33500000000000002]
["2016-02-19T18:08:00",null,0.33300000000000002]
["2016-02-19T18:09:00",null,0.33600000000000002]
["2016-02-19T18:10:00",null,0.33400000000000002]
["2016-02-19T18:11:00",null,0.33400000000000002]
["2016-02-19T18:12:00",null,0.33500000000000002]
["2016-02-19T18:13:00",null,0.33400000000000002]
["2016-02-19T18:14:00",null,0.33300000000000002]
["2016-02-19T18:15:00",null,0.33200000000000002]
["2016-02-19T18:16:00",null,0.33100000000000002]
["2016-02-19T18:17:00",null,0.32900000000000001]
["2016-02-19T18:18:00",null,0.32800000000000001]
["2016-02-19T18:19:00",null,0.32700000000000001]
["2016-02-19T18:20:00",null,0.32800000000000001]
["2016-02-19T18:21:00",null,0.32700000000000001]
["2016-02-19T18:22:00",null,0.32600000000000001]
["2016-02-19T18:23:00",null,0.32600000000000001]
["2016-02-19T18:24:00",null,0.32500000000000001]
["2016-02-19T18:25:00",null,0.32400000000000001]
["2016-02-19T18:26:00",null,0.32500000000000001]
["2016-02-19T18:27:00",null,0.32400000000000001]
["2016-02-19T18:28:00",null,0.32300000000000001]
["2016-02-19T18:29:00",null,0.32300000000000001]
["2016-02-19T18:30:00",null,0.32100000000000001]
["2016-02-19T18:31:00",null,0.32100000000000001]
["2016-02-19T18:32:00",null,0.32]
["2016-02-19T18:33:00",null,0.32100000000000001]
["2016-02-19T18:34:00",null,0.32]
["2016-02-19T18:35:00",null,0.32300000000000001]
["2016-02-19T18:36:00",null,0.32100000000000001]
["2016-02-19T18:37:00",null,0.32200000000000001]
["2016-02-19T18:38:00",null,0.32100000000000001]
["2016-02-19T18:39:00",null,0.32]
["2016-02-19T18:40:00",null,0.32]
["2016-02-19T18:41:00",null,0.31900000000000001]
["2016-02-19T18:42:00",null,0.316]
["2016-02-19T18:43:00",null,0.317]
["2016-02-19T18:44:00",null,0.316]
["2016-02-19T18:45:00",null,0.315]
["2016-02-19T18:46:00",null,0.315]
["2016-02-19T18:47:00",null,0.314]
["2016-02-19T18:48:00",null,0.313]
["2016-02-19T18:49:00",null,0.313]
[{"$f":"+A411+1/1440","v":"2016-02-19T18:50:00"},null,0.314]
["2016-02-19T18:51:00",null,0.313]
["2016-02-19T18:52:00",null,0.313]
["2016-02-19T18:53:00",null,0.311]
["2016-02-19T18:54:00",null,0.311]
["2016-02-19T18:55:00",null,0.309]
["2016-02-19T18:56:00",null,0.308]
["2016-02-19T18:57:00",null,0.309]
["2016-02-19T18:58:00",null,0.308]
["2016-02-19T18:59:00",null,0.307]
["2016-02-19T19:00:00",null,0.30499999999999999]
["2016-02-19T19:01:00",null,0.30399999999999999]
["2016-02-19T19:02:00",null,0.30299999999999999]
["2016-02-19T19:03:00",null,0.30399999999999999]
["2016-02-19T19:04:00",null,0.30499999999999999]
["2016-02-19T19:05:00",null,0.30299999999999999]
["2016-02-19T19:06:00",null,0.30299999999999999]
["2016-02-19T19:07:00",null,0.30099999999999999]
["2016-02-19T19:08:00",null,0.30199999999999999]
["2016-02-19T19:09:00",null,0.30099999999999999]
["2016-02-19T19:10:00",null,0.3]
["2016-02-19T19:11:00",null,0.3]
["2016-02-19T19:12:00",null,0.30399999999999999]
["2016-02-19T19:13:00",null,0.29799999999999999]
["2016-02-19T19:14:00",null,0.30099999999999999]
["2016-02-19T19:15:00",null,0.29899999999999999]
["2016-02-19T19:16:00",null,0.29799999999999999]
["2016-02-19T19:17:00",null,0.29799999999999999]
["2016-02-19T19:18:00",null,0.29699999999999999]
["2016-02-19T19:19:00",null,0.29599999999999999]
["2016-02-19T19:20:00",null,0.29699999999999999]
["2016-02-19T19:21:00",null,0.28000000000000003]
["2016-02-19T19:22:00",null,0.29599999999999999]
["2016-02-19T19:23:00",null,0.29499999999999998]
["2016-02-19T19:24:00",null,0.29699999999999999]
["2016-02-19T19:25:00",null,0.29599999999999999]
["2016-02-19T19:26:00",null,0.29499999999999998]
["2016-02-19T19:27:00",null,0.29299999999999998]
["2016-02-19T19:28:00",null,0.29199999999999998]
["2016-02-19T19:29:00",null,0.29199999999999998]
["2016-02-19T19:30:00",null,0.29099999999999998]
["2016-02-19T19:31:00",null,0.28899999999999998]
["2016-02-19T19:32:00",null,0.28999999999999998]
["2016-02-19T19:33:00",null,0.28899999999999998]
["2016-02-19T19:34:00",null,0.28699999999999998]
["2016-02-19T19:35:00",null,0.28599999999999998]
["2016-02-19T19:36:00",null,0.28699999999999998]
["2016-02-19T19:37:00",null,0.28599999999999998]
["2016-02-19T19:38:00",null,0.28499999999999998]
["2016-02-19T19:39:00",null,0.28299999999999997]
["2016-02-19T19:40:00",null,0.28299999999999997]
["2016-02-19T19:41:00",null,0.28299999999999997]
["2016-02-19T19:42:00",null,0.28199999999999997]
["2016-02-19T19:43:00",null,0.28100000000000003]
["2016-02-19T19:44:00",null,0.28199999999999997]
["2016-02-19T19:45:00",null,0.28100000000000003]
["2016-02-19T19:46:00",null,0.28000000000000003]
["2016-02-19T19:47:00",null,0.28000000000000003]
["2016-02-19T19:48:00",null,0.27800000000000002]
["2016-02-19T19:49:00",null,0.27700000000000002]
["2016-02-19T19:50:00",null,0.27700000000000002]
["2016-02-19T19:51:00",null,0.27600000000000002]
["2016-02-19T19:52:00",null,0.27600000000000002]
["2016-02-19T19:53:00",null,0.27500000000000002]
[{"$f":"+A475+1/1440","v":"2016-02-19T19:54:00"},null,0.27500000000000002]
["2016-02-19T19:55:00",null,0.27400000000000002]
["2016-02-19T19:56:00",null,0.27300000000000002]
["2016-02-19T19:57:00",null,0.27200000000000002]
["2016-02-19T19:58:00",null,0.27100000000000002]
["2016-02-19T19:59:00",null,0.27]
["2016-02-19T20:00:00",null,0.27]
["2016-02-19T20:01:00",null,0.26900000000000002]
["2016-02-19T20:02:00",null,0.26800000000000002]
["2016-02-19T20:03:00",null,0.26800000000000002]
["2016-02-19T20:04:00",null,0.26700000000000002]
["2016-02-19T20:05:00",null,0.26500000000000001]
["2016-02-19T20:06:00",null,0.26400000000000001]
["2016-02-19T20:07:00",null,0.26400000000000001]
["2016-02-19T20:08:00",null,0.26200000000000001]
["2016-02-19T20:09:00",null,0.26300000000000001]
["2016-02-19T20:10:00",null,0.26100000000000001]
["2016-02-19T20:11:00",null,0.26200000000000001]
["2016-02-19T20:12:00",null,0.26100000000000001]
["2016-02-19T20:13:00",null,0.26]
["2016-02-19T20:14:00",null,0.26200000000000001]
["2016-02-19T20:15:00",null,0.26300000000000001]
["2016-02-19T20:16:00",null,0.26400000000000001]
["2016-02-19T20:17:00",null,0.26300000000000001]
["2016-02-19T20:18:00",null,0.26500000000000001]
["2016-02-19T20:19:00",null,0.26300000000000001]
["2016-02-19T20:20:00",null,0.26400000000000001]
["2016-02-19T20:21:00",null,0.26300000000000001]
["2016-02-19T20:22:00",null,0.26200000000000001]
["2016-02-19T20:23:00",null,0.26300000000000001]
["2016-02-19T20:24:00",null,0.26300000000000001]
["2016-02-19T20:25:00",null,0.26200000000000001]
["2016-02-19T20:26:00",null,0.316]
["2016-02-19T20:27:00",null,0.33700000000000002]
["2016-02-19T20:28:00",null,0.41499999999999998,"BW Filter 3"]
["2016-02-19T20:29:00",null,0.443]
["2016-02-19T20:30:00",null,0.46200000000000002,"MDR"]
["2016-02-19T20:31:00",null,0.48399999999999999]
["2016-02-19T20:32:00",null,0.49199999999999999]
["2016-02-19T20:33:00",null,0.50600000000000001]
["2016-02-19T20:34:00",null,0.503]
["2016-02-19T20:35:00",null,0.5]
["2016-02-19T20:36:00",null,0.498]
["2016-02-19T20:37:00",null,0.48699999999999999]
["2016-02-19T20:38:00",null,0.49199999999999999]
["2016-02-19T20:39:00",null,0.48599999999999999]
["2016-02-19T20:40:00",null,0.48199999999999998]
["2016-02-19T20:41:00",null,0.47799999999999998]
["2016-02-19T20:42:00",null,0.47499999999999998]
["2016-02-19T20:43:00",null,0.46300000000000002]
["2016-02-19T20:44:00",null,0.45800000000000002]
["2016-02-19T20:45:00",null,0.45900000000000002]
["2016-02-19T20:46:00",null,0.45100000000000001]
["2016-02-19T20:47:00",null,0.44900000000000001]
["2016-02-19T20:48:00",null,0.44800000000000001]
["2016-02-19T20:49:00",null,0.44600000000000001]
["2016-02-19T20:50:00",null,0.435]
["2016-02-19T20:51:00",null,0.43]
["2016-02-19T20:52:00",null,0.432]
["2016-02-19T20:53:00",null,0.432]
["2016-02-19T20:54:00",null,0.42799999999999999]
["2016-02-19T20:55:00",null,0.42599999999999999]
["2016-02-19T20:56:00",null,0.42699999999999999]
["2016-02-19T20:57:00",null,0.42499999999999999]
[{"$f":"+A539+1/1440","v":"2016-02-19T20:58:00"},null,0.42299999999999999]
["2016-02-19T20:59:00",null,0.42199999999999999]
["2016-02-19T21:00:00",null,0.42]
["2016-02-19T21:01:00",null,0.41799999999999998]
["2016-02-19T21:02:00",null,0.41599999999999998]
["2016-02-19T21:03:00",null,0.41599999999999998]
["2016-02-19T21:04:00",null,0.41499999999999998]
["2016-02-19T21:05:00",null,0.41299999999999998]
["2016-02-19T21:06:00",null,0.41199999999999998]
["2016-02-19T21:07:00",null,0.41299999999999998]
["2016-02-19T21:08:00",null,0.41199999999999998]
["2016-02-19T21:09:00",null,0.41399999999999998]
["2016-02-19T21:10:00",null,0.41299999999999998]
["2016-02-19T21:11:00",null,0.41199999999999998]
["2016-02-19T21:12:00",null,0.41199999999999998]
["2016-02-19T21:13:00",null,0.41]
["2016-02-19T21:14:00",null,0.40899999999999997]
["2016-02-19T21:15:00",null,0.41]
["2016-02-19T21:16:00",null,0.40799999999999997]
["2016-02-19T21:17:00",null,0.40699999999999997]
["2016-02-19T21:18:00",null,0.40600000000000003]
["2016-02-19T21:19:00",null,0.40500000000000003]
["2016-02-19T21:20:00",null,0.40600000000000003]
["2016-02-19T21:21:00",null,0.40300000000000002]
["2016-02-19T21:22:00",null,0.40200000000000002]
["2016-02-19T21:23:00",null,0.4]
["2016-02-19T21:24:00",null,0.39900000000000002]
["2016-02-19T21:25:00",null,0.40100000000000002]
["2016-02-19T21:26:00",null,0.40200000000000002]
["2016-02-19T21:27:00",null,0.40300000000000002]
["2016-02-19T21:28:00",null,0.40200000000000002]
["2016-02-19T21:29:00",null,0.40400000000000003]
["2016-02-19T21:30:00",null,0.40200000000000002]
["2016-02-19T21:31:00",null,0.40200000000000002]
["2016-02-19T21:32:00",null,0.40300000000000002]
["2016-02-19T21:33:00",null,0.21099999999999999]
["2016-02-19T21:34:00",null,0.21299999999999999]
["2016-02-19T21:35:00",null,0.215]
["2016-02-19T21:36:00",null,0.21199999999999999]
["2016-02-19T21:37:00",null,0.21099999999999999]
["2016-02-19T21:38:00",null,0.27200000000000002]
["2016-02-19T21:39:00",null,0.26800000000000002]
["2016-02-19T21:40:00",null,0.26100000000000001]
["2016-02-19T21:41:00",null,0.26]
["2016-02-19T21:42:00",null,0.25800000000000001]
["2016-02-19T21:43:00",null,0.24299999999999999]
["2016-02-19T21:44:00",null,0.23400000000000001]
["2016-02-19T21:45:00",null,0.22500000000000001]
["2016-02-19T21:46:00",null,0.221]
["2016-02-19T21:47:00",null,0.218]
["2016-02-19T21:48:00",null,0.214]
["2016-02-19T21:49:00",null,0.21299999999999999]
["2016-02-19T21:50:00",null,0.21]
["2016-02-19T21:51:00",null,0.20799999999999999]
["2016-02-19T21:52:00",null,0.20599999999999999]
["2016-02-19T21:53:00",null,0.20399999999999999]
["2016-02-19T21:54:00",null,0.20499999999999999]
["2016-02-19T21:55:00",null,0.20300000000000001]
["2016-02-19T21:56:00",null,0.20200000000000001]
["2016-02-19T21:57:00",null,0.19800000000000001]
["2016-02-19T21:58:00",null,0.19600000000000001]
["2016-02-19T21:59:00",null,0.19400000000000001]
["2016-02-19T22:00:00",null,0.193]
["2016-02-19T22:01:00",null,0.192]
[{"$f":"+A603+1/1440","v":"2016-02-19T22:02:00"},null,0.188]
["2016-02-19T22:03:00",null,0.191]
["2016-02-19T22:04:00",null,0.191]
["2016-02-19T22:05:00",null,0.188]
["2016-02-19T22:06:00",null,0.186]
["2016-02-19T22:07:00",null,0.187]
["2016-02-19T22:08:00",null,0.186]
["2016-02-19T22:09:00",null,0.185]
["2016-02-19T22:10:00",null,0.185]
["2016-02-19T22:11:00",null,0.185]
["2016-02-19T22:12:00",null,0.184]
["2016-02-19T22:13:00",null,0.183]
["2016-02-19T22:14:00",null,0.183]
["2016-02-19T22:15:00",null,0.182]
["2016-02-19T22:16:00",null,0.18099999999999999]
["2016-02-19T22:17:00",null,0.17899999999999999]
["2016-02-19T22:18:00",null,0.17599999999999999]
["2016-02-19T22:19:00",null,0.17499999999999999]
["2016-02-19T22:20:00",null,0.17499999999999999]
["2016-02-19T22:21:00",null,0.17399999999999999]
["2016-02-19T22:22:00",null,0.17399999999999999]
["2016-02-19T22:23:00",null,0.17399999999999999]
["2016-02-19T22:24:00",null,0.17299999999999999]
["2016-02-19T22:25:00",null,0.17199999999999999]
["2016-02-19T22:26:00",null,0.17199999999999999]
["2016-02-19T22:27:00",null,0.17]
["2016-02-19T22:28:00",null,0.17]
["2016-02-19T22:29:00",null,0.16900000000000001]
["2016-02-19T22:30:00",null,0.16900000000000001]
["2016-02-19T22:31:00",null,0.16900000000000001]
["2016-02-19T22:32:00",null,0.16800000000000001]
["2016-02-19T22:33:00",null,0.16800000000000001]
["2016-02-19T22:34:00",null,0.16800000000000001]
["2016-02-19T22:35:00",null,0.16800000000000001]
["2016-02-19T22:36:00",null,0.16800000000000001]
["2016-02-19T22:37:00",null,0.16800000000000001]
["2016-02-19T22:38:00",null,0.16700000000000001]
["2016-02-19T22:39:00",null,0.16700000000000001]
["2016-02-19T22:40:00",null,0.16700000000000001]
["2016-02-19T22:41:00",null,0.16700000000000001]
["2016-02-19T22:42:00",null,0.16700000000000001]
["2016-02-19T22:43:00",null,0.17100000000000001]
["2016-02-19T22:44:00",null,0.16700000000000001]
["2016-02-19T22:45:00",null,0.16600000000000001]
["2016-02-19T22:46:00",null,0.16500000000000001]
["2016-02-19T22:47:00",null,0.16500000000000001]
["2016-02-19T22:48:00",null,0.16500000000000001]
["2016-02-19T22:49:00",null,0.16500000000000001]
["2016-02-19T22:50:00",null,0.16600000000000001]
["2016-02-19T22:51:00",null,0.16500000000000001]
["2016-02-19T22:52:00",null,0.16400000000000001]
["2016-02-19T22:53:00",null,0.16400000000000001]
["2016-02-19T22:54:00",null,0.16400000000000001]
["2016-02-19T22:55:00",null,0.16300000000000001]
["2016-02-19T22:56:00",null,0.16300000000000001]
["2016-02-19T22:57:00",null,0.16200000000000001]
["2016-02-19T22:58:00",null,0.161]
["2016-02-19T22:59:00",null,0.16200000000000001]
["2016-02-19T23:00:00",null,0.16]
["2016-02-19T23:01:00",null,0.158]
["2016-02-19T23:02:00",null,0.158]
["2016-02-19T23:03:00",null,0.158]
["2016-02-19T23:04:00",null,0.157]
["2016-02-19T23:05:00",null,0.157]
[{"$f":"+A667+1/1440","v":"2016-02-19T23:06:00"},null,0.156]
["2016-02-19T23:07:00",null,0.155]
["2016-02-19T23:08:00",null,0.154]
["2016-02-19T23:09:00",null,0.154]
["2016-02-19T23:10:00",null,0.153]
["2016-02-19T23:11:00",null,0.153]
["2016-02-19T23:12:00",null,0.151]
["2016-02-19T23:13:00",null,0.151]
["2016-02-19T23:14:00",null,0.151]
["2016-02-19T23:15:00",null,0.14799999999999999]
["2016-02-19T23:16:00",null,0.14599999999999999]
["2016-02-19T23:17:00",null,0.14499999999999999]
["2016-02-19T23:18:00",null,0.14399999999999999]
["2016-02-19T23:19:00",null,0.14399999999999999]
["2016-02-19T23:20:00",null,0.14199999999999999]
["2016-02-19T23:21:00",null,0.14299999999999999]
["2016-02-19T23:22:00",null,0.14299999999999999]
["2016-02-19T23:23:00",null,0.14199999999999999]
["2016-02-19T23:24:00",null,0.13900000000000001]
["2016-02-19T23:25:00",null,0.13600000000000001]
["2016-02-19T23:26:00",null,0.13800000000000001]
["2016-02-19T23:27:00",null,0.13700000000000001]
["2016-02-19T23:28:00",null,0.13600000000000001]
["2016-02-19T23:29:00",null,0.13600000000000001]
["2016-02-19T23:30:00",null,0.13400000000000001]
["2016-02-19T23:31:00",null,0.13400000000000001]
["2016-02-19T23:32:00",null,0.13400000000000001]
["2016-02-19T23:33:00",null,0.13100000000000001]
["2016-02-19T23:34:00",null,0.13]
["2016-02-19T23:35:00",null,0.128]
["2016-02-19T23:36:00",null,0.129]
["2016-02-19T23:37:00",null,0.127]
["2016-02-19T23:38:00",null,0.127]
["2016-02-19T23:39:00",null,0.127]
["2016-02-19T23:40:00",null,0.126]
["2016-02-19T23:41:00",null,0.125]
["2016-02-19T23:42:00",null,0.125]
["2016-02-19T23:43:00",null,0.124]
["2016-02-19T23:44:00",null,0.125]
["2016-02-19T23:45:00",null,0.123]
["2016-02-19T23:46:00",null,0.123]
["2016-02-19T23:47:00",null,0.121]
["2016-02-19T23:48:00",null,0.121]
["2016-02-19T23:49:00",null,0.122]
["2016-02-19T23:50:00",null,0.121]
["2016-02-19T23:51:00",null,0.123]
["2016-02-19T23:52:00",null,0.121]
["2016-02-19T23:53:00",null,0.11799999999999999]
["2016-02-19T23:54:00",null,0.114]
["2016-02-19T23:55:00",null,0.114,"Off line"]
["2016-02-19T23:56:00"]
["2016-02-19T23:57:00"]
["2016-02-19T23:58:00"]
["2016-02-19T23:59:00"]
["2016-02-20"]
["2016-02-20T00:01:00"]
["2016-02-20T00:02:00"]
["2016-02-20T00:03:00"]
["2016-02-20T00:04:00"]
["2016-02-20T00:05:00"]
["2016-02-20T00:06:00"]
["2016-02-20T00:07:00"]
["2016-02-20T00:08:00"]
["2016-02-20T00:09:00"]
[{"$f":"+A731+1/1440","v":"2016-02-20T00:10:00"}]
["2016-02-20T00:11:00"]
["2016-02-20T00:12:00"]
["2016-02-20T00:13:00"]
["2016-02-20T00:14:00"]
["2016-02-20T00:15:00"]
["2016-02-20T00:16:00"]
["2016-02-20T00:17:00"]
["2016-02-20T00:18:00"]
["2016-02-20T00:19:00"]
["2016-02-20T00:20:00"]
["2016-02-20T00:21:00"]
["2016-02-20T00:22:00"]
["2016-02-20T00:23:00"]
["2016-02-20T00:24:00"]
["2016-02-20T00:25:00"]
["2016-02-20T00:26:00"]
["2016-02-20T00:27:00"]
["2016-02-20T00:28:00"]
["2016-02-20T00:29:00"]
["2016-02-20T00:30:00"]
["2016-02-20T00:31:00"]
["2016-02-20T00:32:00"]
["2016-02-20T00:33:00"]
["2016-02-20T00:34:00"]
["2016-02-20T00:35:00"]
["2016-02-20T00:36:00"]
["2016-02-20T00:37:00"]
["2016-02-20T00:38:00"]
["2016-02-20T00:39:00"]
["2016-02-20T00:40:00"]
["2016-02-20T00:41:00"]
["2016-02-20T00:42:00"]
["2016-02-20T00:43:00"]
["2016-02-20T00:44:00"]
["2016-02-20T00:45:00"]
["2016-02-20T00:46:00"]
["2016-02-20T00:47:00"]
["2016-02-20T00:48:00"]
["2016-02-20T00:49:00"]
["2016-02-20T00:50:00"]
["2016-02-20T00:51:00"]
["2016-02-20T00:52:00"]
["2016-02-20T00:53:00"]
["2016-02-20T00:54:00"]
["2016-02-20T00:55:00"]
["2016-02-20T00:56:00"]
["2016-02-20T00:57:00"]
["2016-02-20T00:58:00"]
["2016-02-20T00:59:00"]
["2016-02-20T01:00:00"]
["2016-02-20T01:01:00"]
["2016-02-20T01:02:00"]
["2016-02-20T01:03:00"]
["2016-02-20T01:04:00"]
["2016-02-20T01:05:00"]
["2016-02-20T01:06:00"]
["2016-02-20T01:07:00"]
["2016-02-20T01:08:00"]
["2016-02-20T01:09:00"]
["2016-02-20T01:10:00"]
["2016-02-20T01:11:00"]
["2016-02-20T01:12:00"]
["2016-02-20T01:13:00"]
[{"$f":"+A795+1/1440","v":"2016-02-20T01:14:00"}]
["2016-02-20T01:15:00"]
["2016-02-20T01:16:00"]
["2016-02-20T01:17:00"]
["2016-02-20T01:18:00"]
["2016-02-20T01:19:00"]
["2016-02-20T01:20:00"]
["2016-02-20T01:21:00"]
["2016-02-20T01:22:00"]
["2016-02-20T01:23:00"]
["2016-02-20T01:24:00"]
["2016-02-20T01:25:00"]
["2016-02-20T01:26:00"]
["2016-02-20T01:27:00"]
["2016-02-20T01:28:00"]
["2016-02-20T01:29:00"]
["2016-02-20T01:30:00"]
["2016-02-20T01:31:00"]
["2016-02-20T01:32:00"]
["2016-02-20T01:33:00"]
["2016-02-20T01:34:00"]
["2016-02-20T01:35:00"]
["2016-02-20T01:36:00"]
["2016-02-20T01:37:00"]
["2016-02-20T01:38:00"]
["2016-02-20T01:39:00"]
["2016-02-20T01:40:00"]
["2016-02-20T01:41:00"]
["2016-02-20T01:42:00"]
["2016-02-20T01:43:00"]
["2016-02-20T01:44:00"]
["2016-02-20T01:45:00"]
["2016-02-20T01:46:00"]
["2016-02-20T01:47:00"]
["2016-02-20T01:48:00"]
["2016-02-20T01:49:00"]
["2016-02-20T01:50:00"]
["2016-02-20T01:51:00"]
["2016-02-20T01:52:00"]
["2016-02-20T01:53:00"]
["2016-02-20T01:54:00"]
["2016-02-20T01:55:00"]
["2016-02-20T01:56:00"]
["2016-02-20T01:57:00"]
["2016-02-20T01:58:00"]
["2016-02-20T01:59:00"]
["2016-02-20T02:00:00"]
["2016-02-20T02:01:00"]
["2016-02-20T02:02:00"]
["2016-02-20T02:03:00"]
["2016-02-20T02:04:00"]
["2016-02-20T02:05:00"]
["2016-02-20T02:06:00"]
["2016-02-20T02:07:00"]
["2016-02-20T02:08:00"]
["2016-02-20T02:09:00"]
["2016-02-20T02:10:00"]
["2016-02-20T02:11:00"]
["2016-02-20T02:12:00"]
["2016-02-20T02:13:00"]
["2016-02-20T02:14:00"]
["2016-02-20T02:15:00"]
["2016-02-20T02:16:00"]
["2016-02-20T02:17:00"]
[{"$f":"+A859+1/1440","v":"2016-02-20T02:18:00"}]
["2016-02-20T02:19:00"]
["2016-02-20T02:20:00"]
["2016-02-20T02:21:00"]
["2016-02-20T02:22:00"]
["2016-02-20T02:23:00"]
["2016-02-20T02:24:00"]
["2016-02-20T02:25:00"]
["2016-02-20T02:26:00"]
["2016-02-20T02:27:00"]
["2016-02-20T02:28:00"]
["2016-02-20T02:29:00"]
["2016-02-20T02:30:00"]
["2016-02-20T02:31:00"]
["2016-02-20T02:32:00"]
["2016-02-20T02:33:00"]
["2016-02-20T02:34:00"]
["2016-02-20T02:35:00"]
["2016-02-20T02:36:00"]
["2016-02-20T02:37:00"]
["2016-02-20T02:38:00"]
["2016-02-20T02:39:00"]
["2016-02-20T02:40:00"]
["2016-02-20T02:41:00"]
["2016-02-20T02:42:00"]
["2016-02-20T02:43:00"]
["2016-02-20T02:44:00"]
["2016-02-20T02:45:00"]
["2016-02-20T02:46:00"]
["2016-02-20T02:47:00"]
["2016-02-20T02:48:00"]
["2016-02-20T02:49:00"]
["2016-02-20T02:50:00"]
["2016-02-20T02:51:00"]
["2016-02-20T02:52:00"]
["2016-02-20T02:53:00"]
["2016-02-20T02:54:00"]
["2016-02-20T02:55:00"]
["2016-02-20T02:56:00"]
["2016-02-20T02:57:00"]
["2016-02-20T02:58:00"]
["2016-02-20T02:59:00"]
["2016-02-20T03:00:00"]
["2016-02-20T03:01:00"]
["2016-02-20T03:02:00"]
["2016-02-20T03:03:00"]
["2016-02-20T03:04:00"]
["2016-02-20T03:05:00"]
["2016-02-20T03:06:00"]
["2016-02-20T03:07:00"]
["2016-02-20T03:08:00"]
["2016-02-20T03:09:00"]
["2016-02-20T03:10:00"]
["2016-02-20T03:11:00"]
["2016-02-20T03:12:00"]
["2016-02-20T03:13:00"]
["2016-02-20T03:14:00"]
["2016-02-20T03:15:00"]
["2016-02-20T03:16:00"]
["2016-02-20T03:17:00"]
["2016-02-20T03:18:00"]
["2016-02-20T03:19:00"]
["2016-02-20T03:20:00"]
["2016-02-20T03:21:00"]
[{"$f":"+A923+1/1440","v":"2016-02-20T03:22:00"}]
["2016-02-20T03:23:00"]
["2016-02-20T03:24:00"]
["2016-02-20T03:25:00"]
["2016-02-20T03:26:00"]
["2016-02-20T03:27:00"]
["2016-02-20T03:28:00"]
["2016-02-20T03:29:00"]
["2016-02-20T03:30:00"]
["2016-02-20T03:31:00"]
["2016-02-20T03:32:00"]
["2016-02-20T03:33:00"]
["2016-02-20T03:34:00"]
["2016-02-20T03:35:00"]
["2016-02-20T03:36:00"]
["2016-02-20T03:37:00"]
["2016-02-20T03:38:00"]
["2016-02-20T03:39:00"]
["2016-02-20T03:40:00"]
["2016-02-20T03:41:00"]
["2016-02-20T03:42:00"]
["2016-02-20T03:43:00"]
["2016-02-20T03:44:00"]
["2016-02-20T03:45:00"]
["2016-02-20T03:46:00"]
["2016-02-20T03:47:00"]
["2016-02-20T03:48:00"]
["2016-02-20T03:49:00"]
["2016-02-20T03:50:00"]
["2016-02-20T03:51:00"]
["2016-02-20T03:52:00"]
["2016-02-20T03:53:00"]
["2016-02-20T03:54:00"]
["2016-02-20T03:55:00"]
["2016-02-20T03:56:00"]
["2016-02-20T03:57:00"]
["2016-02-20T03:58:00"]
["2016-02-20T03:59:00"]
["2016-02-20T04:00:00"]
["2016-02-20T04:01:00"]
["2016-02-20T04:02:00"]
["2016-02-20T04:03:00"]
["2016-02-20T04:04:00"]
["2016-02-20T04:05:00"]
["2016-02-20T04:06:00"]
["2016-02-20T04:07:00"]
["2016-02-20T04:08:00"]
["2016-02-20T04:09:00"]
["2016-02-20T04:10:00"]
["2016-02-20T04:11:00"]
["2016-02-20T04:12:00"]
["2016-02-20T04:13:00"]
["2016-02-20T04:14:00"]
["2016-02-20T04:15:00"]
["2016-02-20T04:16:00"]
["2016-02-20T04:17:00"]
["2016-02-20T04:18:00"]
["2016-02-20T04:19:00"]
["2016-02-20T04:20:00"]
["2016-02-20T04:21:00"]
["2016-02-20T04:22:00"]
["2016-02-20T04:23:00"]
["2016-02-20T04:24:00"]
["2016-02-20T04:25:00"]
[{"$f":"+A987+1/1440","v":"2016-02-20T04:26:00"}]
["2016-02-20T04:27:00"]
["2016-02-20T04:28:00"]
["2016-02-20T04:29:00"]
["2016-02-20T04:30:00"]
["2016-02-20T04:31:00"]
["2016-02-20T04:32:00"]
["2016-02-20T04:33:00"]
["2016-02-20T04:34:00"]
["2016-02-20T04:35:00"]
["2016-02-20T04:36:00"]
["2016-02-20T04:37:00"]
["2016-02-20T04:38:00"]
["2016-02-20T04:39:00"]
["2016-02-20T04:40:00"]
["2016-02-20T04:41:00"]
["2016-02-20T04:42:00"]
["2016-02-20T04:43:00"]
["2016-02-20T04:44:00"]
["2016-02-20T04:45:00"]
["2016-02-20T04:46:00"]
["2016-02-20T04:47:00"]
["2016-02-20T04:48:00"]
["2016-02-20T04:49:00"]
["2016-02-20T04:50:00"]
["2016-02-20T04:51:00"]
["2016-02-20T04:52:00"]
["2016-02-20T04:53:00"]
["2016-02-20T04:54:00"]
["2016-02-20T04:55:00"]
["2016-02-20T04:56:00"]
["2016-02-20T04:57:00"]
["2016-02-20T04:58:00"]
["2016-02-20T04:59:00"]
["2016-02-20T05:00:00"]
["2016-02-20T05:01:00"]
["2016-02-20T05:02:00"]
["2016-02-20T05:03:00"]
["2016-02-20T05:04:00"]
["2016-02-20T05:05:00"]
["2016-02-20T05:06:00"]
["2016-02-20T05:07:00"]
["2016-02-20T05:08:00"]
["2016-02-20T05:09:00"]
["2016-02-20T05:10:00"]
["2016-02-20T05:11:00"]
["2016-02-20T05:12:00"]
["2016-02-20T05:13:00"]
["2016-02-20T05:14:00"]
["2016-02-20T05:15:00"]
["2016-02-20T05:16:00"]
["2016-02-20T05:17:00"]
["2016-02-20T05:18:00"]
["2016-02-20T05:19:00"]
["2016-02-20T05:20:00"]
["2016-02-20T05:21:00"]
["2016-02-20T05:22:00"]
["2016-02-20T05:23:00"]
["2016-02-20T05:24:00"]
["2016-02-20T05:25:00"]
["2016-02-20T05:26:00"]
["2016-02-20T05:27:00"]
["2016-02-20T05:28:00"]
["2016-02-20T05:29:00"]
[{"$f":"+A1051+1/1440","v":"2016-02-20T05:30:00"}]
["2016-02-20T05:31:00"]
["2016-02-20T05:32:00"]
["2016-02-20T05:33:00"]
["2016-02-20T05:34:00"]
["2016-02-20T05:35:00"]
["2016-02-20T05:36:00"]
["2016-02-20T05:37:00"]
["2016-02-20T05:38:00"]
["2016-02-20T05:39:00"]
["2016-02-20T05:40:00"]
["2016-02-20T05:41:00"]
["2016-02-20T05:42:00"]
["2016-02-20T05:43:00"]
["2016-02-20T05:44:00"]
["2016-02-20T05:45:00"]
["2016-02-20T05:46:00"]
["2016-02-20T05:47:00"]
["2016-02-20T05:48:00"]
["2016-02-20T05:49:00"]
["2016-02-20T05:50:00"]
["2016-02-20T05:51:00"]
["2016-02-20T05:52:00"]
["2016-02-20T05:53:00"]
["2016-02-20T05:54:00"]
["2016-02-20T05:55:00"]
["2016-02-20T05:56:00"]
["2016-02-20T05:57:00"]
["2016-02-20T05:58:00"]
["2016-02-20T05:59:00"]
["2016-02-20T06:00:00"]
["2016-02-20T06:01:00"]
["2016-02-20T06:02:00"]
["2016-02-20T06:03:00"]
["2016-02-20T06:04:00"]
["2016-02-20T06:05:00"]
["2016-02-20T06:06:00"]
["2016-02-20T06:07:00"]
["2016-02-20T06:08:00"]
["2016-02-20T06:09:00"]
["2016-02-20T06:10:00"]
["2016-02-20T06:11:00"]
["2016-02-20T06:12:00"]
["2016-02-20T06:13:00"]
["2016-02-20T06:14:00"]
["2016-02-20T06:15:00"]
["2016-02-20T06:16:00"]
["2016-02-20T06:17:00"]
["2016-02-20T06:18:00"]
["2016-02-20T06:19:00"]
["2016-02-20T06:20:00"]
["2016-02-20T06:21:00"]
["2016-02-20T06:22:00"]
["2016-02-20T06:23:00"]
["2016-02-20T06:24:00"]
["2016-02-20T06:25:00"]
["2016-02-20T06:26:00"]
["2016-02-20T06:27:00"]
["2016-02-20T06:28:00"]
["2016-02-20T06:29:00"]
["2016-02-20T06:30:00"]
["2016-02-20T06:31:00"]
["2016-02-20T06:32:00"]
["2016-02-20T06:33:00"]
[{"$f":"+A1115+1/1440","v":"2016-02-20T06:34:00"}]
["2016-02-20T06:35:00"]
["2016-02-20T06:36:00"]
["2016-02-20T06:37:00"]
["2016-02-20T06:38:00"]
["2016-02-20T06:39:00"]
["2016-02-20T06:40:00"]
["2016-02-20T06:41:00"]
["2016-02-20T06:42:00"]
["2016-02-20T06:43:00"]
["2016-02-20T06:44:00"]
["2016-02-20T06:45:00"]
["2016-02-20T06:46:00"]
["2016-02-20T06:47:00"]
["2016-02-20T06:48:00"]
["2016-02-20T06:49:00"]
["2016-02-20T06:50:00"]
["2016-02-20T06:51:00"]
["2016-02-20T06:52:00"]
["2016-02-20T06:53:00"]
["2016-02-20T06:54:00"]
["2016-02-20T06:55:00"]
["2016-02-20T06:56:00"]
["2016-02-20T06:57:00"]
["2016-02-20T06:58:00"]
["2016-02-20T06:59:00"]
["2016-02-20T07:00:00"]
["2016-02-20T07:01:00"]
["2016-02-20T07:02:00"]
["2016-02-20T07:03:00"]
["2016-02-20T07:04:00"]
["2016-02-20T07:05:00"]
["2016-02-20T07:06:00"]
["2016-02-20T07:07:00"]
["2016-02-20T07:08:00"]
["2016-02-20T07:09:00"]
["2016-02-20T07:10:00"]
["2016-02-20T07:11:00"]
["2016-02-20T07:12:00"]
["2016-02-20T07:13:00"]
["2016-02-20T07:14:00"]
["2016-02-20T07:15:00"]
["2016-02-20T07:16:00"]
["2016-02-20T07:17:00"]
["2016-02-20T07:18:00"]
["2016-02-20T07:19:00"]
["2016-02-20T07:20:00"]
["2016-02-20T07:21:00"]
["2016-02-20T07:22:00"]
["2016-02-20T07:23:00"]
["2016-02-20T07:24:00"]
["2016-02-20T07:25:00"]
["2016-02-20T07:26:00"]
["2016-02-20T07:27:00"]
["2016-02-20T07:28:00"]
["2016-02-20T07:29:00"]
["2016-02-20T07:30:00"]
["2016-02-20T07:31:00"]
["2016-02-20T07:32:00"]
["2016-02-20T07:33:00"]
["2016-02-20T07:34:00"]
["2016-02-20T07:35:00"]
["2016-02-20T07:36:00"]
["2016-02-20T07:37:00"]
[{"$f":"+A1179+1/1440","v":"2016-02-20T07:38:00"}]
["2016-02-20T07:39:00"]
["2016-02-20T07:40:00"]
["2016-02-20T07:41:00"]
["2016-02-20T07:42:00"]
["2016-02-20T07:43:00"]
["2016-02-20T07:44:00"]
["2016-02-20T07:45:00"]
["2016-02-20T07:46:00"]
["2016-02-20T07:47:00"]
["2016-02-20T07:48:00"]
["2016-02-20T07:49:00"]
["2016-02-20T07:50:00"]
["2016-02-20T07:51:00"]
["2016-02-20T07:52:00"]
["2016-02-20T07:53:00"]
["2016-02-20T07:54:00"]
["2016-02-20T07:55:00"]
["2016-02-20T07:56:00"]
["2016-02-20T07:57:00"]
["2016-02-20T07:58:00"]
["2016-02-20T07:59:00",null,8.3000000000000004E-2,"On-line"]
["2016-02-20T08:00:00",null,8.5000000000000006E-2]
["2016-02-20T08:01:00",null,8.3000000000000004E-2]
["2016-02-20T08:02:00",null,8.8999999999999996E-2]
["2016-02-20T08:03:00",null,9.4E-2]
["2016-02-20T08:04:00",null,0.112]
["2016-02-20T08:05:00",null,0.13800000000000001]
["2016-02-20T08:06:00",null,0.14099999999999999]
["2016-02-20T08:07:00",null,0.13900000000000001]
["2016-02-20T08:08:00",null,0.14599999999999999]
["2016-02-20T08:09:00",null,0.15]
["2016-02-20T08:10:00",null,0.16400000000000001]
["2016-02-20T08:11:00",null,0.192]
["2016-02-20T08:12:00",null,0.20100000000000001]
["2016-02-20T08:13:00",null,0.20899999999999999]
["2016-02-20T08:14:00",null,0.20599999999999999]
["2016-02-20T08:15:00",null,0.21199999999999999]
["2016-02-20T08:16:00",null,0.221]
["2016-02-20T08:17:00",null,0.23499999999999999]
["2016-02-20T08:18:00",null,0.26700000000000002]
["2016-02-20T08:19:00",null,0.28899999999999998]
["2016-02-20T08:20:00",null,0.30099999999999999]
["2016-02-20T08:21:00",null,0.312]
["2016-02-20T08:22:00",null,0.32300000000000001]
["2016-02-20T08:23:00",null,0.314]
["2016-02-20T08:24:00",null,0.318]
["2016-02-20T08:25:00",null,0.32100000000000001]
["2016-02-20T08:26:00",null,0.32300000000000001]
["2016-02-20T08:27:00",null,0.34200000000000003]
["2016-02-20T08:28:00",null,0.34599999999999997]
["2016-02-20T08:29:00",null,0.36499999999999999]
["2016-02-20T08:30:00",null,0.34699999999999998]
["2016-02-20T08:31:00",null,0.33500000000000002]
["2016-02-20T08:32:00",null,0.32300000000000001]
["2016-02-20T08:33:00",null,0.308]
["2016-02-20T08:34:00",null,0.28899999999999998]
["2016-02-20T08:35:00",null,0.29599999999999999]
["2016-02-20T08:36:00",null,0.29099999999999998]
["2016-02-20T08:37:00",null,0.28799999999999998]
["2016-02-20T08:38:00",null,0.28399999999999997]
["2016-02-20T08:39:00",null,0.28100000000000003]
["2016-02-20T08:40:00",null,0.27800000000000002]
["2016-02-20T08:41:00",null,0.26500000000000001]
[{"$f":"+A1243+1/1440","v":"2016-02-20T08:42:00"},null,0.25800000000000001]
["2016-02-20T08:43:00",null,0.25700000000000001]
["2016-02-20T08:44:00",null,0.25700000000000001]
["2016-02-20T08:45:00",null,0.25600000000000001]
["2016-02-20T08:46:00",null,0.255]
["2016-02-20T08:47:00",null,0.253]
["2016-02-20T08:48:00",null,0.253]
["2016-02-20T08:49:00",null,0.254]
["2016-02-20T08:50:00",null,0.255]
["2016-02-20T08:51:00",null,0.253]
["2016-02-20T08:52:00",null,0.254]
["2016-02-20T08:53:00",null,0.25600000000000001]
["2016-02-20T08:54:00",null,0.254]
["2016-02-20T08:55:00",null,0.253]
["2016-02-20T08:56:00",null,0.252]
["2016-02-20T08:57:00",null,0.251]
["2016-02-20T08:58:00",null,0.252]
["2016-02-20T08:59:00",null,0.251]
["2016-02-20T09:00:00",null,0.251]
["2016-02-20T09:01:00",null,0.25]
["2016-02-20T09:02:00",null,0.249]
["2016-02-20T09:03:00",null,0.251]
["2016-02-20T09:04:00",null,0.252]
["2016-02-20T09:05:00",null,0.253]
["2016-02-20T09:06:00",null,0.254]
["2016-02-20T09:07:00",null,0.253]
["2016-02-20T09:08:00",null,0.251]
["2016-02-20T09:09:00",null,0.253]
["2016-02-20T09:10:00",null,0.252]
["2016-02-20T09:11:00",null,0.251]
["2016-02-20T09:12:00",null,0.252]
["2016-02-20T09:13:00",null,0.254]
["2016-02-20T09:14:00",null,0.251]
["2016-02-20T09:15:00",null,0.253]
["2016-02-20T09:16:00",null,0.252]
["2016-02-20T09:17:00",null,0.253]
["2016-02-20T09:18:00",null,0.251]
["2016-02-20T09:19:00",null,0.252]
["2016-02-20T09:20:00",null,0.254]
["2016-02-20T09:21:00",null,0.252]
["2016-02-20T09:22:00",null,0.251]
["2016-02-20T09:23:00",null,0.251]
["2016-02-20T09:24:00",null,0.251]
["2016-02-20T09:25:00",null,0.252]
["2016-02-20T09:26:00",null,0.253]
["2016-02-20T09:27:00",null,0.252]
["2016-02-20T09:28:00",null,0.251]
["2016-02-20T09:29:00",null,0.25209999999999999]
["2016-02-20T09:30:00",null,0.252]
["2016-02-20T09:31:00",null,0.25]
["2016-02-20T09:32:00",null,0.25]
["2016-02-20T09:33:00",null,0.249]
["2016-02-20T09:34:00",null,0.248]
["2016-02-20T09:35:00",null,0.251]
["2016-02-20T09:36:00",null,0.253]
["2016-02-20T09:37:00",null,0.252]
["2016-02-20T09:38:00",null,0.251]
["2016-02-20T09:39:00",null,0.248]
["2016-02-20T09:40:00",null,0.248]
["2016-02-20T09:41:00",null,0.247]
["2016-02-20T09:42:00",null,0.249]
["2016-02-20T09:43:00",null,0.247]
["2016-02-20T09:44:00",null,0.248]
["2016-02-20T09:45:00",null,0.248]
[{"$f":"+A1307+1/1440","v":"2016-02-20T09:46:00"},null,0.25]
["2016-02-20T09:47:00",null,0.251]
["2016-02-20T09:48:00",null,0.254]
["2016-02-20T09:49:00",null,0.249]
["2016-02-20T09:50:00",null,0.254]
["2016-02-20T09:51:00",null,0.25]
["2016-02-20T09:52:00",null,0.245]
["2016-02-20T09:53:00",null,0.245]
["2016-02-20T09:54:00",null,0.245]
["2016-02-20T09:55:00",null,0.246]
["2016-02-20T09:56:00",null,0.24299999999999999]
["2016-02-20T09:57:00",null,0.24199999999999999]
["2016-02-20T09:58:00",null,0.24]
["2016-02-20T09:59:00",null,0.24299999999999999]
["2016-02-20T10:00:00",null,0.24199999999999999]
["2016-02-20T10:01:00",null,0.24099999999999999]
["2016-02-20T10:02:00",null,0.24099999999999999]
["2016-02-20T10:03:00",null,0.24199999999999999]
["2016-02-20T10:04:00",null,0.24]
["2016-02-20T10:05:00",null,0.24299999999999999]
["2016-02-20T10:06:00",null,0.24]
["2016-02-20T10:07:00",null,0.24099999999999999]
["2016-02-20T10:08:00",null,0.24299999999999999]
["2016-02-20T10:09:00",null,0.24099999999999999]
["2016-02-20T10:10:00",null,0.24]
["2016-02-20T10:11:00",null,0.24]
["2016-02-20T10:12:00",null,0.24]
["2016-02-20T10:13:00",null,0.23899999999999999]
["2016-02-20T10:14:00",null,0.23899999999999999]
["2016-02-20T10:15:00",null,0.23799999999999999]
["2016-02-20T10:16:00",null,0.23799999999999999]
["2016-02-20T10:17:00",null,0.23599999999999999]
["2016-02-20T10:18:00",null,0.23499999999999999]
["2016-02-20T10:19:00",null,0.24]
["2016-02-20T10:20:00",null,0.23799999999999999]
["2016-02-20T10:21:00",null,0.24]
["2016-02-20T10:22:00",null,0.24099999999999999]
["2016-02-20T10:23:00",null,0.24099999999999999]
["2016-02-20T10:24:00",null,0.23599999999999999]
["2016-02-20T10:25:00",null,0.23899999999999999]
["2016-02-20T10:26:00",null,0.23799999999999999]
["2016-02-20T10:27:00",null,0.23699999999999999]
["2016-02-20T10:28:00",null,0.23599999999999999]
["2016-02-20T10:29:00",null,0.24]
["2016-02-20T10:30:00",null,0.24099999999999999]
["2016-02-20T10:31:00",null,0.24]
["2016-02-20T10:32:00",null,0.24299999999999999]
["2016-02-20T10:33:00",null,0.24099999999999999]
["2016-02-20T10:34:00",null,0.23400000000000001]
["2016-02-20T10:35:00",null,0.23799999999999999]
["2016-02-20T10:36:00",null,0.23699999999999999]
["2016-02-20T10:37:00",null,0.23899999999999999]
["2016-02-20T10:38:00",null,0.23400000000000001]
["2016-02-20T10:39:00",null,0.23400000000000001]
["2016-02-20T10:40:00",null,0.24099999999999999]
["2016-02-20T10:41:00",null,0.23799999999999999]
["2016-02-20T10:42:00",null,0.23799999999999999]
["2016-02-20T10:43:00",null,0.23699999999999999]
["2016-02-20T10:44:00",null,0.23599999999999999]
["2016-02-20T10:45:00",null,0.23499999999999999]
["2016-02-20T10:46:00",null,0.23899999999999999]
["2016-02-20T10:47:00",null,0.24299999999999999]
["2016-02-20T10:48:00",null,0.23899999999999999]
["2016-02-20T10:49:00",null,0.24099999999999999]
[{"$f":"+A1371+1/1440","v":"2016-02-20T10:50:00"},null,0.23899999999999999]
["2016-02-20T10:51:00",null,0.23799999999999999]
["2016-02-20T10:52:00",null,0.23799999999999999]
["2016-02-20T10:53:00",null,0.23599999999999999]
["2016-02-20T10:54:00",null,0.247]
["2016-02-20T10:55:00",null,0.23599999999999999]
["2016-02-20T10:56:00",null,0.24099999999999999]
["2016-02-20T10:57:00",null,0.24]
["2016-02-20T10:58:00",null,0.24299999999999999]
["2016-02-20T10:59:00",null,0.24099999999999999]
["2016-02-20T11:00:00",null,0.23400000000000001]
["2016-02-20T11:01:00",null,0.23799999999999999]
["2016-02-20T11:02:00",null,0.23699999999999999]
["2016-02-20T11:03:00",null,0.23899999999999999]
["2016-02-20T11:04:00",null,0.23400000000000001]
["2016-02-20T11:05:00",null,0.23400000000000001]
["2016-02-20T11:06:00",null,0.24099999999999999]
["2016-02-20T11:07:00",null,0.23799999999999999]
["2016-02-20T11:08:00",null,0.23799999999999999]
["2016-02-20T11:09:00",null,0.23699999999999999]
["2016-02-20T11:10:00",null,0.23599999999999999]
["2016-02-20T11:11:00",null,0.23499999999999999]
["2016-02-20T11:12:00",null,0.23899999999999999]
["2016-02-20T11:13:00",null,0.24299999999999999]
["2016-02-20T11:14:00",null,0.23899999999999999]
["2016-02-20T11:15:00",null,0.24099999999999999]
["2016-02-20T11:16:00",null,0.23899999999999999]
["2016-02-20T11:17:00",null,0.23799999999999999]
["2016-02-20T11:18:00",null,0.23799999999999999]
["2016-02-20T11:19:00",null,0.23599999999999999]
["2016-02-20T11:20:00",null,0.247]
["2016-02-20T11:21:00",null,0.23599999999999999]
["2016-02-20T11:22:00",null,0.23899999999999999]
["2016-02-20T11:23:00",null,0.24199999999999999]
["2016-02-20T11:24:00",null,0.245]
["2016-02-20T11:25:00",null,0.23899999999999999]
["2016-02-20T11:26:00",null,0.24]
["2016-02-20T11:27:00",null,0.24199999999999999]
["2016-02-20T11:28:00",null,0.24099999999999999]
["2016-02-20T11:29:00",null,0.24299999999999999]
["2016-02-20T11:30:00",null,0.24199999999999999]
["2016-02-20T11:31:00",null,0.24]
["2016-02-20T11:32:00",null,0.23899999999999999]
["2016-02-20T11:33:00",null,0.23899999999999999]
["2016-02-20T11:34:00",null,0.23499999999999999]
["2016-02-20T11:35:00",null,0.23200000000000001]
["2016-02-20T11:36:00",null,0.23400000000000001]
["2016-02-20T11:37:00",null,0.221]
["2016-02-20T11:38:00",null,0.23400000000000001]
["2016-02-20T11:39:00",null,0.23599999999999999]
["2016-02-20T11:40:00",null,0.23499999999999999]
["2016-02-20T11:41:00",null,0.23699999999999999]
["2016-02-20T11:42:00",null,0.24]
["2016-02-20T11:43:00",null,0.23899999999999999]
["2016-02-20T11:44:00",null,0.23799999999999999]
["2016-02-20T11:45:00",null,0.23400000000000001]
["2016-02-20T11:46:00",null,0.75]
["2016-02-20T11:47:00",null,0.85]
["2016-02-20T11:48:00",null,0.68]
["2016-02-20T11:49:00",null,0.54]
["2016-02-20T11:50:00",null,0.31]
["2016-02-20T11:51:00",null,0.28000000000000003]
["2016-02-20T11:52:00",null,0.25700000000000001]
["2016-02-20T11:53:00",null,0.254]
[{"$f":"+A1435+1/1440","v":"2016-02-20T11:54:00"},null,0.246]
["2016-02-20T11:55:00",null,0.24099999999999999]
["2016-02-20T11:56:00",null,0.23799999999999999]
["2016-02-20T11:57:00",null,0.23499999999999999]
["2016-02-20T11:58:00",null,0.23599999999999999]
["2016-02-20T11:59:00",null,0.23499999999999999]
["2016-02-20T12:00:00",null,0.23499999999999999,"4 hr"]
["2016-02-20T12:01:00",null,0.22800000000000001]
["2016-02-20T12:02:00",null,0.224]
["2016-02-20T12:03:00",null,0.218]
["2016-02-20T12:04:00",null,0.21299999999999999]
["2016-02-20T12:05:00",null,0.21099999999999999]
["2016-02-20T12:06:00",null,0.19800000000000001]
["2016-02-20T12:07:00",null,0.193]
["2016-02-20T12:08:00",null,0.192]
["2016-02-20T12:09:00",null,0.187]
["2016-02-20T12:10:00",null,0.19]
["2016-02-20T12:11:00",null,0.188]
["2016-02-20T12:12:00",null,0.186]
["2016-02-20T12:13:00",null,0.185]
["2016-02-20T12:14:00",null,0.184]
["2016-02-20T12:15:00",null,0.183]
["2016-02-20T12:16:00",null,0.182]
["2016-02-20T12:17:00",null,0.18099999999999999]
["2016-02-20T12:18:00",null,0.18099999999999999]
["2016-02-20T12:19:00",null,0.182]
["2016-02-20T12:20:00",null,0.183]
["2016-02-20T12:21:00",null,0.182]
["2016-02-20T12:22:00",null,0.182]
["2016-02-20T12:23:00",null,0.182]
["2016-02-20T12:24:00",null,0.18099999999999999]
["2016-02-20T12:25:00",null,0.17899999999999999]
["2016-02-20T12:26:00",null,0.17899999999999999]
["2016-02-20T12:27:00",null,0.17799999999999999]
["2016-02-20T12:28:00",null,0.17699999999999999]
["2016-02-20T12:29:00",null,0.17699999999999999]
["2016-02-20T12:30:00",null,0.17599999999999999]
["2016-02-20T12:31:00",null,0.17499999999999999]
["2016-02-20T12:32:00",null,0.17599999999999999]
["2016-02-20T12:33:00",null,0.17499999999999999]
["2016-02-20T12:34:00",null,0.17399999999999999]
["2016-02-20T12:35:00",null,0.17299999999999999]
["2016-02-20T12:36:00",null,0.17199999999999999]
["2016-02-20T12:37:00",null,0.17199999999999999]
["2016-02-20T12:38:00",null,0.17100000000000001]
["2016-02-20T12:39:00",null,0.17100000000000001]
["2016-02-20T12:40:00",null,0.17]
["2016-02-20T12:41:00",null,0.16900000000000001]
["2016-02-20T12:42:00",null,0.16800000000000001]
["2016-02-20T12:43:00",null,0.16800000000000001]
["2016-02-20T12:44:00",null,0.16700000000000001]
["2016-02-20T12:45:00",null,0.16600000000000001]
["2016-02-20T12:46:00",null,0.16700000000000001]
["2016-02-20T12:47:00",null,0.16600000000000001]
["2016-02-20T12:48:00",null,0.16500000000000001]
["2016-02-20T12:49:00",null,0.16500000000000001]
["2016-02-20T12:50:00",null,0.16500000000000001]
["2016-02-20T12:51:00",null,0.16400000000000001]
["2016-02-20T12:52:00",null,0.16400000000000001]
["2016-02-20T12:53:00",null,0.16200000000000001]
["2016-02-20T12:54:00",null,0.16200000000000001]
["2016-02-20T12:55:00",null,0.161]
["2016-02-20T12:56:00",null,0.16]
["2016-02-20T12:57:00",null,0.16]
[{"$f":"+A1499+1/1440","v":"2016-02-20T12:58:00"},null,0.159]
["2016-02-20T12:59:00",null,0.158]
["2016-02-20T13:00:00",null,0.158]
["2016-02-20T13:01:00",null,0.157]
["2016-02-20T13:02:00",null,0.158]
["2016-02-20T13:03:00",null,0.157]
["2016-02-20T13:04:00",null,0.156]
["2016-02-20T13:05:00",null,0.156]
["2016-02-20T13:06:00",null,0.154]
["2016-02-20T13:07:00",null,0.154]
["2016-02-20T13:08:00",null,0.153]
["2016-02-20T13:09:00",null,0.152]
["2016-02-20T13:10:00",null,0.151]
["2016-02-20T13:11:00",null,0.152]
["2016-02-20T13:12:00",null,0.151]
["2016-02-20T13:13:00",null,0.14799999999999999]
["2016-02-20T13:14:00",null,0.14799999999999999]
["2016-02-20T13:15:00",null,0.14699999999999999]
["2016-02-20T13:16:00",null,0.14699999999999999]
["2016-02-20T13:17:00",null,0.14599999999999999]
["2016-02-20T13:18:00",null,0.14599999999999999]
["2016-02-20T13:19:00",null,0.14399999999999999]
["2016-02-20T13:20:00",null,0.14299999999999999]
["2016-02-20T13:21:00",null,0.14199999999999999]
["2016-02-20T13:22:00",null,0.14299999999999999]
["2016-02-20T13:23:00",null,0.14099999999999999]
["2016-02-20T13:24:00",null,0.14099999999999999]
["2016-02-20T13:25:00",null,0.14199999999999999]
["2016-02-20T13:26:00",null,0.14299999999999999]
["2016-02-20T13:27:00",null,0.14199999999999999]
["2016-02-20T13:28:00",null,0.14299999999999999]
["2016-02-20T13:29:00",null,0.14199999999999999]
["2016-02-20T13:30:00",null,0.14199999999999999]
["2016-02-20T13:31:00",null,0.14099999999999999]
["2016-02-20T13:32:00",null,0.14199999999999999]
["2016-02-20T13:33:00",null,0.14299999999999999]
["2016-02-20T13:34:00",null,0.14000000000000001]
["2016-02-20T13:35:00",null,0.13900000000000001]
["2016-02-20T13:36:00",null,0.13900000000000001]
["2016-02-20T13:37:00",null,0.13800000000000001]
["2016-02-20T13:38:00",null,0.13800000000000001]
["2016-02-20T13:39:00",null,0.14000000000000001]
["2016-02-20T13:40:00",null,0.14099999999999999]
["2016-02-20T13:41:00",null,0.14199999999999999]
["2016-02-20T13:42:00",null,0.14099999999999999]
["2016-02-20T13:43:00",null,0.14299999999999999]
["2016-02-20T13:44:00",null,0.14199999999999999]
["2016-02-20T13:45:00",null,0.14199999999999999]
["2016-02-20T13:46:00",null,0.14199999999999999]
["2016-02-20T13:47:00",null,0.14299999999999999]
["2016-02-20T13:48:00",null,0.14199999999999999]
["2016-02-20T13:49:00",null,0.14199999999999999]
["2016-02-20T13:50:00",null,0.14099999999999999]
["2016-02-20T13:51:00",null,0.14099999999999999]
["2016-02-20T13:52:00",null,0.14000000000000001]
["2016-02-20T13:53:00",null,0.13900000000000001]
["2016-02-20T13:54:00",null,0.13900000000000001]
["2016-02-20T13:55:00",null,0.13800000000000001]
["2016-02-20T13:56:00",null,0.13800000000000001]
["2016-02-20T13:57:00",null,0.13700000000000001]
["2016-02-20T13:58:00",null,0.13600000000000001]
["2016-02-20T13:59:00",null,0.13600000000000001]
["2016-02-20T14:00:00",null,0.13600000000000001]
["2016-02-20T14:01:00",null,0.13600000000000001]
[{"$f":"+A1563+1/1440","v":"2016-02-20T14:02:00"},null,0.13500000000000001]
["2016-02-20T14:03:00",null,0.13500000000000001]
["2016-02-20T14:04:00",null,0.13400000000000001]
["2016-02-20T14:05:00",null,0.13500000000000001]
["2016-02-20T14:06:00",null,0.13400000000000001]
["2016-02-20T14:07:00",null,0.13300000000000001]
["2016-02-20T14:08:00",null,0.13400000000000001]
["2016-02-20T14:09:00",null,0.13200000000000001]
["2016-02-20T14:10:00",null,0.13100000000000001]
["2016-02-20T14:11:00",null,0.13]
["2016-02-20T14:12:00",null,0.13]
["2016-02-20T14:13:00",null,0.128]
["2016-02-20T14:14:00",null,0.127]
["2016-02-20T14:15:00",null,0.128]
["2016-02-20T14:16:00",null,0.126]
["2016-02-20T14:17:00",null,0.127]
["2016-02-20T14:18:00",null,0.127]
["2016-02-20T14:19:00",null,0.127]
["2016-02-20T14:20:00",null,0.126]
["2016-02-20T14:21:00",null,0.125]
["2016-02-20T14:22:00",null,0.126]
["2016-02-20T14:23:00",null,0.124]
["2016-02-20T14:24:00",null,0.125]
["2016-02-20T14:25:00",null,0.125]
["2016-02-20T14:26:00",null,0.125]
["2016-02-20T14:27:00",null,0.123]
["2016-02-20T14:28:00",null,0.122]
["2016-02-20T14:29:00",null,0.123]
["2016-02-20T14:30:00",null,0.122]
["2016-02-20T14:31:00",null,0.121]
["2016-02-20T14:32:00",null,0.11899999999999999]
["2016-02-20T14:33:00",null,0.11799999999999999]
["2016-02-20T14:34:00",null,0.11899999999999999]
["2016-02-20T14:35:00",null,0.186,"Filter 6 BW"]
["2016-02-20T14:36:00",null,0.21099999999999999]
["2016-02-20T14:37:00",null,0.24299999999999999]
["2016-02-20T14:38:00",null,0.26800000000000002]
["2016-02-20T14:39:00",null,0.28699999999999998]
["2016-02-20T14:40:00",null,0.31]
["2016-02-20T14:41:00",null,0.33500000000000002]
["2016-02-20T14:42:00",null,0.36099999999999999]
["2016-02-20T14:43:00",null,0.378]
["2016-02-20T14:44:00",null,0.38400000000000001]
["2016-02-20T14:45:00",null,0.39400000000000002,"MDR"]
["2016-02-20T14:46:00",null,0.41599999999999998]
["2016-02-20T14:47:00",null,0.41099999999999998]
["2016-02-20T14:48:00",null,0.40799999999999997]
["2016-02-20T14:49:00",null,0.39800000000000002]
["2016-02-20T14:50:00",null,0.39600000000000002]
["2016-02-20T14:51:00",null,0.39400000000000002]
["2016-02-20T14:52:00",null,0.39200000000000002]
["2016-02-20T14:53:00",null,0.39400000000000002]
["2016-02-20T14:54:00",null,0.39300000000000002]
["2016-02-20T14:55:00",null,0.39300000000000002]
["2016-02-20T14:56:00",null,0.39100000000000001]
["2016-02-20T14:57:00",null,0.39]
["2016-02-20T14:58:00",null,0.38900000000000001]
["2016-02-20T14:59:00",null,0.38700000000000001]
["2016-02-20T15:00:00",null,0.38]
["2016-02-20T15:01:00",null,0.38700000000000001]
["2016-02-20T15:02:00",null,0.38400000000000001]
["2016-02-20T15:03:00",null,0.38600000000000001]
["2016-02-20T15:04:00",null,0.38300000000000001]
["2016-02-20T15:05:00",null,0.38500000000000001]
[{"$f":"+A1627+1/1440","v":"2016-02-20T15:06:00"},null,0.38300000000000001]
["2016-02-20T15:07:00",null,0.38400000000000001]
["2016-02-20T15:08:00",null,0.38400000000000001]
["2016-02-20T15:09:00",null,0.379]
["2016-02-20T15:10:00",null,0.379]
["2016-02-20T15:11:00",null,0.378]
["2016-02-20T15:12:00",null,0.377]
["2016-02-20T15:13:00",null,0.36799999999999999]
["2016-02-20T15:14:00",null,0.371]
["2016-02-20T15:15:00",null,0.36899999999999999]
["2016-02-20T15:16:00",null,0.36299999999999999]
["2016-02-20T15:17:00",null,0.36199999999999999]
["2016-02-20T15:18:00",null,0.35799999999999998]
["2016-02-20T15:19:00",null,0.35899999999999999]
["2016-02-20T15:20:00",null,0.28599999999999998]
["2016-02-20T15:21:00",null,0.221]
["2016-02-20T15:22:00",null,0.18099999999999999]
["2016-02-20T15:23:00",null,0.16300000000000001]
["2016-02-20T15:24:00",null,0.14699999999999999]
["2016-02-20T15:25:00",null,0.13200000000000001]
["2016-02-20T15:26:00",null,0.123]
["2016-02-20T15:27:00",null,0.124]
["2016-02-20T15:28:00",null,0.113]
["2016-02-20T15:29:00",null,0.108]
["2016-02-20T15:30:00",null,0.107]
["2016-02-20T15:31:00",null,0.107]
["2016-02-20T15:32:00",null,0.106]
["2016-02-20T15:33:00",null,0.105]
["2016-02-20T15:34:00",null,0.10299999999999999]
["2016-02-20T15:35:00",null,0.10199999999999999]
["2016-02-20T15:36:00",null,0.10199999999999999]
["2016-02-20T15:37:00",null,0.10299999999999999]
["2016-02-20T15:38:00",null,0.104]
["2016-02-20T15:39:00",null,0.10100000000000001]
["2016-02-20T15:40:00",null,0.10199999999999999]
["2016-02-20T15:41:00",null,0.106]
["2016-02-20T15:42:00",null,0.10299999999999999]
["2016-02-20T15:43:00",null,0.104]
["2016-02-20T15:44:00",null,0.10299999999999999]
["2016-02-20T15:45:00",null,0.1]
["2016-02-20T15:46:00",null,9.0999999999999998E-2]
["2016-02-20T15:47:00",null,9.2999999999999999E-2]
["2016-02-20T15:48:00",null,9.2999999999999999E-2]
["2016-02-20T15:49:00",null,9.2999999999999999E-2]
["2016-02-20T15:50:00",null,9.2999999999999999E-2]
["2016-02-20T15:51:00",null,9.5000000000000001E-2]
["2016-02-20T15:52:00",null,9.6000000000000002E-2]
["2016-02-20T15:53:00",null,9.2999999999999999E-2]
["2016-02-20T15:54:00",null,9.5000000000000001E-2]
["2016-02-20T15:55:00",null,9.8000000000000004E-2]
["2016-02-20T15:56:00",null,9.6000000000000002E-2]
["2016-02-20T15:57:00",null,9.2999999999999999E-2]
["2016-02-20T15:58:00",null,9.6000000000000002E-2]
["2016-02-20T15:59:00",null,9.6000000000000002E-2]
["2016-02-20T16:00:00",null,9.5000000000000001E-2]
["2016-02-20T16:01:00",null,9.8000000000000004E-2]
["2016-02-20T16:02:00",null,9.6000000000000002E-2]
["2016-02-20T16:03:00",null,9.2999999999999999E-2]
["2016-02-20T16:04:00",null,9.2999999999999999E-2]
["2016-02-20T16:05:00",null,9.5000000000000001E-2]
["2016-02-20T16:06:00",null,9.6000000000000002E-2]
["2016-02-20T16:07:00",null,9.2999999999999999E-2]
["2016-02-20T16:08:00",null,9.4E-2]
["2016-02-20T16:09:00",null,9.2999999999999999E-2]
[{"$f":"+A1691+1/1440","v":"2016-02-20T16:10:00"},null,9.9000000000000005E-2]
["2016-02-20T16:11:00",null,9.5000000000000001E-2]
["2016-02-20T16:12:00",null,9.1999999999999998E-2]
["2016-02-20T16:13:00",null,9.2999999999999999E-2]
["2016-02-20T16:14:00",null,8.8999999999999996E-2]
["2016-02-20T16:15:00",null,0.09]
["2016-02-20T16:16:00",null,9.0999999999999998E-2]
["2016-02-20T16:17:00",null,8.8999999999999996E-2]
["2016-02-20T16:18:00",null,9.1999999999999998E-2]
["2016-02-20T16:19:00",null,9.1999999999999998E-2]
["2016-02-20T16:20:00",null,9.2999999999999999E-2]
["2016-02-20T16:21:00",null,9.0999999999999998E-2]
["2016-02-20T16:22:00",null,9.2999999999999999E-2]
["2016-02-20T16:23:00",null,9.2999999999999999E-2]
["2016-02-20T16:24:00",null,9.2999999999999999E-2]
["2016-02-20T16:25:00",null,9.2999999999999999E-2]
["2016-02-20T16:26:00",null,9.5000000000000001E-2]
["2016-02-20T16:27:00",null,9.6000000000000002E-2]
["2016-02-20T16:28:00",null,9.2999999999999999E-2]
["2016-02-20T16:29:00",null,9.5000000000000001E-2]
["2016-02-20T16:30:00",null,9.8000000000000004E-2]
["2016-02-20T16:31:00",null,9.6000000000000002E-2]
["2016-02-20T16:32:00",null,9.2999999999999999E-2]
["2016-02-20T16:33:00",null,9.6000000000000002E-2]
["2016-02-20T16:34:00",null,9.6000000000000002E-2]
["2016-02-20T16:35:00",null,9.5000000000000001E-2]
["2016-02-20T16:36:00",null,9.8000000000000004E-2]
["2016-02-20T16:37:00",null,9.6000000000000002E-2]
["2016-02-20T16:38:00",null,9.2999999999999999E-2]
["2016-02-20T16:39:00",null,9.2999999999999999E-2]
["2016-02-20T16:40:00",null,9.5000000000000001E-2]
["2016-02-20T16:41:00",null,9.6000000000000002E-2]
["2016-02-20T16:42:00",null,9.2999999999999999E-2]
["2016-02-20T16:43:00",null,9.4E-2]
["2016-02-20T16:44:00",null,9.2999999999999999E-2]
["2016-02-20T16:45:00",null,9.9000000000000005E-2]
["2016-02-20T16:46:00",null,9.5000000000000001E-2]
["2016-02-20T16:47:00",null,9.1999999999999998E-2]
["2016-02-20T16:48:00",null,9.2999999999999999E-2]
["2016-02-20T16:49:00",null,8.8999999999999996E-2]
["2016-02-20T16:50:00",null,0.09]
["2016-02-20T16:51:00",null,9.0999999999999998E-2]
["2016-02-20T16:52:00",null,8.8999999999999996E-2]
["2016-02-20T16:53:00",null,9.1999999999999998E-2]
["2016-02-20T16:54:00",null,9.1999999999999998E-2]
["2016-02-20T16:55:00",null,9.2999999999999999E-2]
["2016-02-20T16:56:00",null,9.0999999999999998E-2]
["2016-02-20T16:57:00",null,9.2999999999999999E-2]
["2016-02-20T16:58:00",null,9.2999999999999999E-2]
["2016-02-20T16:59:00",null,9.2999999999999999E-2]
["2016-02-20T17:00:00",null,9.2999999999999999E-2]
["2016-02-20T17:01:00",null,9.5000000000000001E-2]
["2016-02-20T17:02:00",null,9.6000000000000002E-2]
["2016-02-20T17:03:00",null,9.2999999999999999E-2]
["2016-02-20T17:04:00",null,9.5000000000000001E-2]
["2016-02-20T17:05:00",null,9.8000000000000004E-2]
["2016-02-20T17:06:00",null,9.6000000000000002E-2]
["2016-02-20T17:07:00",null,9.2999999999999999E-2]
["2016-02-20T17:08:00",null,9.6000000000000002E-2]
["2016-02-20T17:09:00",null,9.6000000000000002E-2]
["2016-02-20T17:10:00",null,9.5000000000000001E-2]
["2016-02-20T17:11:00",null,9.8000000000000004E-2]
["2016-02-20T17:12:00",null,9.6000000000000002E-2]
["2016-02-20T17:13:00",null,9.2999999999999999E-2]
[{"$f":"+A1755+1/1440","v":"2016-02-20T17:14:00"},null,9.2999999999999999E-2]
["2016-02-20T17:15:00",null,9.5000000000000001E-2]
["2016-02-20T17:16:00",null,9.6000000000000002E-2]
["2016-02-20T17:17:00",null,9.2999999999999999E-2]
["2016-02-20T17:18:00",null,9.4E-2]
["2016-02-20T17:19:00",null,9.2999999999999999E-2]
["2016-02-20T17:20:00",null,9.9000000000000005E-2]
["2016-02-20T17:21:00",null,9.5000000000000001E-2]
["2016-02-20T17:22:00",null,9.1999999999999998E-2]
["2016-02-20T17:23:00",null,9.2999999999999999E-2]
["2016-02-20T17:24:00",null,8.8999999999999996E-2]
["2016-02-20T17:25:00",null,0.09]
["2016-02-20T17:26:00",null,9.0999999999999998E-2]
["2016-02-20T17:27:00",null,8.8999999999999996E-2]
["2016-02-20T17:28:00",null,9.1999999999999998E-2]
["2016-02-20T17:29:00",null,9.1999999999999998E-2]
["2016-02-20T17:30:00",null,9.2999999999999999E-2]
["2016-02-20T17:31:00",null,9.0999999999999998E-2]
["2016-02-20T17:32:00",null,9.2999999999999999E-2]
["2016-02-20T17:33:00",null,9.2999999999999999E-2]
["2016-02-20T17:34:00",null,9.2999999999999999E-2]
["2016-02-20T17:35:00",null,9.2999999999999999E-2]
["2016-02-20T17:36:00",null,9.5000000000000001E-2]
["2016-02-20T17:37:00",null,9.6000000000000002E-2]
["2016-02-20T17:38:00",null,9.2999999999999999E-2]
["2016-02-20T17:39:00",null,9.5000000000000001E-2]
["2016-02-20T17:40:00",null,9.8000000000000004E-2]
["2016-02-20T17:41:00",null,9.6000000000000002E-2]
["2016-02-20T17:42:00",null,9.2999999999999999E-2]
["2016-02-20T17:43:00",null,9.6000000000000002E-2]
["2016-02-20T17:44:00",null,9.6000000000000002E-2]
["2016-02-20T17:45:00",null,9.5000000000000001E-2]
["2016-02-20T17:46:00",null,9.8000000000000004E-2]
["2016-02-20T17:47:00",null,9.6000000000000002E-2]
["2016-02-20T17:48:00",null,9.2999999999999999E-2]
["2016-02-20T17:49:00",null,9.2999999999999999E-2]
["2016-02-20T17:50:00",null,9.5000000000000001E-2]
["2016-02-20T17:51:00",null,9.6000000000000002E-2]
["2016-02-20T17:52:00",null,9.2999999999999999E-2]
["2016-02-20T17:53:00",null,9.4E-2]
["2016-02-20T17:54:00",null,9.2999999999999999E-2]
["2016-02-20T17:55:00",null,9.9000000000000005E-2]
["2016-02-20T17:56:00",null,9.5000000000000001E-2]
["2016-02-20T17:57:00",null,9.1999999999999998E-2]
["2016-02-20T17:58:00",null,9.2999999999999999E-2]
["2016-02-20T17:59:00",null,8.8999999999999996E-2]
["2016-02-20T18:00:00",null,0.09]
["2016-02-20T18:01:00",null,9.0999999999999998E-2]
["2016-02-20T18:02:00",null,8.8999999999999996E-2]
["2016-02-20T18:03:00",null,9.1999999999999998E-2]
["2016-02-20T18:04:00",null,9.1999999999999998E-2]
["2016-02-20T18:05:00",null,9.2999999999999999E-2]
["2016-02-20T18:06:00",null,9.0999999999999998E-2]
["2016-02-20T18:07:00",null,9.2999999999999999E-2]
["2016-02-20T18:08:00",null,9.2999999999999999E-2]
["2016-02-20T18:09:00",null,9.2999999999999999E-2]
["2016-02-20T18:10:00",null,9.2999999999999999E-2]
["2016-02-20T18:11:00",null,9.5000000000000001E-2]
["2016-02-20T18:12:00",null,9.6000000000000002E-2]
["2016-02-20T18:13:00",null,9.2999999999999999E-2]
["2016-02-20T18:14:00",null,9.5000000000000001E-2]
["2016-02-20T18:15:00",null,9.8000000000000004E-2]
["2016-02-20T18:16:00",null,9.6000000000000002E-2]
["2016-02-20T18:17:00",null,9.2999999999999999E-2]
[{"$f":"+A1819+1/1440","v":"2016-02-20T18:18:00"},null,9.0999999999999998E-2]
["2016-02-20T18:19:00",null,9.2999999999999999E-2]
["2016-02-20T18:20:00",null,9.2999999999999999E-2]
["2016-02-20T18:21:00",null,9.2999999999999999E-2]
["2016-02-20T18:22:00",null,9.2999999999999999E-2]
["2016-02-20T18:23:00",null,9.5000000000000001E-2]
["2016-02-20T18:24:00",null,9.6000000000000002E-2]
["2016-02-20T18:25:00",null,9.2999999999999999E-2]
["2016-02-20T18:26:00",null,9.5000000000000001E-2]
["2016-02-20T18:27:00",null,9.8000000000000004E-2]
["2016-02-20T18:28:00",null,9.6000000000000002E-2]
["2016-02-20T18:29:00",null,9.2999999999999999E-2]
["2016-02-20T18:30:00",null,9.6000000000000002E-2]
["2016-02-20T18:31:00",null,9.6000000000000002E-2]
["2016-02-20T18:32:00",null,9.5000000000000001E-2]
["2016-02-20T18:33:00",null,9.8000000000000004E-2]
["2016-02-20T18:34:00",null,9.6000000000000002E-2]
["2016-02-20T18:35:00",null,9.2999999999999999E-2]
["2016-02-20T18:36:00",null,9.2999999999999999E-2]
["2016-02-20T18:37:00",null,9.5000000000000001E-2]
["2016-02-20T18:38:00",null,9.6000000000000002E-2]
["2016-02-20T18:39:00",null,9.2999999999999999E-2]
["2016-02-20T18:40:00",null,9.4E-2]
["2016-02-20T18:41:00",null,9.2999999999999999E-2]
["2016-02-20T18:42:00",null,9.9000000000000005E-2]
["2016-02-20T18:43:00",null,9.5000000000000001E-2]
["2016-02-20T18:44:00",null,9.1999999999999998E-2]
["2016-02-20T18:45:00",null,9.2999999999999999E-2]
["2016-02-20T18:46:00",null,8.8999999999999996E-2]
["2016-02-20T18:47:00",null,0.09]
["2016-02-20T18:48:00",null,9.0999999999999998E-2]
["2016-02-20T18:49:00",null,8.8999999999999996E-2]
["2016-02-20T18:50:00",null,9.1999999999999998E-2]
["2016-02-20T18:51:00",null,9.1999999999999998E-2]
["2016-02-20T18:52:00",null,9.2999999999999999E-2]
["2016-02-20T18:53:00",null,9.6000000000000002E-2]
["2016-02-20T18:54:00",null,9.5000000000000001E-2]
["2016-02-20T18:55:00",null,9.7000000000000003E-2]
["2016-02-20T18:56:00",null,9.6000000000000002E-2]
["2016-02-20T18:57:00",null,9.9000000000000005E-2]
["2016-02-20T18:58:00",null,0.1]
["2016-02-20T18:59:00",null,0.10100000000000001]
["2016-02-20T19:00:00",null,0.10199999999999999]
["2016-02-20T19:01:00",null,9.9000000000000005E-2]
["2016-02-20T19:02:00",null,0.10199999999999999]
["2016-02-20T19:03:00",null,0.10299999999999999]
["2016-02-20T19:04:00",null,0.10199999999999999]
["2016-02-20T19:05:00",null,0.104]
["2016-02-20T19:06:00",null,0.105]
["2016-02-20T19:07:00",null,0.105]
["2016-02-20T19:08:00",null,0.104]
["2016-02-20T19:09:00",null,0.10299999999999999]
["2016-02-20T19:10:00",null,0.105]
["2016-02-20T19:11:00",null,0.106]
["2016-02-20T19:12:00",null,0.108]
["2016-02-20T19:13:00",null,0.107]
["2016-02-20T19:14:00",null,0.108]
["2016-02-20T19:15:00",null,0.109]
["2016-02-20T19:16:00",null,0.111]
["2016-02-20T19:17:00",null,0.109]
["2016-02-20T19:18:00",null,0.112]
["2016-02-20T19:19:00",null,0.112]
["2016-02-20T19:20:00",null,0.111]
["2016-02-20T19:21:00",null,0.11]
[{"$f":"+A1883+1/1440","v":"2016-02-20T19:22:00"},null,0.113]
["2016-02-20T19:23:00",null,0.112]
["2016-02-20T19:24:00",null,0.113]
["2016-02-20T19:25:00",null,0.112]
["2016-02-20T19:26:00",null,0.112]
["2016-02-20T19:27:00",null,0.113]
["2016-02-20T19:28:00",null,0.112]
["2016-02-20T19:29:00",null,0.114]
["2016-02-20T19:30:00",null,0.113]
["2016-02-20T19:31:00",null,0.113]
["2016-02-20T19:32:00",null,0.114]
["2016-02-20T19:33:00",null,0.113]
["2016-02-20T19:34:00",null,0.115]
["2016-02-20T19:35:00",null,0.114]
["2016-02-20T19:36:00",null,0.11600000000000001]
["2016-02-20T19:37:00",null,0.114]
["2016-02-20T19:38:00",null,0.114]
["2016-02-20T19:39:00",null,0.114]
["2016-02-20T19:40:00",null,0.115]
["2016-02-20T19:41:00",null,0.114]
["2016-02-20T19:42:00",null,0.113]
["2016-02-20T19:43:00",null,0.11600000000000001]
["2016-02-20T19:44:00",null,0.114]
["2016-02-20T19:45:00",null,0.11600000000000001]
["2016-02-20T19:46:00",null,0.11700000000000001]
["2016-02-20T19:47:00",null,0.11799999999999999]
["2016-02-20T19:48:00",null,0.11600000000000001]
["2016-02-20T19:49:00",null,0.11700000000000001]
["2016-02-20T19:50:00",null,0.11799999999999999]
["2016-02-20T19:51:00",null,0.11899999999999999]
["2016-02-20T19:52:00",null,0.12]
["2016-02-20T19:53:00",null,0.11899999999999999]
["2016-02-20T19:54:00",null,0.121]
["2016-02-20T19:55:00",null,0.122]
["2016-02-20T19:56:00",null,0.123]
["2016-02-20T19:57:00",null,0.125]
["2016-02-20T19:58:00",null,0.124]
["2016-02-20T19:59:00",null,0.123]
["2016-02-20T20:00:00",null,0.125]
["2016-02-20T20:01:00",null,0.124]
["2016-02-20T20:02:00",null,0.12]
["2016-02-20T20:03:00",null,0.124]
["2016-02-20T20:04:00",null,0.126]
["2016-02-20T20:05:00",null,0.125]
["2016-02-20T20:06:00",null,0.126]
["2016-02-20T20:07:00",null,0.125]
["2016-02-20T20:08:00",null,0.127]
["2016-02-20T20:09:00",null,0.126]
["2016-02-20T20:10:00",null,0.126]
["2016-02-20T20:11:00",null,0.127]
["2016-02-20T20:12:00",null,0.128]
["2016-02-20T20:13:00",null,0.127]
["2016-02-20T20:14:00",null,0.128]
["2016-02-20T20:15:00",null,0.126]
["2016-02-20T20:16:00",null,0.127]
["2016-02-20T20:17:00",null,0.126]
["2016-02-20T20:18:00",null,0.128]
["2016-02-20T20:19:00",null,0.129]
["2016-02-20T20:20:00",null,0.13]
["2016-02-20T20:21:00",null,0.129]
["2016-02-20T20:22:00",null,0.13100000000000001]
["2016-02-20T20:23:00",null,0.13100000000000001]
["2016-02-20T20:24:00",null,0.13]
["2016-02-20T20:25:00",null,0.129]
[{"$f":"+A1947+1/1440","v":"2016-02-20T20:26:00"},null,0.13100000000000001]
["2016-02-20T20:27:00",null,0.13200000000000001]
["2016-02-20T20:28:00",null,0.13200000000000001]
["2016-02-20T20:29:00",null,0.13300000000000001]
["2016-02-20T20:30:00",null,0.13400000000000001]
["2016-02-20T20:31:00",null,0.13400000000000001]
["2016-02-20T20:32:00",null,0.13300000000000001]
["2016-02-20T20:33:00",null,0.13300000000000001]
["2016-02-20T20:34:00",null,0.13400000000000001]
["2016-02-20T20:35:00",null,0.13500000000000001]
["2016-02-20T20:36:00",null,0.13400000000000001]
["2016-02-20T20:37:00",null,0.13400000000000001]
["2016-02-20T20:38:00",null,0.13300000000000001]
["2016-02-20T20:39:00",null,0.13300000000000001]
["2016-02-20T20:40:00",null,0.13400000000000001]
["2016-02-20T20:41:00",null,0.13400000000000001]
["2016-02-20T20:42:00",null,0.13400000000000001]
["2016-02-20T20:43:00",null,0.13300000000000001]
["2016-02-20T20:44:00",null,0.13400000000000001]
["2016-02-20T20:45:00",null,0.13500000000000001]
["2016-02-20T20:46:00",null,0.13500000000000001]
["2016-02-20T20:47:00",null,0.13600000000000001]
["2016-02-20T20:48:00",null,0.13500000000000001]
["2016-02-20T20:49:00",null,0.13600000000000001]
["2016-02-20T20:50:00",null,0.13400000000000001]
["2016-02-20T20:51:00",null,0.13700000000000001]
["2016-02-20T20:52:00",null,0.13600000000000001]
["2016-02-20T20:53:00",null,0.13500000000000001]
["2016-02-20T20:54:00",null,0.13600000000000001]
["2016-02-20T20:55:00",null,0.13500000000000001]
["2016-02-20T20:56:00",null,0.13500000000000001]
["2016-02-20T20:57:00",null,0.13500000000000001]
["2016-02-20T20:58:00",null,0.13800000000000001]
["2016-02-20T20:59:00",null,0.13700000000000001]
["2016-02-20T21:00:00",null,0.13900000000000001]
["2016-02-20T21:01:00",null,0.13700000000000001]
["2016-02-20T21:02:00",null,0.13800000000000001]
["2016-02-20T21:03:00",null,0.13900000000000001]
["2016-02-20T21:04:00",null,0.14000000000000001]
["2016-02-20T21:05:00",null,0.14099999999999999]
["2016-02-20T21:06:00",null,0.13900000000000001]
["2016-02-20T21:07:00",null,0.14000000000000001]
["2016-02-20T21:08:00",null,0.14099999999999999]
["2016-02-20T21:09:00",null,0.13900000000000001]
["2016-02-20T21:10:00",null,0.14199999999999999]
["2016-02-20T21:11:00",null,0.14299999999999999]
["2016-02-20T21:12:00",null,0.14299999999999999]
["2016-02-20T21:13:00",null,0.14000000000000001]
["2016-02-20T21:14:00",null,0.14099999999999999]
["2016-02-20T21:15:00",null,0.14499999999999999]
["2016-02-20T21:16:00",null,0.14399999999999999]
["2016-02-20T21:17:00",null,0.14499999999999999]
["2016-02-20T21:18:00",null,0.14499999999999999]
["2016-02-20T21:19:00",null,0.14499999999999999]
["2016-02-20T21:20:00",null,0.14599999999999999]
["2016-02-20T21:21:00",null,0.14699999999999999]
["2016-02-20T21:22:00",null,0.14699999999999999]
["2016-02-20T21:23:00",null,0.14799999999999999]
["2016-02-20T21:24:00",null,0.14799999999999999]
["2016-02-20T21:25:00",null,0.14699999999999999]
["2016-02-20T21:26:00",null,0.14899999999999999]
["2016-02-20T21:27:00",null,0.151]
["2016-02-20T21:28:00",null,0.15]
["2016-02-20T21:29:00",null,0.14899999999999999]
[{"$f":"+A2011+1/1440","v":"2016-02-20T21:30:00"},null,0.14799999999999999]
["2016-02-20T21:31:00",null,0.151]
["2016-02-20T21:32:00",null,0.152]
["2016-02-20T21:33:00",null,0.153]
["2016-02-20T21:34:00",null,0.151]
["2016-02-20T21:35:00",null,0.14899999999999999]
["2016-02-20T21:36:00",null,0.151]
["2016-02-20T21:37:00",null,0.15]
["2016-02-20T21:38:00",null,0.152]
["2016-02-20T21:39:00",null,0.153]
["2016-02-20T21:40:00",null,0.154]
["2016-02-20T21:41:00",null,0.157]
["2016-02-20T21:42:00",null,0.156]
["2016-02-20T21:43:00",null,0.154]
["2016-02-20T21:44:00",null,0.155]
["2016-02-20T21:45:00",null,0.154]
["2016-02-20T21:46:00",null,0.153]
["2016-02-20T21:47:00",null,0.152]
["2016-02-20T21:48:00",null,0.154]
["2016-02-20T21:49:00",null,0.153]
["2016-02-20T21:50:00",null,0.151]
["2016-02-20T21:51:00",null,0.154]
["2016-02-20T21:52:00",null,0.152]
["2016-02-20T21:53:00",null,0.154]
["2016-02-20T21:54:00",null,0.152]
["2016-02-20T21:55:00",null,0.152]
["2016-02-20T21:56:00",null,0.153]
["2016-02-20T21:57:00",null,0.154]
["2016-02-20T21:58:00",null,0.156]
["2016-02-20T21:59:00",null,0.154]
["2016-02-20T22:00:00",null,0.156]
["2016-02-20T22:01:00",null,0.156]
["2016-02-20T22:02:00",null,0.156]
["2016-02-20T22:03:00",null,0.155]
["2016-02-20T22:04:00",null,0.157]
["2016-02-20T22:05:00",null,0.158]
["2016-02-20T22:06:00",null,0.158]
["2016-02-20T22:07:00",null,0.159]
["2016-02-20T22:08:00",null,0.161]
["2016-02-20T22:09:00",null,0.16]
["2016-02-20T22:10:00",null,0.158]
["2016-02-20T22:11:00",null,0.159]
["2016-02-20T22:12:00",null,0.156]
["2016-02-20T22:13:00",null,0.158]
["2016-02-20T22:14:00",null,0.157]
["2016-02-20T22:15:00",null,0.159]
["2016-02-20T22:16:00",null,0.161]
["2016-02-20T22:17:00",null,0.16]
["2016-02-20T22:18:00",null,0.16200000000000001]
["2016-02-20T22:19:00",null,0.159]
["2016-02-20T22:20:00",null,0.16300000000000001]
["2016-02-20T22:21:00",null,0.16200000000000001]
["2016-02-20T22:22:00",null,0.16300000000000001]
["2016-02-20T22:23:00",null,0.16200000000000001]
["2016-02-20T22:24:00",null,0.16400000000000001]
["2016-02-20T22:25:00",null,0.16400000000000001]
["2016-02-20T22:26:00",null,0.16300000000000001]
["2016-02-20T22:27:00",null,0.16500000000000001]
["2016-02-20T22:28:00",null,0.16400000000000001]
["2016-02-20T22:29:00",null,0.17]
["2016-02-20T22:30:00",null,0.16800000000000001]
["2016-02-20T22:31:00",null,0.16500000000000001]
["2016-02-20T22:32:00",null,0.16700000000000001]
["2016-02-20T22:33:00",null,0.16500000000000001]
[{"$f":"+A2075+1/1440","v":"2016-02-20T22:34:00"},null,0.16800000000000001]
["2016-02-20T22:35:00",null,0.16900000000000001]
["2016-02-20T22:36:00",null,0.16800000000000001]
["2016-02-20T22:37:00",null,0.17]
["2016-02-20T22:38:00",null,0.17199999999999999]
["2016-02-20T22:39:00",null,0.17199999999999999]
["2016-02-20T22:40:00",null,0.17]
["2016-02-20T22:41:00",null,0.17299999999999999]
["2016-02-20T22:42:00",null,0.17299999999999999]
["2016-02-20T22:43:00",null,0.17399999999999999]
["2016-02-20T22:44:00",null,0.17399999999999999]
["2016-02-20T22:45:00",null,0.17100000000000001]
["2016-02-20T22:46:00",null,0.17499999999999999]
["2016-02-20T22:47:00",null,0.17199999999999999]
["2016-02-20T22:48:00",null,0.17499999999999999]
["2016-02-20T22:49:00",null,0.17499999999999999]
["2016-02-20T22:50:00",null,0.17399999999999999]
["2016-02-20T22:51:00",null,0.17499999999999999]
["2016-02-20T22:52:00",null,0.17599999999999999]
["2016-02-20T22:53:00",null,0.17599999999999999]
["2016-02-20T22:54:00",null,0.17599999999999999]
["2016-02-20T22:55:00",null,0.17499999999999999]
["2016-02-20T22:56:00",null,0.17799999999999999]
["2016-02-20T22:57:00",null,0.17699999999999999]
["2016-02-20T22:58:00",null,0.17499999999999999]
["2016-02-20T22:59:00",null,0.18]
["2016-02-20T23:00:00",null,0.17599999999999999]
["2016-02-20T23:01:00",null,0.17499999999999999]
["2016-02-20T23:02:00",null,0.17599999999999999]
["2016-02-20T23:03:00",null,0.17599999999999999]
["2016-02-20T23:04:00",null,0.17699999999999999]
["2016-02-20T23:05:00",null,0.17499999999999999]
["2016-02-20T23:06:00",null,0.17499999999999999]
["2016-02-20T23:07:00",null,0.17599999999999999]
["2016-02-20T23:08:00",null,0.17799999999999999]
["2016-02-20T23:09:00",null,0.18]
["2016-02-20T23:10:00",null,0.18099999999999999]
["2016-02-20T23:11:00",null,0.182]
["2016-02-20T23:12:00",null,0.182]
["2016-02-20T23:13:00",null,0.18099999999999999]
["2016-02-20T23:14:00",null,0.17899999999999999]
["2016-02-20T23:15:00",null,0.183]
["2016-02-20T23:16:00",null,0.182]
["2016-02-20T23:17:00",null,0.18099999999999999]
["2016-02-20T23:18:00",null,0.18099999999999999]
["2016-02-20T23:19:00",null,0.182]
["2016-02-20T23:20:00",null,0.183]
["2016-02-20T23:21:00",null,0.187]
["2016-02-20T23:22:00",null,0.187]
["2016-02-20T23:23:00",null,0.185]
["2016-02-20T23:24:00",null,0.187]
["2016-02-20T23:25:00",null,0.189]
["2016-02-20T23:26:00",null,0.19]
["2016-02-20T23:27:00",null,0.187]
["2016-02-20T23:28:00",null,0.187]
["2016-02-20T23:29:00",null,0.191]
["2016-02-20T23:30:00",null,0.192]
["2016-02-20T23:31:00",null,0.189]
["2016-02-20T23:32:00",null,0.192]
["2016-02-20T23:33:00",null,0.193]
["2016-02-20T23:34:00",null,0.183]
["2016-02-20T23:35:00",null,0.187]
["2016-02-20T23:36:00",null,0.19800000000000001]
["2016-02-20T23:37:00",null,0.19900000000000001]
[{"$f":"+A2139+1/1440","v":"2016-02-20T23:38:00"},null,0.19900000000000001]
["2016-02-20T23:39:00",null,0.20100000000000001]
["2016-02-20T23:40:00",null,0.21]
["2016-02-20T23:41:00",null,0.20499999999999999]
["2016-02-20T23:42:00",null,0.20300000000000001]
["2016-02-20T23:43:00",null,0.20100000000000001]
["2016-02-20T23:44:00",null,0.20300000000000001]
["2016-02-20T23:45:00",null,0.20499999999999999]
["2016-02-20T23:46:00",null,0.20300000000000001]
["2016-02-20T23:47:00",null,0.20399999999999999]
["2016-02-20T23:48:00",null,0.20599999999999999]
["2016-02-20T23:49:00",null,0.20499999999999999]
["2016-02-20T23:50:00",null,0.20399999999999999]
["2016-02-20T23:51:00",null,0.20599999999999999]
["2016-02-20T23:52:00",null,0.20499999999999999]
["2016-02-20T23:53:00",null,0.20599999999999999]
["2016-02-20T23:54:00",null,0.20699999999999999]
["2016-02-20T23:55:00",null,0.20599999999999999]
["2016-02-20T23:56:00",null,0.20699999999999999]
["2016-02-20T23:57:00",null,0.20599999999999999]
["2016-02-20T23:58:00",null,0.20599999999999999]
["2016-02-20T23:59:00",null,0.20699999999999999]
["2016-02-21",null,0.20799999999999999]
["2016-02-21T00:01:00",null,0.20599999999999999]
["2016-02-21T00:02:00",null,0.20699999999999999]
["2016-02-21T00:03:00",null,0.20699999999999999,"off-line for BW"]
["2016-02-21T00:04:00"]
["2016-02-21T00:05:00"]
["2016-02-21T00:06:00"]
["2016-02-21T00:07:00"]
["2016-02-21T00:08:00"]
["2016-02-21T00:09:00"]
["2016-02-21T00:10:00"]
["2016-02-21T00:11:00"]
["2016-02-21T00:12:00"]
["2016-02-21T00:13:00"]
["2016-02-21T00:14:00"]
["2016-02-21T00:15:00"]
["2016-02-21T00:16:00"]
["2016-02-21T00:17:00"]
["2016-02-21T00:18:00"]
["2016-02-21T00:19:00"]
["2016-02-21T00:20:00"]
["2016-02-21T00:21:00"]
["2016-02-21T00:22:00"]
["2016-02-21T00:23:00"]
["2016-02-21T00:24:00"]
["2016-02-21T00:25:00"]
["2016-02-21T00:26:00"]
["2016-02-21T00:27:00"]
["2016-02-21T00:28:00"]
["2016-02-21T00:29:00"]
["2016-02-21T00:30:00"]
["2016-02-21T00:31:00"]
["2016-02-21T00:32:00"]
["2016-02-21T00:33:00"]
["2016-02-21T00:34:00"]
["2016-02-21T00:35:00"]
["2016-02-21T00:36:00"]
["2016-02-21T00:37:00"]
["2016-02-21T00:38:00"]
["2016-02-21T00:39:00"]
["2016-02-21T00:40:00"]
["2016-02-21T00:41:00"]
[{"$f":"+A2203+1/1440","v":"2016-02-21T00:42:00"}]
["2016-02-21T00:43:00"]
["2016-02-21T00:44:00"]
["2016-02-21T00:45:00"]
["2016-02-21T00:46:00"]
["2016-02-21T00:47:00"]
["2016-02-21T00:48:00"]
["2016-02-21T00:49:00"]
["2016-02-21T00:50:00"]
["2016-02-21T00:51:00"]
["2016-02-21T00:52:00"]
["2016-02-21T00:53:00"]
["2016-02-21T00:54:00"]
["2016-02-21T00:55:00"]
["2016-02-21T00:56:00"]
["2016-02-21T00:57:00"]
["2016-02-21T00:58:00"]
["2016-02-21T00:59:00"]
["2016-02-21T01:00:00"]

{"sheet":"Sheet1","index":5,"n_rows":0,"n_cols":0,"rows_kept":0,"cut":false,"hidden":false,"merged":[]}