{"text_format":"1","workbook":"xlsx","n_sheets":3,"sheets":["Instructions","PPMWD - PTPAD","Data"],"not_rendered":{"charts":0,"images":1,"macros":1,"external_links":1,"defined_names":0,"comments":0,"pivot_tables":0},"unopened":[],"bounds":{"document_bytes":16777216,"sheet_cells":100000,"rows_first":2000,"rows_last":500,"rows_between":2000,"halvings":0,"cell_chars":16384,"cell_head_chars":4096},"cells_cut":0,"cells_raw":0,"read":"whole","date_system":"1900"}

{"sheet":"Instructions","index":0,"n_rows":20,"n_cols":2,"rows_kept":20,"cut":false,"hidden":false,"merged":[[0,0,4,7],[5,0,10,7],[11,0,11,7],[19,1,19,7],[12,0,12,7],[13,0,13,7],[14,0,14,7],[15,0,15,7],[16,1,16,7],[17,1,17,7]]}
["Palo Pinto MWD No. 1 - CA 12-4031 & P 5447\nPass Through Plan Accounting Document"]
[]
[]
[]
[]
["This document contains the methodology described in the PTP for Palo Pinto County MWD No. 1 for passing through water that its water supply system is not entitled to impound under CA 12-4031 and Permit 5447 and the January 15, 2013 Order suspending impound for rights junior to February 14, 1942. The following are instructions that can be used to complete the PTPAD."]
[]
[]
[]
[]
[]
["The PTPAD is set up for daily accounting of reservoir operations."]
["The PTPAD spreadsheet contains Excel macros that must be enabled to work properly."]
["Hyperlinks are added to the certain column headings where that data can be obtained. (Daily mean suggested value)"]
["The District's system can only divert water associated with municipal use on the same day as when the inflow arrives in the reservoir.  Unless the flow at Brazos River at Glen Rose is above 108 then the District can not refill water from inflows in any of its reservoirs."]
["The channel dam is full at 748.0 ft-msl."]
[null,"These cells indicate that a user entered value is required."]
[null,"These cells indicate a calculation is being performed in the spreadsheet, no user action required."]
[null,"These cells indicate that a user entered value is required which is specific to releases to meet pass throughs."]
[null,"These cells indicate a cumulative calculation and provide a check on the accuracy of the PTPAD"]
{"$rows_left_out":1}
{"sheet":"PPMWD - PTPAD","index":1,"n_rows":354,"n_cols":25,"rows_kept":354,"cut":false,"hidden":false,"merged":[]}
[null,"http://waterdata.usgs.gov/tx/nwis/dv/?site_no=08090300&agency_cd=USGS&referred_module=sw"]
["Date","Lake Palo Pinto Lake Level","Brazos River at Glen Rose  Stream flow","Precipitation at Lake Palo Pinto","Water Released from Lake Palo Pinto for Water Supply","Palo Pinto Channel Dam Lake Level ","Hilltop Reservoir Lake Level","Precipitation at Hilltop Reservoir","Water Discharged into Hilltop Reservoir from Channel Dam","Water Diverted from Hilltop Reservoir to WTP","Spills at the Channel Dam from Lake Palo Pinto Releases","Lake Palo Pinto Storage","Health and Public Safety Trigger","Calculated Lake Palo Pinto Inflows from Previous Day","Hilltop Reservoir Storage","Calculated Hilltop Reservoir Inflows from Previous Day","Total Combined System Inflows Subject to Pass Through","Pass Through Released from Lake Palo Pinto","Pass Through Released from Lake Mineral Wells","Pass Through Released from Possum Kingdom","Spills at the Channel Dam from Lake Palo Pinto Releases applied to meet Pass Throughs","Cumulative Non-Diverted Water Supply Releases Available for Meeting Pass Throughs ","Cumulative Inflows","Cumulative Inflows Passed","Balance"]
["mm/dd/yy","ft-msl","cfs","inches","acft","ft-msl","ft-msl","inches","acft","acft","acft","acft","logical","acft","acft","acft","acft","acft","acft","acft","acft","acft","acft","acft","acft"]
["2013-01-15",862.22,28,0,16,748,1078,0,16,16,{"$f":"IF(ISBLANK(J4),\"\",E4-I4)","v":0},{"$f":"IF(B4=\"\",\"\",interp(B4,Data!$B$5:$B$464,Data!$D$5:$D$464))","v":16880.139283746557},{"$f":"IF(ISERROR(L4/Data!$D$464),\"\",IF(L4/Data!$D$464<=0.4,\"Yes - No Passthroughs\",\"No - Relase Inflows\"))","v":"No - Relase Inflows"},"-",{"$f":"IF(G4=\"\",\"\",interp(G4,Data!$F$5:$F$286,Data!$H$5:$H$286))","v":904.89999999588611},"-","-",null,null,null,null,{"$f":"K4","v":0},"-","-","-"]
["2013-01-16",862.21,28,0,16,748,1078,0,16,16,{"$f":"IF(ISBLANK(J5),\"\",E5-I5)","v":0},{"$f":"IF(B5=\"\",\"\",interp(B5,Data!$B$5:$B$464,Data!$D$5:$D$464))","v":16862.018585858586},{"$f":"IF(ISERROR(L5/Data!$D$464),\"\",IF(L5/Data!$D$464<=0.4,\"Yes - No Passthroughs\",\"No - Relase Inflows\"))","v":"No - Relase Inflows"},{"$f":"IF(ISERROR(IF((L5-L4-(D5/12*[1]!interp(B5,Data!$B$5:$B$464,Data!$C$5:$C$464))+E5-R5)<0,0,(L5-L4-(D5/12*[1]!interp(B5,Data!$B$5:$B$464,Data!$C$5:$C$464))+E5-R5))),\"\",IF((L5-L4-(D5/12*[1]!interp(B5,Data!$B$5:$B$464,Data!$C$5:$C$464))+E5-R5)<0,0,(L5-L4-(D5/12*[1]!interp(B5,Data!$B$5:$B$464,Data!$C$5:$C$464))+E5-R5)))","v":""},{"$f":"IF(G5=\"\",\"\",interp(G5,Data!$F$5:$F$286,Data!$H$5:$H$286))","v":904.89999999588611},{"$f":"IF(O5=\"\",\"\",IF(O5-O4-interp(G5,Data!$F$5:$F$286,Data!$G$5:$G$286)*H5/12-I5+J5<0,0,O5-O4-interp(G5,Data!$F$5:$F$286,Data!$G$5:$G$286)*H5/12-I5+J5))","v":0},{"$f":"IF(N5=\"\",\"\",N5+P5)","v":""},null,null,null,null,{"$f":"IF(ISERROR(K5+V4-U5),\"\",K5+V4-U5)","v":0},{"$f":"Q5","v":""},{"$f":"SUM(R5:U5)","v":0},{"$f":"IF(W5=\"\",\"\",IF(W5-X5<0,0,W5-X5))","v":""}]
["2013-01-17",862.19,27,0,16,748,1078,0,16,16,0,{"$f":"IF(B6=\"\",\"\",interp(B6,Data!$B$5:$B$464,Data!$D$5:$D$464))","v":16825.875629017468},{"$f":"IF(ISERROR(L6/Data!$D$464),\"\",IF(L6/Data!$D$464<=0.4,\"Yes - No Passthroughs\",\"No - Relase Inflows\"))","v":"No - Relase Inflows"},{"$f":"IF(ISERROR(IF((L6-L5-(D6/12*[1]!interp(B6,Data!$B$5:$B$464,Data!$C$5:$C$464))+E6-R6)<0,0,(L6-L5-(D6/12*[1]!interp(B6,Data!$B$5:$B$464,Data!$C$5:$C$464))+E6-R6))),\"\",IF((L6-L5-(D6/12*[1]!interp(B6,Data!$B$5:$B$464,Data!$C$5:$C$464))+E6-R6)<0,0,(L6-L5-(D6/12*[1]!interp(B6,Data!$B$5:$B$464,Data!$C$5:$C$464))+E6-R6)))","v":""},{"$f":"IF(G6=\"\",\"\",interp(G6,Data!$F$5:$F$286,Data!$H$5:$H$286))","v":904.89999999588611},{"$f":"IF(O6=\"\",\"\",IF(O6-O5-interp(G6,Data!$F$5:$F$286,Data!$G$5:$G$286)*H6/12-I6+J6<0,0,O6-O5-interp(G6,Data!$F$5:$F$286,Data!$G$5:$G$286)*H6/12-I6+J6))","v":0},{"$f":"IF(N6=\"\",\"\",N6+P6)","v":""},null,null,null,null,0,{"$f":"IF(Q6=\"\",\"\",Q6+W5)","v":""},{"$f":"IF(W6=\"\",\"\",X5+SUM(R6:U6))","v":""},{"$f":"IF(W6=\"\",\"\",IF(W6-X6<0,0,W6-X6))","v":""}]
["2013-01-18",862.18,27,0,16,748,1078,0,16,16,0,{"$f":"IF(B7=\"\",\"\",interp(B7,Data!$B$5:$B$464,Data!$D$5:$D$464))","v":16807.853370064116},{"$f":"IF(ISERROR(L7/Data!$D$464),\"\",IF(L7/Data!$D$464<=0.4,\"Yes - No Passthroughs\",\"No - Relase Inflows\"))","v":"No - Relase Inflows"},{"$f":"IF(ISERROR(IF((L7-L6-(D7/12*[1]!interp(B7,Data!$B$5:$B$464,Data!$C$5:$C$464))+E7-R7)<0,0,(L7-L6-(D7/12*[1]!interp(B7,Data!$B$5:$B$464,Data!$C$5:$C$464))+E7-R7))),\"\",IF((L7-L6-(D7/12*[1]!interp(B7,Data!$B$5:$B$464,Data!$C$5:$C$464))+E7-R7)<0,0,(L7-L6-(D7/12*[1]!interp(B7,Data!$B$5:$B$464,Data!$C$5:$C$464))+E7-R7)))","v":""},{"$f":"IF(G7=\"\",\"\",interp(G7,Data!$F$5:$F$286,Data!$H$5:$H$286))","v":904.89999999588611},{"$f":"IF(O7=\"\",\"\",IF(O7-O6-interp(G7,Data!$F$5:$F$286,Data!$G$5:$G$286)*H7/12-I7+J7<0,0,O7-O6-interp(G7,Data!$F$5:$F$286,Data!$G$5:$G$286)*H7/12-I7+J7))","v":0},"",null,null,null,null,0,{"$f":"IF(Q7=\"\",\"\",Q7+W6)","v":""},{"$f":"IF(W7=\"\",\"\",X6+SUM(R7:U7))","v":""},""]
["2013-01-19",862.17,27,0,16,748,1078,0,16,16,0,{"$f":"IF(B8=\"\",\"\",interp(B8,Data!$B$5:$B$464,Data!$D$5:$D$464))","v":16789.831111110965},{"$f":"IF(ISERROR(L8/Data!$D$464),\"\",IF(L8/Data!$D$464<=0.4,\"Yes - No Passthroughs\",\"No - Relase Inflows\"))","v":"No - Relase Inflows"},{"$f":"IF(ISERROR(IF((L8-L7-(D8/12*[1]!interp(B8,Data!$B$5:$B$464,Data!$C$5:$C$464))+E8-R8)<0,0,(L8-L7-(D8/12*[1]!interp(B8,Data!$B$5:$B$464,Data!$C$5:$C$464))+E8-R8))),\"\",IF((L8-L7-(D8/12*[1]!interp(B8,Data!$B$5:$B$464,Data!$C$5:$C$464))+E8-R8)<0,0,(L8-L7-(D8/12*[1]!interp(B8,Data!$B$5:$B$464,Data!$C$5:$C$464))+E8-R8)))","v":""},{"$f":"IF(G8=\"\",\"\",interp(G8,Data!$F$5:$F$286,Data!$H$5:$H$286))","v":904.89999999588611},{"$f":"IF(O8=\"\",\"\",IF(O8-O7-interp(G8,Data!$F$5:$F$286,Data!$G$5:$G$286)*H8/12-I8+J8<0,0,O8-O7-interp(G8,Data!$F$5:$F$286,Data!$G$5:$G$286)*H8/12-I8+J8))","v":0},"",null,null,null,null,0,"","",""]
["2013-01-20",862.16,26,0,16,748,1078,0,16,16,0,{"$f":"IF(B9=\"\",\"\",interp(B9,Data!$B$5:$B$464,Data!$D$5:$D$464))","v":16771.808852157821},{"$f":"IF(ISERROR(L9/Data!$D$464),\"\",IF(L9/Data!$D$464<=0.4,\"Yes - No Passthroughs\",\"No - Relase Inflows\"))","v":"No - Relase Inflows"},{"$f":"IF(ISERROR(IF((L9-L8-(D9/12*[1]!interp(B9,Data!$B$5:$B$464,Data!$C$5:$C$464))+E9-R9)<0,0,(L9-L8-(D9/12*[1]!interp(B9,Data!$B$5:$B$464,Data!$C$5:$C$464))+E9-R9))),\"\",IF((L9-L8-(D9/12*[1]!interp(B9,Data!$B$5:$B$464,Data!$C$5:$C$464))+E9-R9)<0,0,(L9-L8-(D9/12*[1]!interp(B9,Data!$B$5:$B$464,Data!$C$5:$C$464))+E9-R9)))","v":""},{"$f":"IF(G9=\"\",\"\",interp(G9,Data!$F$5:$F$286,Data!$H$5:$H$286))","v":904.89999999588611},{"$f":"IF(O9=\"\",\"\",IF(O9-O8-interp(G9,Data!$F$5:$F$286,Data!$G$5:$G$286)*H9/12-I9+J9<0,0,O9-O8-interp(G9,Data!$F$5:$F$286,Data!$G$5:$G$286)*H9/12-I9+J9))","v":0},"",null,null,null,null,0,"","",""]
["2013-01-21",862.15,25,0,17,748,1078,0,16,16,1,{"$f":"IF(B10=\"\",\"\",interp(B10,Data!$B$5:$B$464,Data!$D$5:$D$464))","v":16753.78659320467},{"$f":"IF(ISERROR(L10/Data!$D$464),\"\",IF(L10/Data!$D$464<=0.4,\"Yes - No Passthroughs\",\"No - Relase Inflows\"))","v":"No - Relase Inflows"},{"$f":"IF(ISERROR(IF((L10-L9-(D10/12*[1]!interp(B10,Data!$B$5:$B$464,Data!$C$5:$C$464))+E10-R10)<0,0,(L10-L9-(D10/12*[1]!interp(B10,Data!$B$5:$B$464,Data!$C$5:$C$464))+E10-R10))),\"\",IF((L10-L9-(D10/12*[1]!interp(B10,Data!$B$5:$B$464,Data!$C$5:$C$464))+E10-R10)<0,0,(L10-L9-(D10/12*[1]!interp(B10,Data!$B$5:$B$464,Data!$C$5:$C$464))+E10-R10)))","v":""},{"$f":"IF(G10=\"\",\"\",interp(G10,Data!$F$5:$F$286,Data!$H$5:$H$286))","v":904.89999999588611},{"$f":"IF(O10=\"\",\"\",IF(O10-O9-interp(G10,Data!$F$5:$F$286,Data!$G$5:$G$286)*H10/12-I10+J10<0,0,O10-O9-interp(G10,Data!$F$5:$F$286,Data!$G$5:$G$286)*H10/12-I10+J10))","v":0},"",null,null,null,null,1,"","",""]
["2013-01-22",862.14,28,0,17,748,1078,0,16,16,1,{"$f":"IF(B11=\"\",\"\",interp(B11,Data!$B$5:$B$464,Data!$D$5:$D$464))","v":16735.764334251526},{"$f":"IF(ISERROR(L11/Data!$D$464),\"\",IF(L11/Data!$D$464<=0.4,\"Yes - No Passthroughs\",\"No - Relase Inflows\"))","v":"No - Relase Inflows"},{"$f":"IF(ISERROR(IF((L11-L10-(D11/12*[1]!interp(B11,Data!$B$5:$B$464,Data!$C$5:$C$464))+E11-R11)<0,0,(L11-L10-(D11/12*[1]!interp(B11,Data!$B$5:$B$464,Data!$C$5:$C$464))+E11-R11))),\"\",IF((L11-L10-(D11/12*[1]!interp(B11,Data!$B$5:$B$464,Data!$C$5:$C$464))+E11-R11)<0,0,(L11-L10-(D11/12*[1]!interp(B11,Data!$B$5:$B$464,Data!$C$5:$C$464))+E11-R11)))","v":""},{"$f":"IF(G11=\"\",\"\",interp(G11,Data!$F$5:$F$286,Data!$H$5:$H$286))","v":904.89999999588611},{"$f":"IF(O11=\"\",\"\",IF(O11-O10-interp(G11,Data!$F$5:$F$286,Data!$G$5:$G$286)*H11/12-I11+J11<0,0,O11-O10-interp(G11,Data!$F$5:$F$286,Data!$G$5:$G$286)*H11/12-I11+J11))","v":0},"",null,null,null,null,2,"","",""]
["2013-01-23",null,null,null,null,null,null,null,null,null,"",{"$f":"IF(B12=\"\",\"\",interp(B12,Data!$B$5:$B$464,Data!$D$5:$D$464))","v":""},{"$f":"IF(ISERROR(L12/Data!$D$464),\"\",IF(L12/Data!$D$464<=0.4,\"Yes - No Passthroughs\",\"No - Relase Inflows\"))","v":""},{"$f":"IF(ISERROR(IF((L12-L11-(D12/12*[1]!interp(B12,Data!$B$5:$B$464,Data!$C$5:$C$464))+E12-R12)<0,0,(L12-L11-(D12/12*[1]!interp(B12,Data!$B$5:$B$464,Data!$C$5:$C$464))+E12-R12))),\"\",IF((L12-L11-(D12/12*[1]!interp(B12,Data!$B$5:$B$464,Data!$C$5:$C$464))+E12-R12)<0,0,(L12-L11-(D12/12*[1]!interp(B12,Data!$B$5:$B$464,Data!$C$5:$C$464))+E12-R12)))","v":""},{"$f":"IF(G12=\"\",\"\",interp(G12,Data!$F$5:$F$286,Data!$H$5:$H$286))","v":""},{"$f":"IF(O12=\"\",\"\",IF(O12-O11-interp(G12,Data!$F$5:$F$286,Data!$G$5:$G$286)*H12/12-I12+J12<0,0,O12-O11-interp(G12,Data!$F$5:$F$286,Data!$G$5:$G$286)*H12/12-I12+J12))","v":""},"",null,null,null,null,{"$f":"IF(ISERROR(K12+V11-U12),\"\",K12+V11-U12)","v":""},"","",""]
["2013-01-24",null,null,null,null,null,null,null,null,null,"",{"$f":"IF(B13=\"\",\"\",interp(B13,Data!$B$5:$B$464,Data!$D$5:$D$464))","v":""},{"$f":"IF(ISERROR(L13/Data!$D$464),\"\",IF(L13/Data!$D$464<=0.4,\"Yes - No Passthroughs\",\"No - Relase Inflows\"))","v":""},{"$f":"IF(ISERROR(IF((L13-L12-(D13/12*[1]!interp(B13,Data!$B$5:$B$464,Data!$C$5:$C$464))+E13-R13)<0,0,(L13-L12-(D13/12*[1]!interp(B13,Data!$B$5:$B$464,Data!$C$5:$C$464))+E13-R13))),\"\",IF((L13-L12-(D13/12*[1]!interp(B13,Data!$B$5:$B$464,Data!$C$5:$C$464))+E13-R13)<0,0,(L13-L12-(D13/12*[1]!interp(B13,Data!$B$5:$B$464,Data!$C$5:$C$464))+E13-R13)))","v":""},{"$f":"IF(G13=\"\",\"\",interp(G13,Data!$F$5:$F$286,Data!$H$5:$H$286))","v":""},{"$f":"IF(O13=\"\",\"\",IF(O13-O12-interp(G13,Data!$F$5:$F$286,Data!$G$5:$G$286)*H13/12-I13+J13<0,0,O13-O12-interp(G13,Data!$F$5:$F$286,Data!$G$5:$G$286)*H13/12-I13+J13))","v":""},"",null,null,null,null,{"$f":"IF(ISERROR(K13+V12-U13),\"\",K13+V12-U13)","v":""},"","",""]
["2013-01-25",null,null,null,null,null,null,null,null,null,"",{"$f":"IF(B14=\"\",\"\",interp(B14,Data!$B$5:$B$464,Data!$D$5:$D$464))","v":""},{"$f":"IF(ISERROR(L14/Data!$D$464),\"\",IF(L14/Data!$D$464<=0.4,\"Yes - No Passthroughs\",\"No - Relase Inflows\"))","v":""},{"$f":"IF(ISERROR(IF((L14-L13-(D14/12*[1]!interp(B14,Data!$B$5:$B$464,Data!$C$5:$C$464))+E14-R14)<0,0,(L14-L13-(D14/12*[1]!interp(B14,Data!$B$5:$B$464,Data!$C$5:$C$464))+E14-R14))),\"\",IF((L14-L13-(D14/12*[1]!interp(B14,Data!$B$5:$B$464,Data!$C$5:$C$464))+E14-R14)<0,0,(L14-L13-(D14/12*[1]!interp(B14,Data!$B$5:$B$464,Data!$C$5:$C$464))+E14-R14)))","v":""},{"$f":"IF(G14=\"\",\"\",interp(G14,Data!$F$5:$F$286,Data!$H$5:$H$286))","v":""},{"$f":"IF(O14=\"\",\"\",IF(O14-O13-interp(G14,Data!$F$5:$F$286,Data!$G$5:$G$286)*H14/12-I14+J14<0,0,O14-O13-interp(G14,Data!$F$5:$F$286,Data!$G$5:$G$286)*H14/12-I14+J14))","v":""},"",null,null,null,null,"","","",""]
["2013-01-26",null,null,null,null,null,null,null,null,null,"",{"$f":"IF(B15=\"\",\"\",interp(B15,Data!$B$5:$B$464,Data!$D$5:$D$464))","v":""},{"$f":"IF(ISERROR(L15/Data!$D$464),\"\",IF(L15/Data!$D$464<=0.4,\"Yes - No Passthroughs\",\"No - Relase Inflows\"))","v":""},{"$f":"IF(ISERROR(IF((L15-L14-(D15/12*[1]!interp(B15,Data!$B$5:$B$464,Data!$C$5:$C$464))+E15-R15)<0,0,(L15-L14-(D15/12*[1]!interp(B15,Data!$B$5:$B$464,Data!$C$5:$C$464))+E15-R15))),\"\",IF((L15-L14-(D15/12*[1]!interp(B15,Data!$B$5:$B$464,Data!$C$5:$C$464))+E15-R15)<0,0,(L15-L14-(D15/12*[1]!interp(B15,Data!$B$5:$B$464,Data!$C$5:$C$464))+E15-R15)))","v":""},{"$f":"IF(G15=\"\",\"\",interp(G15,Data!$F$5:$F$286,Data!$H$5:$H$286))","v":""},{"$f":"IF(O15=\"\",\"\",IF(O15-O14-interp(G15,Data!$F$5:$F$286,Data!$G$5:$G$286)*H15/12-I15+J15<0,0,O15-O14-interp(G15,Data!$F$5:$F$286,Data!$G$5:$G$286)*H15/12-I15+J15))","v":""},"",null,null,null,null,"","","",""]
["2013-01-27",null,null,null,null,null,null,null,null,null,"",{"$f":"IF(B16=\"\",\"\",interp(B16,Data!$B$5:$B$464,Data!$D$5:$D$464))","v":""},{"$f":"IF(ISERROR(L16/Data!$D$464),\"\",IF(L16/Data!$D$464<=0.4,\"Yes - No Passthroughs\",\"No - Relase Inflows\"))","v":""},{"$f":"IF(ISERROR(IF((L16-L15-(D16/12*[1]!interp(B16,Data!$B$5:$B$464,Data!$C$5:$C$464))+E16-R16)<0,0,(L16-L15-(D16/12*[1]!interp(B16,Data!$B$5:$B$464,Data!$C$5:$C$464))+E16-R16))),\"\",IF((L16-L15-(D16/12*[1]!interp(B16,Data!$B$5:$B$464,Data!$C$5:$C$464))+E16-R16)<0,0,(L16-L15-(D16/12*[1]!interp(B16,Data!$B$5:$B$464,Data!$C$5:$C$464))+E16-R16)))","v":""},{"$f":"IF(G16=\"\",\"\",interp(G16,Data!$F$5:$F$286,Data!$H$5:$H$286))","v":""},{"$f":"IF(O16=\"\",\"\",IF(O16-O15-interp(G16,Data!$F$5:$F$286,Data!$G$5:$G$286)*H16/12-I16+J16<0,0,O16-O15-interp(G16,Data!$F$5:$F$286,Data!$G$5:$G$286)*H16/12-I16+J16))","v":""},"",null,null,null,null,"","","",""]
["2013-01-28",null,null,null,null,null,null,null,null,null,"",{"$f":"IF(B17=\"\",\"\",interp(B17,Data!$B$5:$B$464,Data!$D$5:$D$464))","v":""},{"$f":"IF(ISERROR(L17/Data!$D$464),\"\",IF(L17/Data!$D$464<=0.4,\"Yes - No Passthroughs\",\"No - Relase Inflows\"))","v":""},{"$f":"IF(ISERROR(IF((L17-L16-(D17/12*[1]!interp(B17,Data!$B$5:$B$464,Data!$C$5:$C$464))+E17-R17)<0,0,(L17-L16-(D17/12*[1]!interp(B17,Data!$B$5:$B$464,Data!$C$5:$C$464))+E17-R17))),\"\",IF((L17-L16-(D17/12*[1]!interp(B17,Data!$B$5:$B$464,Data!$C$5:$C$464))+E17-R17)<0,0,(L17-L16-(D17/12*[1]!interp(B17,Data!$B$5:$B$464,Data!$C$5:$C$464))+E17-R17)))","v":""},{"$f":"IF(G17=\"\",\"\",interp(G17,Data!$F$5:$F$286,Data!$H$5:$H$286))","v":""},{"$f":"IF(O17=\"\",\"\",IF(O17-O16-interp(G17,Data!$F$5:$F$286,Data!$G$5:$G$286)*H17/12-I17+J17<0,0,O17-O16-interp(G17,Data!$F$5:$F$286,Data!$G$5:$G$286)*H17/12-I17+J17))","v":""},"",null,null,null,null,"","","",""]
["2013-01-29",null,null,null,null,null,null,null,null,null,"",{"$f":"IF(B18=\"\",\"\",interp(B18,Data!$B$5:$B$464,Data!$D$5:$D$464))","v":""},{"$f":"IF(ISERROR(L18/Data!$D$464),\"\",IF(L18/Data!$D$464<=0.4,\"Yes - No Passthroughs\",\"No - Relase Inflows\"))","v":""},{"$f":"IF(ISERROR(IF((L18-L17-(D18/12*[1]!interp(B18,Data!$B$5:$B$464,Data!$C$5:$C$464))+E18-R18)<0,0,(L18-L17-(D18/12*[1]!interp(B18,Data!$B$5:$B$464,Data!$C$5:$C$464))+E18-R18))),\"\",IF((L18-L17-(D18/12*[1]!interp(B18,Data!$B$5:$B$464,Data!$C$5:$C$464))+E18-R18)<0,0,(L18-L17-(D18/12*[1]!interp(B18,Data!$B$5:$B$464,Data!$C$5:$C$464))+E18-R18)))","v":""},{"$f":"IF(G18=\"\",\"\",interp(G18,Data!$F$5:$F$286,Data!$H$5:$H$286))","v":""},{"$f":"IF(O18=\"\",\"\",IF(O18-O17-interp(G18,Data!$F$5:$F$286,Data!$G$5:$G$286)*H18/12-I18+J18<0,0,O18-O17-interp(G18,Data!$F$5:$F$286,Data!$G$5:$G$286)*H18/12-I18+J18))","v":""},"",null,null,null,null,"","","",""]
["2013-01-30",null,null,null,null,null,null,null,null,null,"",{"$f":"IF(B19=\"\",\"\",interp(B19,Data!$B$5:$B$464,Data!$D$5:$D$464))","v":""},{"$f":"IF(ISERROR(L19/Data!$D$464),\"\",IF(L19/Data!$D$464<=0.4,\"Yes - No Passthroughs\",\"No - Relase Inflows\"))","v":""},{"$f":"IF(ISERROR(IF((L19-L18-(D19/12*[1]!interp(B19,Data!$B$5:$B$464,Data!$C$5:$C$464))+E19-R19)<0,0,(L19-L18-(D19/12*[1]!interp(B19,Data!$B$5:$B$464,Data!$C$5:$C$464))+E19-R19))),\"\",IF((L19-L18-(D19/12*[1]!interp(B19,Data!$B$5:$B$464,Data!$C$5:$C$464))+E19-R19)<0,0,(L19-L18-(D19/12*[1]!interp(B19,Data!$B$5:$B$464,Data!$C$5:$C$464))+E19-R19)))","v":""},{"$f":"IF(G19=\"\",\"\",interp(G19,Data!$F$5:$F$286,Data!$H$5:$H$286))","v":""},{"$f":"IF(O19=\"\",\"\",IF(O19-O18-interp(G19,Data!$F$5:$F$286,Data!$G$5:$G$286)*H19/12-I19+J19<0,0,O19-O18-interp(G19,Data!$F$5:$F$286,Data!$G$5:$G$286)*H19/12-I19+J19))","v":""},"",null,null,null,null,"","","",""]
["2013-01-31",null,null,null,null,null,null,null,null,null,"",{"$f":"IF(B20=\"\",\"\",interp(B20,Data!$B$5:$B$464,Data!$D$5:$D$464))","v":""},{"$f":"IF(ISERROR(L20/Data!$D$464),\"\",IF(L20/Data!$D$464<=0.4,\"Yes - No Passthroughs\",\"No - Relase Inflows\"))","v":""},{"$f":"IF(ISERROR(IF((L20-L19-(D20/12*[1]!interp(B20,Data!$B$5:$B$464,Data!$C$5:$C$464))+E20-R20)<0,0,(L20-L19-(D20/12*[1]!interp(B20,Data!$B$5:$B$464,Data!$C$5:$C$464))+E20-R20))),\"\",IF((L20-L19-(D20/12*[1]!interp(B20,Data!$B$5:$B$464,Data!$C$5:$C$464))+E20-R20)<0,0,(L20-L19-(D20/12*[1]!interp(B20,Data!$B$5:$B$464,Data!$C$5:$C$464))+E20-R20)))","v":""},{"$f":"IF(G20=\"\",\"\",interp(G20,Data!$F$5:$F$286,Data!$H$5:$H$286))","v":""},{"$f":"IF(O20=\"\",\"\",IF(O20-O19-interp(G20,Data!$F$5:$F$286,Data!$G$5:$G$286)*H20/12-I20+J20<0,0,O20-O19-interp(G20,Data!$F$5:$F$286,Data!$G$5:$G$286)*H20/12-I20+J20))","v":""},"",null,null,null,null,"","","",""]
{"$rows_left_out":335}
{"sheet":"Data","index":2,"n_rows":464,"n_cols":12,"rows_kept":464,"cut":false,"hidden":false,"merged":[[3,10,4,10],[3,11,4,11]]}
[]
[null,"Lake Palo Pinto -  Current EAC from the TWDB",null,null,null,null,null,null,null,null,"Lake Palo Pinto Discharge Table"]
[null,"Elevation","Area","Capacity",null,null,null,null,null,null,null,1]
[null,"ft-msl","acres","acft",null,"Elevation","Area","Capacity",null,null,"Palo Pinto - WSEL","Discharge Rate - cfs"]
[null,821.4,2.773220844811754E-4,8.9141414141414151E-7,null,1052,1.2,0.9]
[null,821.5,0.11453811455463729,3.2353057851239671E-3,null,1052.0999999999999,1.25,1.0900000000000001,null,null,867.3,16.755119236240013]
[null,821.6,0.59209589692378328,3.5832958448117534E-2,null,1052.2,1.31,1.27,null,null,866.3,16.520002954636169]
[null,821.7,1.1547161960514234,0.12342414967860423,null,1052.3,1.36,1.46,null,null,865.3,16.278481323241731]
[null,821.8,1.6472302929292928,0.26636269031221305,null,1052.4000000000001,1.42,1.64,null,null,864.3,16.032699952731427]
[null,821.9,1.9621143969237831,0.44682747222222224,null,1052.5,1.48,1.83,null,null,863.3,15.783200141344622]
[null,822,2.3128954674012854,0.66003092906336092,null,1052.5999999999999,1.53,2.02,null,null,862.3,15.525664450342802]
[null,822.1,2.7446779586776859,0.91341979820936636,null,1052.7,1.59,2.2000000000000002,null,null,861.3,15.267343730023875]
[null,822.2,3.0573293303489444,1.2045022311753901,null,1052.8,1.64,2.39,null,null,860.3,15.013223423919738]
[null,822.3,3.2941406251147844,1.5223004189623508,null,1052.9000000000001,1.7,2.57,null,null,859.3,14.741878899573278]
[null,822.4,3.4996732238292014,1.8623326662075299,null,1053,1.75,2.76,null,null,858.3,14.474535762710881]
[null,822.5,3.6878604942607898,2.2217221935261708,null,1053.0999999999999,1.8,2.94,null,null,857.3,14.202320502389838]
[null,822.6,3.8735680670339763,2.5996414786501378,null,1053.2,1.86,3.13,null,null,856.3,13.922547920674603]
[null,822.7,4.058924471992654,2.9964429451331496,null,1053.3,1.91,3.31,null,null,855.3,13.647130024335643]
[null,822.8,4.2567407024793384,3.4119077853535353,null,1053.4000000000001,1.97,3.5,null,null,854.3,13.357643883650743]
[null,822.9,4.4449975608356294,3.8476340105601468,null,1053.5,2.0299999999999998,3.68,null,null,853.3,13.062897136117817]
{"$rows_left_out":444}